river-dev mailing list archives

Site index · List index
Message view « Date » · « Thread »
Top « Date » · « Thread »
From Apache Jenkins Server <jenk...@builds.apache.org>
Subject Build failed in Jenkins: River-trunk #494
Date Tue, 21 Jun 2011 13:40:15 GMT
See <https://builds.apache.org/job/River-trunk/494/changes>

Changes:

[peter_firmstone] Minor documentation updates for release.

[peter_firmstone] Minor documentation updates for release.

------------------------------------------
[...truncated 1989 lines...]
  [javadoc] Loading source files for package net.jini.jeri.connection...
  [javadoc] Loading source files for package net.jini.jeri.http...
  [javadoc] Loading source files for package net.jini.jeri.kerberos...
  [javadoc] Loading source files for package net.jini.jeri.ssl...
  [javadoc] Loading source files for package net.jini.jeri.tcp...
  [javadoc] Loading source files for package net.jini.jrmp...
  [javadoc] Loading source files for package net.jini.lease...
  [javadoc] Loading source files for package net.jini.loader...
  [javadoc] Loading source files for package net.jini.loader.pref...
  [javadoc] Loading source files for package net.jini.lookup...
  [javadoc] Loading source files for package net.jini.lookup.entry...
  [javadoc] Loading source files for package net.jini.lookup.ui...
  [javadoc] Loading source files for package net.jini.lookup.ui.attribute...
  [javadoc] Loading source files for package net.jini.lookup.ui.factory...
  [javadoc] Loading source files for package net.jini.security...
  [javadoc] Loading source files for package net.jini.security.policy...
  [javadoc] Loading source files for package net.jini.security.proxytrust...
  [javadoc] Loading source files for package net.jini.space...
  [javadoc] Loading source files for package net.jini.url.file...
  [javadoc] Loading source files for package net.jini.url.httpmd...
  [javadoc] Loading source files for package net.jini.url.https...
  [javadoc] Loading source files for package org.apache.river.config...
  [javadoc] Loading source files for package org.apache.river.config.builder...
  [javadoc] Constructing Javadoc information...
  [javadoc] /zonestorage/hudson_solaris/home/hudson/hudson-slave/workspace/River-trunk/src/com/sun/jini/phoenix/SunJrmpExporter.java:31:
warning: sun.rmi.server.UnicastServerRef is Sun proprietary API and may be removed in a future
release
  [javadoc] import sun.rmi.server.UnicastServerRef;
  [javadoc]                      ^
  [javadoc] /zonestorage/hudson_solaris/home/hudson/hudson-slave/workspace/River-trunk/src/com/sun/jini/phoenix/SunJrmpExporter.java:32:
warning: sun.rmi.transport.LiveRef is Sun proprietary API and may be removed in a future release
  [javadoc] import sun.rmi.transport.LiveRef;
  [javadoc]                         ^
  [javadoc] /zonestorage/hudson_solaris/home/hudson/hudson-slave/workspace/River-trunk/src/com/sun/jini/phoenix/SunJrmpExporter.java:115:
warning: sun.rmi.transport.LiveRef is Sun proprietary API and may be removed in a future release
  [javadoc]     UnicastServerRef getServerRef(LiveRef lref) {
  [javadoc]                                   ^
  [javadoc] /zonestorage/hudson_solaris/home/hudson/hudson-slave/workspace/River-trunk/src/com/sun/jini/phoenix/SunJrmpExporter.java:115:
warning: sun.rmi.server.UnicastServerRef is Sun proprietary API and may be removed in a future
release
  [javadoc]     UnicastServerRef getServerRef(LiveRef lref) {
  [javadoc]     ^
  [javadoc] /zonestorage/hudson_solaris/home/hudson/hudson-slave/workspace/River-trunk/src/com/sun/jini/phoenix/RegistrySunExporter.java:28:
warning: sun.rmi.server.MarshalInputStream is Sun proprietary API and may be removed in a
future release
  [javadoc] import sun.rmi.server.MarshalInputStream;
  [javadoc]                      ^
  [javadoc] /zonestorage/hudson_solaris/home/hudson/hudson-slave/workspace/River-trunk/src/com/sun/jini/phoenix/RegistrySunExporter.java:29:
warning: sun.rmi.server.UnicastServerRef is Sun proprietary API and may be removed in a future
release
  [javadoc] import sun.rmi.server.UnicastServerRef;
  [javadoc]                      ^
  [javadoc] /zonestorage/hudson_solaris/home/hudson/hudson-slave/workspace/River-trunk/src/com/sun/jini/phoenix/RegistrySunExporter.java:30:
warning: sun.rmi.transport.LiveRef is Sun proprietary API and may be removed in a future release
  [javadoc] import sun.rmi.transport.LiveRef;
  [javadoc]                         ^
  [javadoc] /zonestorage/hudson_solaris/home/hudson/hudson-slave/workspace/River-trunk/src/com/sun/jini/phoenix/RegistrySunExporter.java:61:
warning: sun.rmi.transport.LiveRef is Sun proprietary API and may be removed in a future release
  [javadoc]     UnicastServerRef getServerRef(LiveRef lref) {
  [javadoc]                                   ^
  [javadoc] /zonestorage/hudson_solaris/home/hudson/hudson-slave/workspace/River-trunk/src/com/sun/jini/phoenix/RegistrySunExporter.java:61:
warning: sun.rmi.server.UnicastServerRef is Sun proprietary API and may be removed in a future
release
  [javadoc]     UnicastServerRef getServerRef(LiveRef lref) {
  [javadoc]     ^
  [javadoc] /zonestorage/hudson_solaris/home/hudson/hudson-slave/workspace/River-trunk/src/com/sun/jini/phoenix/RegistrySunExporter.java:69:
warning: sun.rmi.server.UnicastServerRef is Sun proprietary API and may be removed in a future
release
  [javadoc]     static class BootstrapServerRef extends UnicastServerRef {
  [javadoc]                                             ^
  [javadoc] /zonestorage/hudson_solaris/home/hudson/hudson-slave/workspace/River-trunk/src/com/sun/jini/phoenix/RegistrySunExporter.java:87:
warning: sun.rmi.transport.LiveRef is Sun proprietary API and may be removed in a future release
  [javadoc] 	public BootstrapServerRef(LiveRef lref) {
  [javadoc] 	                          ^
  [javadoc] Standard Doclet version 1.6.0_22
  [javadoc] Building tree for all the packages and classes...
  [javadoc] /zonestorage/hudson_solaris/home/hudson/hudson-slave/workspace/River-trunk/src/com/sun/jini/outrigger/FastList.java:291:
warning - @return tag has no arguments.
  [javadoc] /zonestorage/hudson_solaris/home/hudson/hudson-slave/workspace/River-trunk/src/net/jini/discovery/LookupDiscoveryManager.java:118:
warning - Tag @link: can't find HANDLED in java.util.logging.Level
  [javadoc] Generating /zonestorage/hudson_solaris/home/hudson/hudson-slave/workspace/River-trunk/doc/internals/com/sun/jini/example/browser//package-summary.html...
  [javadoc] Copying file /zonestorage/hudson_solaris/home/hudson/hudson-slave/workspace/River-trunk/src/com/sun/jini/example/browser/doc-files/browser2.gif
to directory /zonestorage/hudson_solaris/home/hudson/hudson-slave/workspace/River-trunk/doc/internals/com/sun/jini/example/browser/doc-files...
  [javadoc] Copying file /zonestorage/hudson_solaris/home/hudson/hudson-slave/workspace/River-trunk/src/com/sun/jini/example/browser/doc-files/browser5.gif
to directory /zonestorage/hudson_solaris/home/hudson/hudson-slave/workspace/River-trunk/doc/internals/com/sun/jini/example/browser/doc-files...
  [javadoc] Copying file /zonestorage/hudson_solaris/home/hudson/hudson-slave/workspace/River-trunk/src/com/sun/jini/example/browser/doc-files/browser4.gif
to directory /zonestorage/hudson_solaris/home/hudson/hudson-slave/workspace/River-trunk/doc/internals/com/sun/jini/example/browser/doc-files...
  [javadoc] Copying file /zonestorage/hudson_solaris/home/hudson/hudson-slave/workspace/River-trunk/src/com/sun/jini/example/browser/doc-files/browser3.gif
to directory /zonestorage/hudson_solaris/home/hudson/hudson-slave/workspace/River-trunk/doc/internals/com/sun/jini/example/browser/doc-files...
  [javadoc] Copying file /zonestorage/hudson_solaris/home/hudson/hudson-slave/workspace/River-trunk/src/com/sun/jini/example/browser/doc-files/browser9.gif
to directory /zonestorage/hudson_solaris/home/hudson/hudson-slave/workspace/River-trunk/doc/internals/com/sun/jini/example/browser/doc-files...
  [javadoc] Copying file /zonestorage/hudson_solaris/home/hudson/hudson-slave/workspace/River-trunk/src/com/sun/jini/example/browser/doc-files/browser7.gif
to directory /zonestorage/hudson_solaris/home/hudson/hudson-slave/workspace/River-trunk/doc/internals/com/sun/jini/example/browser/doc-files...
  [javadoc] Copying file /zonestorage/hudson_solaris/home/hudson/hudson-slave/workspace/River-trunk/src/com/sun/jini/example/browser/doc-files/browser6.gif
to directory /zonestorage/hudson_solaris/home/hudson/hudson-slave/workspace/River-trunk/doc/internals/com/sun/jini/example/browser/doc-files...
  [javadoc] Copying file /zonestorage/hudson_solaris/home/hudson/hudson-slave/workspace/River-trunk/src/com/sun/jini/example/browser/doc-files/browser1.gif
to directory /zonestorage/hudson_solaris/home/hudson/hudson-slave/workspace/River-trunk/doc/internals/com/sun/jini/example/browser/doc-files...
  [javadoc] Copying file /zonestorage/hudson_solaris/home/hudson/hudson-slave/workspace/River-trunk/src/com/sun/jini/example/browser/doc-files/browser8.gif
to directory /zonestorage/hudson_solaris/home/hudson/hudson-slave/workspace/River-trunk/doc/internals/com/sun/jini/example/browser/doc-files...
  [javadoc] Generating /zonestorage/hudson_solaris/home/hudson/hudson-slave/workspace/River-trunk/doc/internals/net/jini/jeri/connection//package-summary.html...
  [javadoc] Copying file /zonestorage/hudson_solaris/home/hudson/hudson-slave/workspace/River-trunk/src/net/jini/jeri/connection/doc-files/mux.html
to directory /zonestorage/hudson_solaris/home/hudson/hudson-slave/workspace/River-trunk/doc/internals/net/jini/jeri/connection/doc-files...
  [javadoc] Building index for all the packages and classes...
  [javadoc] Building index for all classes...
  [javadoc] Generating /zonestorage/hudson_solaris/home/hudson/hudson-slave/workspace/River-trunk/doc/internals/stylesheet.css...
  [javadoc] 13 warnings
    [mkdir] Created dir: /zonestorage/hudson_solaris/home/hudson/hudson-slave/workspace/River-trunk/doc/internals/doc-files
     [copy] Copying 1 file to /zonestorage/hudson_solaris/home/hudson/hudson-slave/workspace/River-trunk/doc/internals/doc-files

river-doc:

release-doc:
      [zip] Building zip: /zonestorage/hudson_solaris/home/hudson/hudson-slave/workspace/River-trunk/dist/apache-river-2.2.0-doc.zip
      [tar] Building tar: /zonestorage/hudson_solaris/home/hudson/hudson-slave/workspace/River-trunk/dist/apache-river-2.2.0-doc.tar.gz

release:

prep-tests:
    [mkdir] Created dir: /zonestorage/hudson_solaris/home/hudson/hudson-slave/workspace/River-trunk/test/classes
    [mkdir] Created dir: /zonestorage/hudson_solaris/home/hudson/hudson-slave/workspace/River-trunk/test/results

compile-tests:
    [javac] Compiling 9 source files to /zonestorage/hudson_solaris/home/hudson/hudson-slave/workspace/River-trunk/test/classes
    [javac] Note: Some input files use unchecked or unsafe operations.
    [javac] Note: Recompile with -Xlint:unchecked for details.

test:
    [junit] Testsuite: com.sun.jini.discovery.DiscoveryConstraintsTest
    [junit] Tests run: 9, Failures: 0, Errors: 0, Time elapsed: 0.655 sec
    [junit] 
    [junit] ------------- Standard Output ---------------
    [junit] process
    [junit] chooseProtocolVersion
    [junit] checkProtocolVersion
    [junit] getConnectionDeadline
    [junit] getMulticastMaxPacketSize
    [junit] getMulticastTimeToLive
    [junit] getUnicastSocketTimeout
    [junit] getUnfulfilledConstraints
    [junit] testConstraints
    [junit] ------------- ---------------- ---------------
    [junit] Testsuite: com.sun.jini.discovery.plaintext.ClientTest
    [junit] Tests run: 2, Failures: 0, Errors: 0, Time elapsed: 0.058 sec
    [junit] 
    [junit] ------------- Standard Output ---------------
    [junit] getFormatName
    [junit] checkUnicastDiscoveryConstraints
    [junit] ------------- ---------------- ---------------
    [junit] Testsuite: com.sun.jini.discovery.ssl.ClientTest
    [junit] Tests run: 3, Failures: 0, Errors: 0, Time elapsed: 1.437 sec
    [junit] 
    [junit] ------------- Standard Output ---------------
    [junit] getFormatName
    [junit] checkUnicastDiscoveryConstraints
    [junit] checkConstraintFailClientAuth
    [junit] ------------- ---------------- ---------------
    [junit] Testsuite: com.sun.jini.jeri.internal.mux.MuxStartTimeoutTest
    [junit] Tests run: 1, Failures: 0, Errors: 0, Time elapsed: 16.191 sec
    [junit] 
    [junit] ------------- Standard Output ---------------
    [junit] Test MuxClient handshake when server non responsive
    [junit] ------------- ---------------- ---------------
    [junit] Testsuite: com.sun.jini.outrigger.FastListTest
    [junit] Tests run: 6, Failures: 0, Errors: 0, Time elapsed: 0.098 sec
    [junit] 
    [junit] Testsuite: com.sun.jini.outrigger.TxnTableTest
    [junit] Tests run: 1, Failures: 0, Errors: 0, Time elapsed: 0.984 sec
    [junit] 
    [junit] Testsuite: com.sun.jini.phoenix.LocalAccessTest
    [junit] Tests run: 5, Failures: 0, Errors: 0, Time elapsed: 0.036 sec
    [junit] 
    [junit] Testsuite: net.jini.core.event.RemoteEventTest
    [junit] Tests run: 4, Failures: 0, Errors: 0, Time elapsed: 0.024 sec
    [junit] 
    [junit] ------------- Standard Output ---------------
    [junit] getID
    [junit] getSequenceNumber
    [junit] getRegistrationObject
    [junit] test serialization
    [junit] ------------- ---------------- ---------------
    [junit] Testsuite: net.jini.security.GrantPermissionTest
    [junit] Tests run: 3, Failures: 0, Errors: 0, Time elapsed: 0.022 sec
    [junit] 
    [junit] ------------- Standard Output ---------------
    [junit] implies
    [junit] GrantPermission(java.io.FilePermission "foo", "read"; java.io.FilePermission "foo",
"write";).implies(GrantPermission(java.io.FilePermission "foo", "read,write";))
    [junit] Verify that PermissionCollection does not imply FilePermissions with "read,write"
action.
    [junit] (Grant)PermissionCollection.implies(FilePermission(foo))
    [junit] Verify that PermissionCollection implies GrantPermission for "read,write" action.
    [junit] (Grant)PermissionCollection.implies(GrantPermission(java.io.FilePermission "foo",
"read,write";))
    [junit] ------------- ---------------- ---------------

hudson-ci:

BUILD SUCCESSFUL
Total time: 9 minutes 5 seconds
Archiving artifacts
ERROR: Failed to archive artifacts: dist/*.zip
hudson.util.IOException2: java.io.IOException
	at hudson.remoting.FastPipedInputStream.read(FastPipedInputStream.java:175)
	at hudson.util.HeadBufferingStream.read(HeadBufferingStream.java:61)
	at java.io.FilterInputStream.read(FilterInputStream.java:90)
	at hudson.util.HeadBufferingStream.fillSide(HeadBufferingStream.java:83)
	at hudson.FilePath$TarCompression$2.extract(FilePath.java:538)
	at hudson.FilePath.copyRecursiveTo(FilePath.java:1565)
	at hudson.tasks.ArtifactArchiver.perform(ArtifactArchiver.java:117)
	at hudson.tasks.BuildStepMonitor$1.perform(BuildStepMonitor.java:19)
	at hudson.model.AbstractBuild$AbstractRunner.perform(AbstractBuild.java:662)
	at hudson.model.AbstractBuild$AbstractRunner.performAllBuildSteps(AbstractBuild.java:638)
	at hudson.model.AbstractBuild$AbstractRunner.performAllBuildSteps(AbstractBuild.java:616)
	at hudson.model.Build$RunnerImpl.post2(Build.java:161)
	at hudson.model.AbstractBuild$AbstractRunner.post(AbstractBuild.java:585)
	at hudson.model.Run.run(Run.java:1398)
	at hudson.model.FreeStyleBuild.run(FreeStyleBuild.java:46)
	at hudson.model.ResourceController.execute(ResourceController.java:88)
	at hudson.model.Executor.run(Executor.java:145)

	at hudson.FilePath.copyRecursiveTo(FilePath.java:1572)
	at hudson.tasks.ArtifactArchiver.perform(ArtifactArchiver.java:117)
	at hudson.tasks.BuildStepMonitor$1.perform(BuildStepMonitor.java:19)
	at hudson.model.AbstractBuild$AbstractRunner.perform(AbstractBuild.java:662)
	at hudson.model.AbstractBuild$AbstractRunner.performAllBuildSteps(AbstractBuild.java:638)
	at hudson.model.AbstractBuild$AbstractRunner.performAllBuildSteps(AbstractBuild.java:616)
	at hudson.model.Build$RunnerImpl.post2(Build.java:161)
	at hudson.model.AbstractBuild$AbstractRunner.post(AbstractBuild.java:585)
	at hudson.model.Run.run(Run.java:1398)
	at hudson.model.FreeStyleBuild.run(FreeStyleBuild.java:46)
	at hudson.model.ResourceController.execute(ResourceController.java:88)
	at hudson.model.Executor.run(Executor.java:145)
Caused by: java.util.concurrent.ExecutionException: hudson.remoting.RequestAbortedException:
java.io.StreamCorruptedException: invalid type code: 00
	at hudson.remoting.Request$1.get(Request.java:236)
	at hudson.remoting.Request$1.get(Request.java:172)
	at hudson.remoting.FutureAdapter.get(FutureAdapter.java:59)
	at hudson.FilePath.copyRecursiveTo(FilePath.java:1568)
	... 11 more
Caused by: hudson.remoting.RequestAbortedException: java.io.StreamCorruptedException: invalid
type code: 00
	at hudson.remoting.Request.abort(Request.java:257)
	at hudson.remoting.Channel.terminate(Channel.java:712)
	at hudson.remoting.Channel$ReaderThread.run(Channel.java:1042)
Caused by: java.io.StreamCorruptedException: invalid type code: 00
	at java.io.ObjectInputStream.readObject0(ObjectInputStream.java:1355)
	at java.io.ObjectInputStream.defaultReadFields(ObjectInputStream.java:1946)
	at java.io.ObjectInputStream.readSerialData(ObjectInputStream.java:1870)
	at java.io.ObjectInputStream.readOrdinaryObject(ObjectInputStream.java:1752)
	at java.io.ObjectInputStream.readObject0(ObjectInputStream.java:1328)
	at java.io.ObjectInputStream.readArray(ObjectInputStream.java:1666)
	at java.io.ObjectInputStream.readObject0(ObjectInputStream.java:1322)
	at java.io.ObjectInputStream.defaultReadFields(ObjectInputStream.java:1946)
	at java.io.ObjectInputStream.readSerialData(ObjectInputStream.java:1870)
	at java.io.ObjectInputStream.readOrdinaryObject(ObjectInputStream.java:1752)
	at java.io.ObjectInputStream.readObject0(ObjectInputStream.java:1328)
	at java.io.ObjectInputStream.defaultReadFields(ObjectInputStream.java:1946)
	at java.io.ObjectInputStream.readSerialData(ObjectInputStream.java:1870)
	at java.io.ObjectInputStream.readOrdinaryObject(ObjectInputStream.java:1752)
	at java.io.ObjectInputStream.readObject0(ObjectInputStream.java:1328)
	at java.io.ObjectInputStream.readObject(ObjectInputStream.java:350)
	at hudson.remoting.Channel$ReaderThread.run(Channel.java:1013)
Recording test results
Publishing Javadoc
ERROR: Publisher hudson.tasks.JavadocArchiver aborted due to exception
java.lang.InterruptedException
	at java.lang.Object.wait(Native Method)
	at hudson.remoting.Request$1.get(Request.java:230)
	at hudson.remoting.Request$1.get(Request.java:172)
	at hudson.remoting.FutureAdapter.get(FutureAdapter.java:59)
	at hudson.FilePath.copyRecursiveTo(FilePath.java:1568)
	at hudson.FilePath.copyRecursiveTo(FilePath.java:1473)
	at hudson.tasks.JavadocArchiver.perform(JavadocArchiver.java:98)
	at hudson.tasks.BuildStepMonitor$1.perform(BuildStepMonitor.java:19)
	at hudson.model.AbstractBuild$AbstractRunner.perform(AbstractBuild.java:662)
	at hudson.model.AbstractBuild$AbstractRunner.performAllBuildSteps(AbstractBuild.java:638)
	at hudson.model.AbstractBuild$AbstractRunner.performAllBuildSteps(AbstractBuild.java:616)
	at hudson.model.Build$RunnerImpl.post2(Build.java:161)
	at hudson.model.AbstractBuild$AbstractRunner.post(AbstractBuild.java:585)
	at hudson.model.Run.run(Run.java:1398)
	at hudson.model.FreeStyleBuild.run(FreeStyleBuild.java:46)
	at hudson.model.ResourceController.execute(ResourceController.java:88)
	at hudson.model.Executor.run(Executor.java:145)


Mime
View raw message