river-dev mailing list archives

Site index · List index
Message view « Date » · « Thread »
Top « Date » · « Thread »
From Apache Hudson Server <hud...@hudson.apache.org>
Subject Build failed in Hudson: River-QA » end2end,JDK 1.6 (latest),Ubuntu #17
Date Sun, 28 Nov 2010 23:20:43 GMT
See <https://hudson.apache.org/hudson/job/River-QA/./category=end2end,jdk=JDK%201.6%20(latest),label=Ubuntu/17/>

------------------------------------------
[...truncated 6742 lines...]
     [java] -DserverRSADN=CN=serverRSA 
     [java] -Dend2end.logArgs=boundaries,failures,finalStatistics 
     [java] -Dend2end.coverage=50 
     [java] -DserverKeytabLocation=<https://hudson.apache.org/hudson/job/River-QA/./category=end2end,jdk=JDK%201.6%20(latest),label=Ubuntu/ws/qa/harness/trust/aggregateKeytab>

     [java] -Djavax.net.ssl.keyStore=<https://hudson.apache.org/hudson/job/River-QA/./category=end2end,jdk=JDK%201.6%20(latest),label=Ubuntu/ws/qa/src/com/sun/jini/test/impl/end2end/resources/keystore>

     [java] -DclientRSA2Alias=clientRSA2 
     [java] -Djavax.net.ssl.keyStorePassword=keypass 
     [java] -DclientDSA2Alias=clientDSA2 
     [java] -Djavax.net.ssl.trustStore=<https://hudson.apache.org/hudson/job/River-QA/./category=end2end,jdk=JDK%201.6%20(latest),label=Ubuntu/ws/qa/src/com/sun/jini/test/impl/end2end/resources/keystore>

     [java] -DcodebaseDirectory=<https://hudson.apache.org/hudson/job/River-QA/./category=end2end,jdk=JDK%201.6%20(latest),label=Ubuntu/ws/qa/lib>

     [java] -Dcom.sun.jini.jsk.jars=<https://hudson.apache.org/hudson/job/River-QA/./category=end2end,jdk=JDK%201.6%20(latest),label=Ubuntu/ws/lib>

     [java] -DclientDSA2DN=CN=clientDSA2 
     [java] -Dsun.rmi.transport.switchConstraintsFloor=10 
     [java] -DclientDSA1DN=CN=clientDSA1 
     [java] -DclientKeytabLocation=<https://hudson.apache.org/hudson/job/River-QA/./category=end2end,jdk=JDK%201.6%20(latest),label=Ubuntu/ws/qa/harness/trust/aggregateKeytab>

     [java] -DclientRSA2DN=CN=clientRSA2 
     [java] -Dcom.sun.jini.test.jars=<https://hudson.apache.org/hudson/job/River-QA/./category=end2end,jdk=JDK%201.6%20(latest),label=Ubuntu/ws/qa/lib>

     [java] -DkerberosServer=qa-e2e-server@DAVIS.JINI.SUN.COM 
     [java] -DclientCodebase=<https://hudson.apache.org/hudson/job/River-QA/./category=end2end,jdk=JDK%201.6%20(latest),label=Ubuntu/ws/qa/lib/qa1-end2end.jar>

     [java] -DserverDSAAlias=serverDSA 
     [java] -DkeyStorePasswordFile=<https://hudson.apache.org/hudson/job/River-QA/./category=end2end,jdk=JDK%201.6%20(latest),label=Ubuntu/ws/qa/src/com/sun/jini/test/impl/end2end/resources/keystore.password>

     [java] -DserverRSAlias=serverRSA 
     [java] -DtestClassPath=<https://hudson.apache.org/hudson/job/River-QA/./category=end2end,jdk=JDK%201.6%20(latest),label=Ubuntu/ws/lib/jsk-platform.jar>:lib/qa1-wrapper.jar:lib/qa1-end2end.jar

     [java] -Djava.security.auth.login.config=<https://hudson.apache.org/hudson/job/River-QA/./category=end2end,jdk=JDK%201.6%20(latest),label=Ubuntu/ws/qa/src/com/sun/jini/test/impl/end2end/e2etest/Driver.login>

     [java] -DclientRSA1DN=CN=clientRSA1 
     [java] -DclientRSA1Alias=clientRSA1 
     [java] -DkerberosClient=qa-e2e-client@DAVIS.JINI.SUN.COM 
     [java] -DclientDSA1Alias=clientDSA1 
     [java] -Djavax.net.ssl.trustStorePassword=keypass 
     [java] -Djavax.security.auth.useSubjectCredsOnly=false 
     [java] -Djava.rmi.server.codebase=<https://hudson.apache.org/hudson/job/River-QA/./category=end2end,jdk=JDK%201.6%20(latest),label=Ubuntu/ws/qa/lib/qa1-end2end.jar>

     [java] MasterTest.doTest INFO: 
     [java] =============================== CALLING RUN() ===============================
     [java] 
     [java] /home/hudson/tools/java/jdk1.6.0_20-32/jre/bin/java -DserverDSADN=CN=serverDSA
-Djava.security.policy=<https://hudson.apache.org/hudson/job/River-QA/./category=end2end,jdk=JDK%201.6%20(latest),label=Ubuntu/ws/qa/src/com/sun/jini/test/impl/end2end/policies/end2end.policy>
-DserverCodebase=<https://hudson.apache.org/hudson/job/River-QA/./category=end2end,jdk=JDK%201.6%20(latest),label=Ubuntu/ws/qa/lib/qa1-end2end.jar>
-DkeyStoreFile=<https://hudson.apache.org/hudson/job/River-QA/./category=end2end,jdk=JDK%201.6%20(latest),label=Ubuntu/ws/qa/src/com/sun/jini/test/impl/end2end/resources/keystore>
-DthreadCount=1 -DserverRSADN=CN=serverRSA -Dend2end.logArgs=boundaries,failures,finalStatistics
-Dend2end.coverage=50 -DserverKeytabLocation=<https://hudson.apache.org/hudson/job/River-QA/./category=end2end,jdk=JDK%201.6%20(latest),label=Ubuntu/ws/qa/harness/trust/aggregateKeytab>
-Djavax.net.ssl.keyStore=<https://hudson.apache.org/hudson/job/River-QA/./category=end2end,jdk=JDK%201.6%20(latest),label=Ubuntu/ws/qa/src/com/sun/jini/test/impl/end2end/resources/keystore>
-DclientRSA2Alias=clientRSA2 -Djavax.net.ssl.keyStorePassword=keypass -DclientDSA2Alias=clientDSA2
-Djavax.net.ssl.trustStore=<https://hudson.apache.org/hudson/job/River-QA/./category=end2end,jdk=JDK%201.6%20(latest),label=Ubuntu/ws/qa/src/com/sun/jini/test/impl/end2end/resources/keystore>
-DcodebaseDirectory=<https://hudson.apache.org/hudson/job/River-QA/./category=end2end,jdk=JDK%201.6%20(latest),label=Ubuntu/ws/qa/lib>
-Dcom.sun.jini.jsk.jars=<https://hudson.apache.org/hudson/job/River-QA/./category=end2end,jdk=JDK%201.6%20(latest),label=Ubuntu/ws/lib>
-DclientDSA2DN=CN=clientDSA2 -Dsun.rmi.transport.switchConstraintsFloor=10 -DclientDSA1DN=CN=clientDSA1
-DclientKeytabLocation=<https://hudson.apache.org/hudson/job/River-QA/./category=end2end,jdk=JDK%201.6%20(latest),label=Ubuntu/ws/qa/harness/trust/aggregateKeytab>
-DclientRSA2DN=CN=clientRSA2 -Dcom.sun.jini.test.jars=<https://hudson.apache.org/hudson/job/River-QA/./category=end2end,jdk=JDK%201.6%20(latest),label=Ubuntu/ws/qa/lib>
-DkerberosServer=qa-e2e-server@DAVIS.JINI.SUN.COM -DclientCodebase=<https://hudson.apache.org/hudson/job/River-QA/./category=end2end,jdk=JDK%201.6%20(latest),label=Ubuntu/ws/qa/lib/qa1-end2end.jar>
-DserverDSAAlias=serverDSA -DkeyStorePasswordFile=<https://hudson.apache.org/hudson/job/River-QA/./category=end2end,jdk=JDK%201.6%20(latest),label=Ubuntu/ws/qa/src/com/sun/jini/test/impl/end2end/resources/keystore.password>
-DserverRSAlias=serverRSA -DtestClassPath=<https://hudson.apache.org/hudson/job/River-QA/./category=end2end,jdk=JDK%201.6%20(latest),label=Ubuntu/ws/lib/jsk-platform.jar>:lib/qa1-wrapper.jar:lib/qa1-end2end.jar
-Djava.security.auth.login.config=<https://hudson.apache.org/hudson/job/River-QA/./category=end2end,jdk=JDK%201.6%20(latest),label=Ubuntu/ws/qa/src/com/sun/jini/test/impl/end2end/e2etest/Driver.login>
-DclientRSA1DN=CN=clientRSA1 -DclientRSA1Alias=clientRSA1 -DkerberosClient=qa-e2e-client@DAVIS.JINI.SUN.COM
-DclientDSA1Alias=clientDSA1 -Djavax.net.ssl.trustStorePassword=keypass -Djavax.security.auth.useSubjectCredsOnly=false
-Djava.rmi.server.codebase=<https://hudson.apache.org/hudson/job/River-QA/./category=end2end,jdk=JDK%201.6%20(latest),label=Ubuntu/ws/qa/lib/qa1-end2end.jar>
-Dend2end.https=true  -cp <https://hudson.apache.org/hudson/job/River-QA/./category=end2end,jdk=JDK%201.6%20(latest),label=Ubuntu/ws/lib/jsk-platform.jar>:lib/qa1-wrapper.jar:lib/qa1-end2end.jar
com.sun.jini.test.impl.end2end.e2etest.End2EndTest
     [java] Exception in thread "main" java.lang.NoClassDefFoundError: 1/6
     [java] Caused by: java.lang.ClassNotFoundException: 1.6
     [java] 	at java.net.URLClassLoader$1.run(URLClassLoader.java:202)
     [java] 	at java.security.AccessController.doPrivileged(Native Method)
     [java] 	at java.net.URLClassLoader.findClass(URLClassLoader.java:190)
     [java] 	at java.lang.ClassLoader.loadClass(ClassLoader.java:307)
     [java] 	at sun.misc.Launcher$AppClassLoader.loadClass(Launcher.java:301)
     [java] 	at java.lang.ClassLoader.loadClass(ClassLoader.java:248)
     [java] Could not find the main class: 1.6.  Program will exit.
     [java] com.sun.jini.qa.harness.TestException: Test did not complete see details at /tmp/end2end_6008456987726905460_output/end2end.error
and /tmp/end2end_6008456987726905460_output/end2end.output
     [java] 	at com.sun.jini.test.impl.end2end.e2etest.Driver.processResults(Driver.java:198)
     [java] 	at com.sun.jini.test.impl.end2end.e2etest.Driver.run(Driver.java:99)
     [java] 	at com.sun.jini.qa.harness.MasterTest.doTest(MasterTest.java:252)
     [java] 	at com.sun.jini.qa.harness.MasterTest.main(MasterTest.java:142)
     [java] MasterTest.doTest INFO: 
     [java] ============================ CALLING TEARDOWN() =============================
     [java] 
     [java] 
     [java] TIME: 11:20:26 PM
     [java] 
     [java] Test process was destroyed and returned code 1
     [java] com/sun/jini/test/impl/end2end/End2EndTestHTTPS.td
     [java] Test Failed: Test Failed: com.sun.jini.qa.harness.TestException: Test did not
complete see details at /tmp/end2end_6008456987726905460_output/end2end.error and /tmp/end2end_6008456987726905460_output/end2end.output
     [java] 
     [java] 
     [java] -----------------------------------------
     [java] 
     [java] Running com/sun/jini/test/impl/end2end/End2EndTestJSSE.td
     [java] Time is Sun Nov 28 23:20:31 UTC 2010
     [java] Starting test in separate process with command:
     [java] /home/hudson/tools/java/jdk1.6.0_20-32/jre/bin/java -Djava.security.policy=<https://hudson.apache.org/hudson/job/River-QA/./category=end2end,jdk=JDK%201.6%20(latest),label=Ubuntu/ws/qa/harness/policy/defaulttest.policy>
-cp '<https://hudson.apache.org/hudson/job/River-QA/./category=end2end,jdk=JDK%201.6%20(latest),label=Ubuntu/ws/qa/lib/jiniharness.jar>:<https://hudson.apache.org/hudson/job/River-QA/./category=end2end,jdk=JDK%201.6%20(latest),label=Ubuntu/ws/qa/lib/jinitests.jar>:<https://hudson.apache.org/hudson/job/River-QA/./category=end2end,jdk=JDK%201.6%20(latest),label=Ubuntu/ws/lib/jsk-platform.jar>:<https://hudson.apache.org/hudson/job/River-QA/./category=end2end,jdk=JDK%201.6%20(latest),label=Ubuntu/ws/lib/jsk-lib.jar'>
'-Djava.ext.dirs=/home/hudson/tools/java/jdk1.6.0_20-32/jre/lib/ext:/usr/java/packages/lib/ext:<https://hudson.apache.org/hudson/job/River-QA/./category=end2end,jdk=JDK%201.6%20(latest),label=Ubuntu/ws/qa/lib-ext>:<https://hudson.apache.org/hudson/job/River-QA/./category=end2end,jdk=JDK%201.6%20(latest),label=Ubuntu/ws/lib-ext'>
-Dcom.sun.jini.jsk.port=9080 -Dcom.sun.jini.qa.port=9081 '-Dcom.sun.jini.jsk.home=<https://hudson.apache.org/hudson/job/River-QA/./category=end2end,jdk=JDK%201.6%20(latest),label=Ubuntu/ws/'>
'-Dcom.sun.jini.qa.home=<https://hudson.apache.org/hudson/job/River-QA/./category=end2end,jdk=JDK%201.6%20(latest),label=Ubuntu/ws/qa'>
'-Dcom.sun.jini.qa.harness.harnessJar=<https://hudson.apache.org/hudson/job/River-QA/./category=end2end,jdk=JDK%201.6%20(latest),label=Ubuntu/ws/qa/lib/jiniharness.jar'>
'-Dcom.sun.jini.qa.harness.testJar=<https://hudson.apache.org/hudson/job/River-QA/./category=end2end,jdk=JDK%201.6%20(latest),label=Ubuntu/ws/qa/lib/jinitests.jar'>
-Dcom.sun.jini.qa.harness.runjiniserver=true -Dcom.sun.jini.qa.harness.runkitserver=true -Djava.security.properties=<https://hudson.apache.org/hudson/job/River-QA/./category=end2end,jdk=JDK%201.6%20(latest),label=Ubuntu/ws/qa/harness/trust/dynamic-policy.properties>
-Dcom.sun.jini.qa.harness.testhosts= '-Djava.util.logging.config.file=<https://hudson.apache.org/hudson/job/River-QA/./category=end2end,jdk=JDK%201.6%20(latest),label=Ubuntu/ws/qa/src/com/sun/jini/test/resources/qa1.logging'>
'-Dcom.sun.jini.test.home=<https://hudson.apache.org/hudson/job/River-QA/./category=end2end,jdk=JDK%201.6%20(latest),label=Ubuntu/ws/qa'>
-Dcom.sun.jini.test.port=9082 -Dcom.sun.jini.qa.harness.policies=<https://hudson.apache.org/hudson/job/River-QA/./category=end2end,jdk=JDK%201.6%20(latest),label=Ubuntu/ws/qa/src/com/sun/jini/test/resources/jinitest.policy>
'-Djava.ext.dirs=/home/hudson/tools/java/jdk1.6.0_20-32/jre/lib/ext:/usr/java/packages/lib/ext:<https://hudson.apache.org/hudson/job/River-QA/./category=end2end,jdk=JDK%201.6%20(latest),label=Ubuntu/ws/qa/lib-ext>:<https://hudson.apache.org/hudson/job/River-QA/./category=end2end,jdk=JDK%201.6%20(latest),label=Ubuntu/ws/lib-ext'>
-Djava.security.policy=<https://hudson.apache.org/hudson/job/River-QA/./category=end2end,jdk=JDK%201.6%20(latest),label=Ubuntu/ws/qa/harness/policy/all.policy>
com.sun.jini.qa.harness.MasterTest com/sun/jini/test/impl/end2end/End2EndTestJSSE.td 
     [java] 
     [java] TIME: 11:20:31 PM
     [java] 
     [java] MasterTest.doTest INFO: 
     [java] ============================== CALLING SETUP() ==============================
     [java] 
     [java] -DserverDSADN=CN=serverDSA 
     [java] -Djava.security.policy=<https://hudson.apache.org/hudson/job/River-QA/./category=end2end,jdk=JDK%201.6%20(latest),label=Ubuntu/ws/qa/src/com/sun/jini/test/impl/end2end/policies/end2end.policy>

     [java] -DserverCodebase=<https://hudson.apache.org/hudson/job/River-QA/./category=end2end,jdk=JDK%201.6%20(latest),label=Ubuntu/ws/qa/lib/qa1-end2end.jar>

     [java] -DkeyStoreFile=<https://hudson.apache.org/hudson/job/River-QA/./category=end2end,jdk=JDK%201.6%20(latest),label=Ubuntu/ws/qa/src/com/sun/jini/test/impl/end2end/resources/keystore>

     [java] -DthreadCount=1 
     [java] -DserverRSADN=CN=serverRSA 
     [java] -Dend2end.logArgs=boundaries,failures,finalStatistics 
     [java] -Dend2end.coverage=50 
     [java] -DserverKeytabLocation=<https://hudson.apache.org/hudson/job/River-QA/./category=end2end,jdk=JDK%201.6%20(latest),label=Ubuntu/ws/qa/harness/trust/aggregateKeytab>

     [java] -Djavax.net.ssl.keyStore=<https://hudson.apache.org/hudson/job/River-QA/./category=end2end,jdk=JDK%201.6%20(latest),label=Ubuntu/ws/qa/src/com/sun/jini/test/impl/end2end/resources/keystore>

     [java] -DclientRSA2Alias=clientRSA2 
     [java] -Djavax.net.ssl.keyStorePassword=keypass 
     [java] -DclientDSA2Alias=clientDSA2 
     [java] -Djavax.net.ssl.trustStore=<https://hudson.apache.org/hudson/job/River-QA/./category=end2end,jdk=JDK%201.6%20(latest),label=Ubuntu/ws/qa/src/com/sun/jini/test/impl/end2end/resources/keystore>

     [java] -DcodebaseDirectory=<https://hudson.apache.org/hudson/job/River-QA/./category=end2end,jdk=JDK%201.6%20(latest),label=Ubuntu/ws/qa/lib>

     [java] -Dcom.sun.jini.jsk.jars=<https://hudson.apache.org/hudson/job/River-QA/./category=end2end,jdk=JDK%201.6%20(latest),label=Ubuntu/ws/lib>

     [java] -DclientDSA2DN=CN=clientDSA2 
     [java] -Dsun.rmi.transport.switchConstraintsFloor=10 
     [java] -DclientDSA1DN=CN=clientDSA1 
     [java] -DclientKeytabLocation=<https://hudson.apache.org/hudson/job/River-QA/./category=end2end,jdk=JDK%201.6%20(latest),label=Ubuntu/ws/qa/harness/trust/aggregateKeytab>

     [java] -DclientRSA2DN=CN=clientRSA2 
     [java] -Dcom.sun.jini.test.jars=<https://hudson.apache.org/hudson/job/River-QA/./category=end2end,jdk=JDK%201.6%20(latest),label=Ubuntu/ws/qa/lib>

     [java] -DkerberosServer=qa-e2e-server@DAVIS.JINI.SUN.COM 
     [java] -DclientCodebase=<https://hudson.apache.org/hudson/job/River-QA/./category=end2end,jdk=JDK%201.6%20(latest),label=Ubuntu/ws/qa/lib/qa1-end2end.jar>

     [java] -DserverDSAAlias=serverDSA 
     [java] -DkeyStorePasswordFile=<https://hudson.apache.org/hudson/job/River-QA/./category=end2end,jdk=JDK%201.6%20(latest),label=Ubuntu/ws/qa/src/com/sun/jini/test/impl/end2end/resources/keystore.password>

     [java] -DserverRSAlias=serverRSA 
     [java] -DtestClassPath=<https://hudson.apache.org/hudson/job/River-QA/./category=end2end,jdk=JDK%201.6%20(latest),label=Ubuntu/ws/lib/jsk-platform.jar>:lib/qa1-wrapper.jar:lib/qa1-end2end.jar

     [java] -Djava.security.auth.login.config=<https://hudson.apache.org/hudson/job/River-QA/./category=end2end,jdk=JDK%201.6%20(latest),label=Ubuntu/ws/qa/src/com/sun/jini/test/impl/end2end/e2etest/Driver.login>

     [java] -DclientRSA1DN=CN=clientRSA1 
     [java] -DclientRSA1Alias=clientRSA1 
     [java] -DkerberosClient=qa-e2e-client@DAVIS.JINI.SUN.COM 
     [java] -DclientDSA1Alias=clientDSA1 
     [java] -Djavax.net.ssl.trustStorePassword=keypass 
     [java] -Djavax.security.auth.useSubjectCredsOnly=false 
     [java] -Djava.rmi.server.codebase=<https://hudson.apache.org/hudson/job/River-QA/./category=end2end,jdk=JDK%201.6%20(latest),label=Ubuntu/ws/qa/lib/qa1-end2end.jar>

     [java] MasterTest.doTest INFO: 
     [java] =============================== CALLING RUN() ===============================
     [java] 
     [java] /home/hudson/tools/java/jdk1.6.0_20-32/jre/bin/java -DserverDSADN=CN=serverDSA
-Djava.security.policy=<https://hudson.apache.org/hudson/job/River-QA/./category=end2end,jdk=JDK%201.6%20(latest),label=Ubuntu/ws/qa/src/com/sun/jini/test/impl/end2end/policies/end2end.policy>
-DserverCodebase=<https://hudson.apache.org/hudson/job/River-QA/./category=end2end,jdk=JDK%201.6%20(latest),label=Ubuntu/ws/qa/lib/qa1-end2end.jar>
-DkeyStoreFile=<https://hudson.apache.org/hudson/job/River-QA/./category=end2end,jdk=JDK%201.6%20(latest),label=Ubuntu/ws/qa/src/com/sun/jini/test/impl/end2end/resources/keystore>
-DthreadCount=1 -DserverRSADN=CN=serverRSA -Dend2end.logArgs=boundaries,failures,finalStatistics
-Dend2end.coverage=50 -DserverKeytabLocation=<https://hudson.apache.org/hudson/job/River-QA/./category=end2end,jdk=JDK%201.6%20(latest),label=Ubuntu/ws/qa/harness/trust/aggregateKeytab>
-Djavax.net.ssl.keyStore=<https://hudson.apache.org/hudson/job/River-QA/./category=end2end,jdk=JDK%201.6%20(latest),label=Ubuntu/ws/qa/src/com/sun/jini/test/impl/end2end/resources/keystore>
-DclientRSA2Alias=clientRSA2 -Djavax.net.ssl.keyStorePassword=keypass -DclientDSA2Alias=clientDSA2
-Djavax.net.ssl.trustStore=<https://hudson.apache.org/hudson/job/River-QA/./category=end2end,jdk=JDK%201.6%20(latest),label=Ubuntu/ws/qa/src/com/sun/jini/test/impl/end2end/resources/keystore>
-DcodebaseDirectory=<https://hudson.apache.org/hudson/job/River-QA/./category=end2end,jdk=JDK%201.6%20(latest),label=Ubuntu/ws/qa/lib>
-Dcom.sun.jini.jsk.jars=<https://hudson.apache.org/hudson/job/River-QA/./category=end2end,jdk=JDK%201.6%20(latest),label=Ubuntu/ws/lib>
-DclientDSA2DN=CN=clientDSA2 -Dsun.rmi.transport.switchConstraintsFloor=10 -DclientDSA1DN=CN=clientDSA1
-DclientKeytabLocation=<https://hudson.apache.org/hudson/job/River-QA/./category=end2end,jdk=JDK%201.6%20(latest),label=Ubuntu/ws/qa/harness/trust/aggregateKeytab>
-DclientRSA2DN=CN=clientRSA2 -Dcom.sun.jini.test.jars=<https://hudson.apache.org/hudson/job/River-QA/./category=end2end,jdk=JDK%201.6%20(latest),label=Ubuntu/ws/qa/lib>
-DkerberosServer=qa-e2e-server@DAVIS.JINI.SUN.COM -DclientCodebase=<https://hudson.apache.org/hudson/job/River-QA/./category=end2end,jdk=JDK%201.6%20(latest),label=Ubuntu/ws/qa/lib/qa1-end2end.jar>
-DserverDSAAlias=serverDSA -DkeyStorePasswordFile=<https://hudson.apache.org/hudson/job/River-QA/./category=end2end,jdk=JDK%201.6%20(latest),label=Ubuntu/ws/qa/src/com/sun/jini/test/impl/end2end/resources/keystore.password>
-DserverRSAlias=serverRSA -DtestClassPath=<https://hudson.apache.org/hudson/job/River-QA/./category=end2end,jdk=JDK%201.6%20(latest),label=Ubuntu/ws/lib/jsk-platform.jar>:lib/qa1-wrapper.jar:lib/qa1-end2end.jar
-Djava.security.auth.login.config=<https://hudson.apache.org/hudson/job/River-QA/./category=end2end,jdk=JDK%201.6%20(latest),label=Ubuntu/ws/qa/src/com/sun/jini/test/impl/end2end/e2etest/Driver.login>
-DclientRSA1DN=CN=clientRSA1 -DclientRSA1Alias=clientRSA1 -DkerberosClient=qa-e2e-client@DAVIS.JINI.SUN.COM
-DclientDSA1Alias=clientDSA1 -Djavax.net.ssl.trustStorePassword=keypass -Djavax.security.auth.useSubjectCredsOnly=false
-Djava.rmi.server.codebase=<https://hudson.apache.org/hudson/job/River-QA/./category=end2end,jdk=JDK%201.6%20(latest),label=Ubuntu/ws/qa/lib/qa1-end2end.jar>
 -cp <https://hudson.apache.org/hudson/job/River-QA/./category=end2end,jdk=JDK%201.6%20(latest),label=Ubuntu/ws/lib/jsk-platform.jar>:lib/qa1-wrapper.jar:lib/qa1-end2end.jar
com.sun.jini.test.impl.end2end.e2etest.End2EndTest
     [java] Exception in thread "main" java.lang.NoClassDefFoundError: 1/6
     [java] Caused by: java.lang.ClassNotFoundException: 1.6
     [java] 	at java.net.URLClassLoader$1.run(URLClassLoader.java:202)
     [java] 	at java.security.AccessController.doPrivileged(Native Method)
     [java] 	at java.net.URLClassLoader.findClass(URLClassLoader.java:190)
     [java] 	at java.lang.ClassLoader.loadClass(ClassLoader.java:307)
     [java] 	at sun.misc.Launcher$AppClassLoader.loadClass(Launcher.java:301)
     [java] 	at java.lang.ClassLoader.loadClass(ClassLoader.java:248)
     [java] Could not find the main class: 1.6.  Program will exit.
     [java] com.sun.jini.qa.harness.TestException: Test did not complete see details at /tmp/end2end_2052815656108291313_output/end2end.error
and /tmp/end2end_2052815656108291313_output/end2end.output
     [java] 	at com.sun.jini.test.impl.end2end.e2etest.Driver.processResults(Driver.java:198)
     [java] 	at com.sun.jini.test.impl.end2end.e2etest.Driver.run(Driver.java:99)
     [java] 	at com.sun.jini.qa.harness.MasterTest.doTest(MasterTest.java:252)
     [java] 	at com.sun.jini.qa.harness.MasterTest.main(MasterTest.java:142)
     [java] MasterTest.doTest INFO: 
     [java] ============================ CALLING TEARDOWN() =============================
     [java] 
     [java] 
     [java] TIME: 11:20:31 PM
     [java] 
     [java] Test process was destroyed and returned code 1
     [java] com/sun/jini/test/impl/end2end/End2EndTestJSSE.td
     [java] Test Failed: Test Failed: com.sun.jini.qa.harness.TestException: Test did not
complete see details at /tmp/end2end_2052815656108291313_output/end2end.error and /tmp/end2end_2052815656108291313_output/end2end.output
     [java] 
     [java] 
     [java] -----------------------------------------
     [java] 
     [java] Running com/sun/jini/test/impl/end2end/End2EndTestKerberos.td
     [java] Time is Sun Nov 28 23:20:36 UTC 2010
     [java] Starting test in separate process with command:
     [java] /home/hudson/tools/java/jdk1.6.0_20-32/jre/bin/java -Djava.security.policy=<https://hudson.apache.org/hudson/job/River-QA/./category=end2end,jdk=JDK%201.6%20(latest),label=Ubuntu/ws/qa/harness/policy/defaulttest.policy>
-cp '<https://hudson.apache.org/hudson/job/River-QA/./category=end2end,jdk=JDK%201.6%20(latest),label=Ubuntu/ws/qa/lib/jiniharness.jar>:<https://hudson.apache.org/hudson/job/River-QA/./category=end2end,jdk=JDK%201.6%20(latest),label=Ubuntu/ws/qa/lib/jinitests.jar>:<https://hudson.apache.org/hudson/job/River-QA/./category=end2end,jdk=JDK%201.6%20(latest),label=Ubuntu/ws/lib/jsk-platform.jar>:<https://hudson.apache.org/hudson/job/River-QA/./category=end2end,jdk=JDK%201.6%20(latest),label=Ubuntu/ws/lib/jsk-lib.jar'>
'-Djava.ext.dirs=/home/hudson/tools/java/jdk1.6.0_20-32/jre/lib/ext:/usr/java/packages/lib/ext:<https://hudson.apache.org/hudson/job/River-QA/./category=end2end,jdk=JDK%201.6%20(latest),label=Ubuntu/ws/qa/lib-ext>:<https://hudson.apache.org/hudson/job/River-QA/./category=end2end,jdk=JDK%201.6%20(latest),label=Ubuntu/ws/lib-ext'>
-Dcom.sun.jini.jsk.port=9080 -Dcom.sun.jini.qa.port=9081 '-Dcom.sun.jini.jsk.home=<https://hudson.apache.org/hudson/job/River-QA/./category=end2end,jdk=JDK%201.6%20(latest),label=Ubuntu/ws/'>
'-Dcom.sun.jini.qa.home=<https://hudson.apache.org/hudson/job/River-QA/./category=end2end,jdk=JDK%201.6%20(latest),label=Ubuntu/ws/qa'>
'-Dcom.sun.jini.qa.harness.harnessJar=<https://hudson.apache.org/hudson/job/River-QA/./category=end2end,jdk=JDK%201.6%20(latest),label=Ubuntu/ws/qa/lib/jiniharness.jar'>
'-Dcom.sun.jini.qa.harness.testJar=<https://hudson.apache.org/hudson/job/River-QA/./category=end2end,jdk=JDK%201.6%20(latest),label=Ubuntu/ws/qa/lib/jinitests.jar'>
-Dcom.sun.jini.qa.harness.runjiniserver=true -Dcom.sun.jini.qa.harness.runkitserver=true -Djava.security.properties=<https://hudson.apache.org/hudson/job/River-QA/./category=end2end,jdk=JDK%201.6%20(latest),label=Ubuntu/ws/qa/harness/trust/dynamic-policy.properties>
-Dcom.sun.jini.qa.harness.testhosts= '-Djava.util.logging.config.file=<https://hudson.apache.org/hudson/job/River-QA/./category=end2end,jdk=JDK%201.6%20(latest),label=Ubuntu/ws/qa/src/com/sun/jini/test/resources/qa1.logging'>
'-Dcom.sun.jini.test.home=<https://hudson.apache.org/hudson/job/River-QA/./category=end2end,jdk=JDK%201.6%20(latest),label=Ubuntu/ws/qa'>
-Dcom.sun.jini.test.port=9082 -Dcom.sun.jini.qa.harness.policies=<https://hudson.apache.org/hudson/job/River-QA/./category=end2end,jdk=JDK%201.6%20(latest),label=Ubuntu/ws/qa/src/com/sun/jini/test/resources/jinitest.policy>
'-Djava.ext.dirs=/home/hudson/tools/java/jdk1.6.0_20-32/jre/lib/ext:/usr/java/packages/lib/ext:<https://hudson.apache.org/hudson/job/River-QA/./category=end2end,jdk=JDK%201.6%20(latest),label=Ubuntu/ws/qa/lib-ext>:<https://hudson.apache.org/hudson/job/River-QA/./category=end2end,jdk=JDK%201.6%20(latest),label=Ubuntu/ws/lib-ext'>
-Djava.security.policy=<https://hudson.apache.org/hudson/job/River-QA/./category=end2end,jdk=JDK%201.6%20(latest),label=Ubuntu/ws/qa/harness/policy/all.policy>
com.sun.jini.qa.harness.MasterTest com/sun/jini/test/impl/end2end/End2EndTestKerberos.td 
     [java] 
     [java] TIME: 11:20:36 PM
     [java] 
     [java] MasterTest.doTest INFO: 
     [java] ============================== CALLING SETUP() ==============================
     [java] 
     [java] -DserverDSADN=CN=serverDSA 
     [java] -Djava.security.policy=<https://hudson.apache.org/hudson/job/River-QA/./category=end2end,jdk=JDK%201.6%20(latest),label=Ubuntu/ws/qa/src/com/sun/jini/test/impl/end2end/policies/end2end.policy>

     [java] -DserverCodebase=<https://hudson.apache.org/hudson/job/River-QA/./category=end2end,jdk=JDK%201.6%20(latest),label=Ubuntu/ws/qa/lib/qa1-end2end.jar>

     [java] -DkeyStoreFile=<https://hudson.apache.org/hudson/job/River-QA/./category=end2end,jdk=JDK%201.6%20(latest),label=Ubuntu/ws/qa/src/com/sun/jini/test/impl/end2end/resources/keystore>

     [java] -DthreadCount=1 
     [java] -DserverRSADN=CN=serverRSA 
     [java] -Dend2end.logArgs=boundaries,failures,finalStatistics 
     [java] -Dend2end.coverage=50 
     [java] -DserverKeytabLocation=<https://hudson.apache.org/hudson/job/River-QA/./category=end2end,jdk=JDK%201.6%20(latest),label=Ubuntu/ws/qa/harness/trust/aggregateKeytab>

     [java] -Djavax.net.ssl.keyStore=<https://hudson.apache.org/hudson/job/River-QA/./category=end2end,jdk=JDK%201.6%20(latest),label=Ubuntu/ws/qa/src/com/sun/jini/test/impl/end2end/resources/keystore>

     [java] -DclientRSA2Alias=clientRSA2 
     [java] -Djavax.net.ssl.keyStorePassword=keypass 
     [java] -DclientDSA2Alias=clientDSA2 
     [java] -Djavax.net.ssl.trustStore=<https://hudson.apache.org/hudson/job/River-QA/./category=end2end,jdk=JDK%201.6%20(latest),label=Ubuntu/ws/qa/src/com/sun/jini/test/impl/end2end/resources/keystore>

     [java] -DcodebaseDirectory=<https://hudson.apache.org/hudson/job/River-QA/./category=end2end,jdk=JDK%201.6%20(latest),label=Ubuntu/ws/qa/lib>

     [java] -Dcom.sun.jini.jsk.jars=<https://hudson.apache.org/hudson/job/River-QA/./category=end2end,jdk=JDK%201.6%20(latest),label=Ubuntu/ws/lib>

     [java] -DclientDSA2DN=CN=clientDSA2 
     [java] -Dsun.rmi.transport.switchConstraintsFloor=10 
     [java] -DclientDSA1DN=CN=clientDSA1 
     [java] -DclientKeytabLocation=<https://hudson.apache.org/hudson/job/River-QA/./category=end2end,jdk=JDK%201.6%20(latest),label=Ubuntu/ws/qa/harness/trust/aggregateKeytab>

     [java] -DclientRSA2DN=CN=clientRSA2 
     [java] -Dcom.sun.jini.test.jars=<https://hudson.apache.org/hudson/job/River-QA/./category=end2end,jdk=JDK%201.6%20(latest),label=Ubuntu/ws/qa/lib>

     [java] -DkerberosServer=qa-e2e-server@DAVIS.JINI.SUN.COM 
     [java] -DclientCodebase=<https://hudson.apache.org/hudson/job/River-QA/./category=end2end,jdk=JDK%201.6%20(latest),label=Ubuntu/ws/qa/lib/qa1-end2end.jar>

     [java] -DserverDSAAlias=serverDSA 
     [java] -DkeyStorePasswordFile=<https://hudson.apache.org/hudson/job/River-QA/./category=end2end,jdk=JDK%201.6%20(latest),label=Ubuntu/ws/qa/src/com/sun/jini/test/impl/end2end/resources/keystore.password>

     [java] -DserverRSAlias=serverRSA 
     [java] -DtestClassPath=<https://hudson.apache.org/hudson/job/River-QA/./category=end2end,jdk=JDK%201.6%20(latest),label=Ubuntu/ws/lib/jsk-platform.jar>:lib/qa1-wrapper.jar:lib/qa1-end2end.jar

     [java] -Djava.security.auth.login.config=<https://hudson.apache.org/hudson/job/River-QA/./category=end2end,jdk=JDK%201.6%20(latest),label=Ubuntu/ws/qa/src/com/sun/jini/test/impl/end2end/e2etest/Driver.login>

     [java] -DclientRSA1DN=CN=clientRSA1 
     [java] -DclientRSA1Alias=clientRSA1 
     [java] -DkerberosClient=qa-e2e-client@DAVIS.JINI.SUN.COM 
     [java] -DclientDSA1Alias=clientDSA1 
     [java] -Djavax.net.ssl.trustStorePassword=keypass 
     [java] -Djavax.security.auth.useSubjectCredsOnly=false 
     [java] -Djava.rmi.server.codebase=<https://hudson.apache.org/hudson/job/River-QA/./category=end2end,jdk=JDK%201.6%20(latest),label=Ubuntu/ws/qa/lib/qa1-end2end.jar>

     [java] java.io.IOException: Cannot run program "/home/hudson/tools/java/jdk1.6.0_20-32/jre/bin/kinit":
java.io.IOException: error=2, No such file or directory
     [java] 	at java.lang.ProcessBuilder.start(ProcessBuilder.java:460)
     [java] 	at java.lang.Runtime.exec(Runtime.java:593)
     [java] 	at java.lang.Runtime.exec(Runtime.java:431)
     [java] 	at java.lang.Runtime.exec(Runtime.java:328)
     [java] 	at com.sun.jini.test.impl.end2end.e2etest.Driver.initializeKerberos(Driver.java:219)
     [java] 	at com.sun.jini.test.impl.end2end.e2etest.Driver.getProperties(Driver.java:142)
     [java] 	at com.sun.jini.test.impl.end2end.e2etest.Driver.setup(Driver.java:76)
     [java] 	at com.sun.jini.qa.harness.MasterTest.doTest(MasterTest.java:217)
     [java] 	at com.sun.jini.qa.harness.MasterTest.main(MasterTest.java:142)
     [java] Caused by: java.io.IOException: java.io.IOException: error=2, No such file or
directory
     [java] 	at java.lang.UNIXProcess.<init>(UNIXProcess.java:148)
     [java] 	at java.lang.ProcessImpl.start(ProcessImpl.java:65)
     [java] 	at java.lang.ProcessBuilder.start(ProcessBuilder.java:453)
     [java] 	... 8 more
     [java] MasterTest.doTest INFO: 
     [java] ============================ CALLING TEARDOWN() =============================
     [java] 
     [java] 
     [java] TIME: 11:20:37 PM
     [java] 
     [java] Test process was destroyed and returned code 1
     [java] com/sun/jini/test/impl/end2end/End2EndTestKerberos.td
     [java] Test Failed: Unexpected Exception in setup: java.io.IOException: Cannot run program
"/home/hudson/tools/java/jdk1.6.0_20-32/jre/bin/kinit": java.io.IOException: error=2, No such
file or directory
     [java] 
     [java] 
     [java] -----------------------------------------
     [java] 
     [java] SUMMARY =================================
     [java] 
     [java] com/sun/jini/test/impl/end2end/End2EndTestHTTPS.td
     [java] Test Failed: Test Failed: com.sun.jini.qa.harness.TestException: Test did not
complete see details at /tmp/end2end_6008456987726905460_output/end2end.error and /tmp/end2end_6008456987726905460_output/end2end.output
     [java] 
     [java] -----------------------------------------
     [java] com/sun/jini/test/impl/end2end/End2EndTestJSSE.td
     [java] Test Failed: Test Failed: com.sun.jini.qa.harness.TestException: Test did not
complete see details at /tmp/end2end_2052815656108291313_output/end2end.error and /tmp/end2end_2052815656108291313_output/end2end.output
     [java] 
     [java] -----------------------------------------
     [java] com/sun/jini/test/impl/end2end/End2EndTestKerberos.td
     [java] Test Failed: Unexpected Exception in setup: java.io.IOException: Cannot run program
"/home/hudson/tools/java/jdk1.6.0_20-32/jre/bin/kinit": java.io.IOException: error=2, No such
file or directory
     [java] 
     [java] -----------------------------------------
     [java] 
     [java] # of tests started   = 3
     [java] # of tests completed = 3
     [java] # of tests passed    = 0
     [java] # of tests failed    = 3
     [java] 
     [java] -----------------------------------------
     [java] 
     [java]    Date finished:
     [java]       Sun Nov 28 23:20:42 UTC 2010
     [java]    Time elapsed:
     [java]       17 seconds
     [java] 
     [java] Java Result: 1

collect-result:

BUILD FAILED
<https://hudson.apache.org/hudson/job/River-QA/./category=end2end,jdk=JDK%201.6%20(latest),label=Ubuntu/ws/build.xml>:74:
The following error occurred while executing this line:
<https://hudson.apache.org/hudson/job/River-QA/./category=end2end,jdk=JDK%201.6%20(latest),label=Ubuntu/ws/qa/build.xml>:352:
condition satisfied

Total time: 26 seconds


Mime
View raw message