river-dev mailing list archives

Site index · List index
Message view « Date » · « Thread »
Top « Date » · « Thread »
From Peter Firmstone <j...@zeus.net.au>
Subject Re: Test results on Solaris Sparc
Date Sun, 07 Nov 2010 08:32:08 GMT
The details:

bash-3.00$ ant run-tests
Buildfile: build.xml

james-brown:
   [delete] Deleting directory /opt/src/river/trunk/qa/soul
    [mkdir] Created dir: /opt/src/river/trunk/qa/soul
    [touch] Creating /opt/src/river/trunk/qa/soul/soul.201011071828009689

run-tests:
     [java]
     [java] -----------------------------------------
     [java] CONFIGURATION FILE:
     [java]
     [java]    
/opt/src/river/trunk/qa/src/com/sun/jini/test/resources/qaHarness.prop
     [java]
     [java] -----------------------------------------
     [java] SETTING UP THE TEST LIST:
     [java]
     [java]    Adding test: 
com/sun/jini/test/impl/start/ServiceStarterCreateBadTransientServiceTest.td
     [java]    Adding test: 
com/sun/jini/test/impl/start/ServiceStarterCreateSharedBadActServiceTest.td
     [java]
     [java] -----------------------------------------
     [java] GENERAL HARNESS CONFIGURATION INFORMATION:
     [java]
     [java]    Date started:
     [java]       Sun Nov 07 18:28:12 EST 2010
     [java]    Installation directory of the JSK:
     [java]       com.sun.jini.jsk.home=/opt/src/river/trunk
     [java]    Installation directory of the harness:
     [java]       com.sun.jini.qa.home=/opt/src/river/trunk/qa
     [java]    Categories being tested:
     [java]       categories=No Categories
     [java] -----------------------------------------
     [java] ENVIRONMENT PROPERTIES:
     [java]
     [java]    JVM information:
     [java]       Java HotSpot(TM) Server VM, 10.0-b23, 32 bit VM mode
     [java]       Sun Microsystems Inc.
     [java]    OS information:
     [java]       SunOS, 5.10, sparc
     [java]
     [java] -----------------------------------------
     [java] STARTING TO RUN THE TESTS
     [java]
     [java]
     [java] Running 
com/sun/jini/test/impl/start/ServiceStarterCreateBadTransientServiceTest.td
     [java] Time is Sun Nov 07 18:28:12 EST 2010
     [java] Starting test in separate process with command:
     [java] /usr/jdk/instances/jdk1.6.0/jre/bin/java 
-Djava.security.policy=file:/opt/src/river/trunk/qa/harness/policy/defaulttest.policy 
-Djava.rmi.server.codebase=http://bluto:8082/qa1-start-probe-dl.jar -cp 
/opt/src/river/trunk/qa/lib/jiniharness.jar:/opt/src/river/trunk/qa/lib/jinitests.jar:/opt/src/river/trunk/lib/jsk-platform.jar:/opt/src/river/trunk/lib/jsk-lib.jar

-client 
-Djava.ext.dirs=/usr/jdk/instances/jdk1.6.0/jre/lib/ext:/usr/jdk/packages/lib/ext:/opt/src/river/trunk/qa/lib-ext:/opt/src/river/trunk/lib-ext

-Dcom.sun.jini.jsk.port=8080 -Dcom.sun.jini.qa.port=9081 
-Dcom.sun.jini.jsk.home=/opt/src/river/trunk 
-Dcom.sun.jini.qa.home=/opt/src/river/trunk/qa 
-Dcom.sun.jini.qa.harness.harnessJar=/opt/src/river/trunk/qa/lib/jiniharness.jar 
-Dcom.sun.jini.qa.harness.testJar=/opt/src/river/trunk/qa/lib/jinitests.jar 
-Dcom.sun.jini.qa.harness.runjiniserver=true 
-Dcom.sun.jini.qa.harness.runkitserver=true 
-Djava.security.properties=file:/opt/src/river/trunk/qa/harness/trust/dynamic-policy.properties

-Dcom.sun.jini.qa.harness.testhosts= 
-Djava.util.logging.config.file=/home/peter/logging.properties 
-Dcom.sun.jini.test.home=/opt/src/river/trunk/qa 
-Dcom.sun.jini.test.port=8082 
-Dcom.sun.jini.qa.harness.policies=file:/opt/src/river/trunk/qa/src/com/sun/jini/test/resources/jinitest.policy

-Djava.ext.dirs=/usr/jdk/instances/jdk1.6.0/jre/lib/ext:/usr/jdk/packages/lib/ext:/opt/src/river/trunk/qa/lib-ext:/opt/src/river/trunk/lib-ext

com.sun.jini.qa.harness.MasterTest 
com/sun/jini/test/impl/start/ServiceStarterCreateBadTransientServiceTest.td
     [java]
     [java] TIME: 18:28:16
     [java]
     [java] MasterTest.doTest INFO:
     [java] ============================== CALLING SETUP() 
==============================
     [java]
     [java] 7/11/2010 18:28:16 com.sun.jini.tool.ClassServer run
     [java] INFO: ClassServer started [[/opt/src/river/trunk/qa/lib/], 
port 9081]
     [java] 7/11/2010 18:28:16 com.sun.jini.tool.ClassServer run
     [java] INFO: ClassServer started [[/opt/src/river/trunk/lib-dl/], 
port 8080]
     [java] 7/11/2010 18:28:16 com.sun.jini.tool.ClassServer run
     [java] INFO: ClassServer started [[/opt/src/river/trunk/qa/lib/], 
port 8082]
     [java] ActSys-err: 7/11/2010 18:28:20 
com.sun.jini.phoenix.Activation init
     [java] ActSys-err: INFO: activation daemon started
     [java]
     [java] TIME: 18:28:29
     [java]
     [java] MasterTest.doTest INFO:
     [java] =============================== CALLING RUN() 
===============================
     [java]
     [java] ServiceStarterCreateBadTransientServiceTest.run INFO: 
codebase = http://bluto:8080/mercury-dl.jar http://bluto:8080/jsk-dl.jar
     [java] ServiceStarterCreateBadTransientServiceTest.run INFO: policy 
= file:/opt/src/river/trunk/qa/harness/policy/defaultmercury.policy
     [java] ServiceStarterCreateBadTransientServiceTest.run INFO: impl = 
com.sun.jini.mercury.TransientMercuryImpl
     [java] ServiceStarterCreateBadTransientServiceTest.run INFO: 
classpath = /opt/src/river/trunk/lib/mercury.jar
     [java] 7/11/2010 18:28:30 com.sun.jini.start.HTTPDStatus httpdWarning
     [java] WARNING: Problem accessing desired 
URL[http://bluto:8080/mercury-dl_bogus.jar]: 
java.io.FileNotFoundException: http://bluto:8080/mercury-dl_bogus.jar.
     [java] 7/11/2010 18:28:31 com.sun.jini.mercury.MailboxImpl doInit
     [java] INFO: Mercury started: 
com.sun.jini.mercury.TransientMercuryImpl@128f6ee
     [java] ServiceStarterCreateBadTransientServiceTest.run INFO: 
Expected Failure with bad codebase descriptor: 
[http://bluto:8080/mercury-dl_bogus.jar http://bluto:8080/jsk-dl.jar, 
file:/opt/src/river/trunk/qa/harness/policy/defaultmercury.policy, 
/opt/src/river/trunk/lib/mercury.jar, 
com.sun.jini.mercury.TransientMercuryImpl, 
[/var/tmp/Mercury56623.config], 
com.sun.jini.start.NonActivatableServiceDescriptor$1@e61fd1, 
BasicProxyPreparer[]]
     [java] java.lang.ClassNotFoundException: 
com.sun.jini.mercury.MailboxProxy$ConstrainableMailboxProxy
     [java]     at java.net.URLClassLoader$1.run(URLClassLoader.java:200)
     [java]     at java.security.AccessController.doPrivileged(Native 
Method)
     [java]     at 
java.net.URLClassLoader.findClass(URLClassLoader.java:188)
     [java]     at java.lang.ClassLoader.loadClass(ClassLoader.java:306)
     [java]     at 
net.jini.loader.pref.PreferredClassLoader.loadClass(PreferredClassLoader.java:942)
     [java]     at java.lang.ClassLoader.loadClass(ClassLoader.java:251)
     [java]     at 
java.lang.ClassLoader.loadClassInternal(ClassLoader.java:319)
     [java]     at java.lang.Class.forName0(Native Method)
     [java]     at java.lang.Class.forName(Class.java:247)
     [java]     at 
net.jini.loader.pref.PreferredClassProvider.loadClass(PreferredClassProvider.java:613)
     [java]     at 
java.rmi.server.RMIClassLoader.loadClass(RMIClassLoader.java:247)
     [java]     at 
sun.rmi.server.MarshalInputStream.resolveClass(MarshalInputStream.java:197)
     [java]     at 
java.io.ObjectInputStream.readNonProxyDesc(ObjectInputStream.java:1575)
     [java]     at 
java.io.ObjectInputStream.readClassDesc(ObjectInputStream.java:1496)
     [java]     at 
java.io.ObjectInputStream.readOrdinaryObject(ObjectInputStream.java:1732)
     [java]     at 
java.io.ObjectInputStream.readObject0(ObjectInputStream.java:1329)
     [java]     at 
java.io.ObjectInputStream.readObject(ObjectInputStream.java:351)
     [java]     at java.rmi.MarshalledObject.get(MarshalledObject.java:142)
     [java]     at 
com.sun.jini.start.NonActivatableServiceDescriptor.create(NonActivatableServiceDescriptor.java:644)
     [java]     at 
com.sun.jini.test.impl.start.ServiceStarterCreateBadTransientServiceTest.run(ServiceStarterCreateBadTransientServiceTest.java:85)
    

     [java]     at 
com.sun.jini.qa.harness.MasterTest.doTest(MasterTest.java:252)
     [java]     at 
com.sun.jini.qa.harness.MasterTest.main(MasterTest.java:142)
     [java] 7/11/2010 18:28:32 com.sun.jini.mercury.MailboxImpl doInit
     [java] INFO: Mercury started: 
com.sun.jini.mercury.TransientMercuryImpl@19a32e0
     [java] com.sun.jini.qa.harness.TestException: Failed - Created 
proxy 
[com.sun.jini.start.NonActivatableServiceDescriptor$Created@18bbc5a] 
with b ad policy descriptor: [http://bluto:8080/mercury-dl.jar 
http://bluto:8080/jsk-dl.jar, 
file:/opt/src/river/trunk/qa/harness/bogus_policy/defaultmercury.bogus_policy, 
/opt/src/river/trunk/lib/mercury.jar, 
com.sun.jini.mercury.TransientMercuryImpl, 
[/var/tmp/Mercury56623.config], 
com.sun.jini.start.NonActivatableServiceDescriptor$1@e61fd1, 
BasicProxyPreparer[]]
     [java]     at 
com.sun.jini.test.impl.start.ServiceStarterCreateBadTransientServiceTest.run(ServiceStarterCreateBadTransientServiceTest.java:101)


     [java]     at 
com.sun.jini.qa.harness.MasterTest.doTest(MasterTest.java:252)
     [java]     at 
com.sun.jini.qa.harness.MasterTest.main(MasterTest.java:142)
     [java] MasterTest.doTest INFO:
     [java] ============================ CALLING TEARDOWN() 
=============================
     [java]
     [java] ActSys-err: 7/11/2010 18:28:37 
com.sun.jini.phoenix.Activation$Shutdown run
     [java] ActSys-err: INFO: activation daemon shut down
     [java] 7/11/2010 18:28:38 com.sun.jini.tool.ClassServer terminate
     [java] INFO: ClassServer terminated [port 8080]
     [java] 7/11/2010 18:28:38 com.sun.jini.tool.ClassServer terminate
     [java] INFO: ClassServer terminated [port 8082]
     [java] 7/11/2010 18:28:38 com.sun.jini.tool.ClassServer terminate
     [java] INFO: ClassServer terminated [port 8082]
     [java] 7/11/2010 18:28:38 com.sun.jini.tool.ClassServer terminate
     [java] INFO: ClassServer terminated [port 8080]
     [java] 7/11/2010 18:28:38 com.sun.jini.tool.ClassServer terminate
     [java] INFO: ClassServer terminated [port 9081]
     [java] 7/11/2010 18:28:38 com.sun.jini.tool.ClassServer terminate
     [java] INFO: ClassServer terminated [port 9081]
     [java]
     [java] TIME: 18:28:39
     [java]
     [java] Test process was destroyed and returned code 1
     [java] 
com/sun/jini/test/impl/start/ServiceStarterCreateBadTransientServiceTest.td
     [java] Test Failed: Test Failed: 
com.sun.jini.qa.harness.TestException: Failed - Created proxy 
[com.sun.jini.start.NonActivatableServiceDescriptor$Created@18bbc5a] 
with bad policy descriptor: [http://bluto:8080/mercury-dl.jar 
http://bluto:8080/jsk-dl.jar, 
file:/opt/src/river/trunk/qa/harness/bogus_policy/defaultmercury.bogus_policy, 
/opt/src/river/trunk/lib/mercury.jar, 
com.sun.jini.mercury.TransientMercuryImpl, 
[/var/tmp/Mercury56623.config], 
com.sun.jini.start.NonActivatableServiceDescriptor$1@e61fd1, 
BasicProxyPreparer[]]
     [java]
     [java]
     [java] -----------------------------------------
     [java]
     [java] Running 
com/sun/jini/test/impl/start/ServiceStarterCreateSharedBadActServiceTest.td
     [java] Time is Sun Nov 07 18:28:44 EST 2010
     [java] Starting test in separate process with command:
     [java] /usr/jdk/instances/jdk1.6.0/jre/bin/java 
-Djava.security.policy=file:/opt/src/river/trunk/qa/harness/policy/defaulttest.policy 
-Djava.rmi.server.codebase=http://bluto:8082/qa1-start-probe-dl.jar -cp 
/opt/src/river/trunk/qa/lib/jiniharness.jar:/opt/src/river/trunk/qa/lib/jinitests.jar:/opt/src/river/trunk/lib/jsk-platform.jar:/opt/src/river/trunk/lib/jsk-lib.jar

-client 
-Djava.ext.dirs=/usr/jdk/instances/jdk1.6.0/jre/lib/ext:/usr/jdk/packages/lib/ext:/opt/src/river/trunk/qa/lib-ext:/opt/src/river/trunk/lib-ext

-Dcom.sun.jini.jsk.port=8080 -Dcom.sun.jini.qa.port=9081 
-Dcom.sun.jini.jsk.home=/opt/src/river/trunk 
-Dcom.sun.jini.qa.home=/opt/src/river/trunk/qa 
-Dcom.sun.jini.qa.harness.harnessJar=/opt/src/river/trunk/qa/lib/jiniharness.jar 
-Dcom.sun.jini.qa.harness.testJar=/opt/src/river/trunk/qa/lib/jinitests.jar 
-Dcom.sun.jini.qa.harness.runjiniserver=true 
-Dcom.sun.jini.qa.harness.runkitserver=true 
-Djava.security.properties=file:/opt/src/river/trunk/qa/harness/trust/dynamic-policy.properties

-Dcom.sun.jini.qa.harness.testhosts= 
-Djava.util.logging.config.file=/home/peter/logging.properties 
-Dcom.sun.jini.test.home=/opt/src/river/trunk/qa 
-Dcom.sun.jini.test.port=8082 
-Dcom.sun.jini.qa.harness.policies=file:/opt/src/river/trunk/qa/src/com/sun/jini/test/resources/jinitest.policy

-Djava.ext.dirs=/usr/jdk/instances/jdk1.6.0/jre/lib/ext:/usr/jdk/packages/lib/ext:/opt/src/river/trunk/qa/lib-ext:/opt/src/river/trunk/lib-ext

com.sun.jini.qa.harness.MasterTest 
com/sun/jini/test/impl/start/ServiceStarterCreateSharedBadActServiceTest.td
     [java]
     [java] TIME: 18:28:46
     [java]
     [java] MasterTest.doTest INFO:
     [java] ============================== CALLING SETUP() 
==============================
     [java]
     [java] 7/11/2010 18:28:46 com.sun.jini.tool.ClassServer run
     [java] INFO: ClassServer started [[/opt/src/river/trunk/qa/lib/], 
port 9081]
     [java] 7/11/2010 18:28:46 com.sun.jini.tool.ClassServer run
     [java] INFO: ClassServer started [[/opt/src/river/trunk/lib-dl/], 
port 8080]
     [java] 7/11/2010 18:28:46 com.sun.jini.tool.ClassServer run
     [java] INFO: ClassServer started [[/opt/src/river/trunk/qa/lib/], 
port 8082]
     [java] ActSys-err: 7/11/2010 18:28:51 
com.sun.jini.phoenix.Activation init
     [java] ActSys-err: INFO: activation daemon started
     [java]
     [java] TIME: 18:29:00
     [java]
     [java] MasterTest.doTest INFO:
     [java] =============================== CALLING RUN() 
===============================
     [java]
     [java] ServiceStarterCreateSharedBadActServiceTest.run INFO: 
codebase = http://bluto:8080/mercury-dl.jar http://bluto:8080/jsk-dl.jar
     [java] ServiceStarterCreateSharedBadActServiceTest.run INFO: policy 
= file:/opt/src/river/trunk/qa/harness/policy/defaultmercury.policy
     [java] ServiceStarterCreateSharedBadActServiceTest.run INFO: impl = 
com.sun.jini.mercury.ActivatableMercuryImpl
     [java] ServiceStarterCreateSharedBadActServiceTest.run INFO: 
classpath = /opt/src/river/trunk/lib/mercury.jar
     [java] 7/11/2010 18:29:06 com.sun.jini.start.HTTPDStatus httpdWarning
     [java] WARNING: Problem accessing desired 
URL[http://bluto:8080/mercury-bogus-dl.jar]: 
java.io.FileNotFoundException: http://bluto:8080/mercury-bogus-dl.jar.
     [java] ActSys-err: 7/11/2010 18:29:08:Group-1:err:7/11/2010 
18:29:08 com.sun.jini.mercury.MailboxImpl doInit
     [java] ActSys-err: 7/11/2010 18:29:08:Group-1:err:INFO: Mercury 
started: com.sun.jini.mercury.ActivatableMercuryImpl@6ed322
     [java] ServiceStarterCreateSharedBadActServiceTest.run INFO: 
Expected Failure -- with a badcodebase descriptor: 
[http://bluto:8080/mercury-bogus-dl.jar http://bluto:8080/jsk-dl.jar, 
file:/opt/src/river/trunk/qa/harness/policy/defaultmercury.policy, 
/opt/src/river/trunk/lib/mercury.jar, 
com.sun.jini.mercury.ActivatableMercuryImpl, 
[/var/tmp/Mercury40350.config], 
com.sun.jini.start.NonActivatableServiceDescriptor$1@1901437, 
BasicProxyPreparer[], BasicProxyPreparer[], /var/tmp/sgrp40348dir, true, 
, 1098]
     [java] java.rmi.UnmarshalException: activation failed; nested 
exception is:
     [java]     java.lang.ClassNotFoundException: 
com.sun.jini.mercury.MailboxBackEnd
     [java]     at com.sun.jini.phoenix.AID.activate(AID.java:79)
     [java]     at 
com.sun.jini.start.SharedActivatableServiceDescriptor.create(SharedActivatableServiceDescriptor.java:630)
     [java]     at 
com.sun.jini.test.impl.start.ServiceStarterCreateSharedBadActServiceTest.run(ServiceStarterCreateSharedBadActServiceTest.java:96)
    

     [java]     at 
com.sun.jini.qa.harness.MasterTest.doTest(MasterTest.java:252)
     [java]     at 
com.sun.jini.qa.harness.MasterTest.main(MasterTest.java:142)
     [java] Caused by: java.lang.ClassNotFoundException: 
com.sun.jini.mercury.MailboxBackEnd
     [java]     at java.net.URLClassLoader$1.run(URLClassLoader.java:200)
     [java]     at java.security.AccessController.doPrivileged(Native 
Method)
     [java]     at 
java.net.URLClassLoader.findClass(URLClassLoader.java:188)
     [java]     at java.lang.ClassLoader.loadClass(ClassLoader.java:306)
     [java]     at 
net.jini.loader.pref.PreferredClassLoader.loadClass(PreferredClassLoader.java:942)
     [java]     at java.lang.ClassLoader.loadClass(ClassLoader.java:251)
     [java]     at 
java.lang.ClassLoader.loadClassInternal(ClassLoader.java:319)
     [java]     at java.lang.Class.forName0(Native Method)
     [java]     at java.lang.Class.forName(Class.java:247)
     [java]     at 
net.jini.loader.pref.PreferredClassProvider.loadProxyInterfaces(PreferredClassProvider.java:1360)
     [java]     at 
net.jini.loader.pref.PreferredClassProvider.loadProxyClass(PreferredClassProvider.java:1241)
     [java]     at 
net.jini.loader.pref.PreferredClassProvider.loadProxyClass(PreferredClassProvider.java:1145)
     [java]     at 
java.rmi.server.RMIClassLoader.loadProxyClass(RMIClassLoader.java:294)
     [java]     at 
net.jini.loader.ClassLoading.loadProxyClass(ClassLoading.java:240)
     [java]     at 
net.jini.io.MarshalInputStream.resolveProxyClass(MarshalInputStream.java:373)
     [java]     at 
java.io.ObjectInputStream.readProxyDesc(ObjectInputStream.java:1531)
     [java]     at 
java.io.ObjectInputStream.readClassDesc(ObjectInputStream.java:1493)
     [java]     at 
java.io.ObjectInputStream.readOrdinaryObject(ObjectInputStream.java:1732)
     [java]     at 
java.io.ObjectInputStream.readObject0(ObjectInputStream.java:1329)
     [java]     at 
java.io.ObjectInputStream.readObject(ObjectInputStream.java:351)
     [java]     at 
net.jini.io.MarshalledInstance.get(MarshalledInstance.java:358)
     [java]     at 
net.jini.io.MarshalledInstance.get(MarshalledInstance.java:287)
     [java]     at 
com.sun.jini.proxy.MarshalledWrapper.get(MarshalledWrapper.java:127)
     [java]     at com.sun.jini.phoenix.AID.activate(AID.java:73)
     [java]     ... 4 more
     [java] ActSys-err: 7/11/2010 18:29:09:Group-1:err:7/11/2010 
18:29:09 com.sun.jini.mercury.MailboxImpl doInit
     [java] ActSys-err: 7/11/2010 18:29:09:Group-1:err:INFO: Mercury 
started: com.sun.jini.mercury.ActivatableMercuryImpl@1de45e2
     [java] com.sun.jini.qa.harness.TestException: Created proxy: 
com.sun.jini.mercury.MailboxProxy$ConstrainableMailboxProxy@93c11607 
with a bad policy descriptor: [http://bluto:8080/mercury-dl.jar 
http://bluto:8080/jsk-dl.jar, 
file:/opt/src/river/trunk/qa/harness/policy_bogus/defaultmercury.policy_bogus, 
/opt/src/river/trunk/lib/mercury.jar, 
com.sun.jini.mercury.ActivatableMercuryImpl, 
[/var/tmp/Mercury40350.config], 
com.sun.jini.start.NonActivatableServiceDescriptor$1@1901437, 
BasicProxyPreparer[], BasicProxyPreparer[], /var/tmp/sgrp40348dir, true, 
, 1098]
     [java]     at 
com.sun.jini.test.impl.start.ServiceStarterCreateSharedBadActServiceTest.run(ServiceStarterCreateSharedBadActServiceTest.java:119)
    
[java]     at com.sun.jini.qa.harness.MasterTest.doTest(MasterTest.java:252)
     [java]     at 
com.sun.jini.qa.harness.MasterTest.main(MasterTest.java:142)
     [java] MasterTest.doTest INFO:
     [java] ============================ CALLING TEARDOWN() 
=============================
     [java]
     [java] ActSys-err: 7/11/2010 18:29:15 
com.sun.jini.phoenix.Activation$Shutdown run
     [java] ActSys-err: INFO: activation daemon shut down
     [java] 7/11/2010 18:29:16 com.sun.jini.tool.ClassServer terminate
     [java] INFO: ClassServer terminated [port 8080]
     [java] 7/11/2010 18:29:16 com.sun.jini.tool.ClassServer terminate
     [java] INFO: ClassServer terminated [port 8082]
     [java] 7/11/2010 18:29:16 com.sun.jini.tool.ClassServer terminate
     [java] INFO: ClassServer terminated [port 8082]
     [java] 7/11/2010 18:29:16 com.sun.jini.tool.ClassServer terminate
     [java] INFO: ClassServer terminated [port 9081]
     [java] 7/11/2010 18:29:16 com.sun.jini.tool.ClassServer terminate
     [java] INFO: ClassServer terminated [port 8080]
     [java] 7/11/2010 18:29:16 com.sun.jini.tool.ClassServer terminate
     [java] INFO: ClassServer terminated [port 9081]
     [java]
     [java] TIME: 18:29:16
     [java]
     [java] Test process was destroyed and returned code 1
     [java] 
com/sun/jini/test/impl/start/ServiceStarterCreateSharedBadActServiceTest.td
     [java] Test Failed: Test Failed: 
com.sun.jini.qa.harness.TestException: Created proxy: 
com.sun.jini.mercury.MailboxProxy$ConstrainableMailboxProxy@93c11607 
with a bad policy descriptor: [http://bluto:8080/mercury-dl.jar 
http://bluto:8080/jsk-dl.jar, 
file:/opt/src/river/trunk/qa/harness/policy_bogus/defaultmercury.policy_bogus, 
/opt/src/river/trunk/lib/mercury.jar, 
com.sun.jini.mercury.ActivatableMercuryImpl, 
[/var/tmp/Mercury40350.config], 
com.sun.jini.start.NonActivatableServiceDescriptor$1@1901437, 
BasicProxyPreparer[], BasicProxyPreparer[], /var/tmp/sgrp40348dir, true, 
, 1098]
     [java]
     [java]
     [java] -----------------------------------------
     [java]
     [java] SUMMARY =================================
     [java]
     [java] 
com/sun/jini/test/impl/start/ServiceStarterCreateBadTransientServiceTest.td
     [java] Test Failed: Test Failed: 
com.sun.jini.qa.harness.TestException: Failed - Created proxy 
[com.sun.jini.start.NonActivatableServiceDescriptor$Created@18bbc5a] 
with bad policy descriptor: [http://bluto:8080/mercury-dl.jar 
http://bluto:8080/jsk-dl.jar, 
file:/opt/src/river/trunk/qa/harness/bogus_policy/defaultmercury.bogus_policy, 
/opt/src/river/trunk/lib/mercury.jar, 
com.sun.jini.mercury.TransientMercuryImpl, 
[/var/tmp/Mercury56623.config], 
com.sun.jini.start.NonActivatableServiceDescriptor$1@e61fd1, 
BasicProxyPreparer[]]
     [java]
     [java] -----------------------------------------
     [java] 
com/sun/jini/test/impl/start/ServiceStarterCreateSharedBadActServiceTest.td
     [java] Test Failed: Test Failed: 
com.sun.jini.qa.harness.TestException: Created proxy: 
com.sun.jini.mercury.MailboxProxy$ConstrainableMailboxProxy@93c11607 
with a bad policy descriptor: [http://bluto:8080/mercury-dl.jar 
http://bluto:8080/jsk-dl.jar, 
file:/opt/src/river/trunk/qa/harness/policy_bogus/defaultmercury.policy_bogus, 
/opt/src/river/trunk/lib/mercury.jar, 
com.sun.jini.mercury.ActivatableMercuryImpl, 
[/var/tmp/Mercury40350.config], 
com.sun.jini.start.NonActivatableServiceDescriptor$1@1901437, 
BasicProxyPreparer[], BasicProxyPreparer[], /var/tmp/sgrp40348dir, true, 
, 1098]
     [java]
     [java] -----------------------------------------
     [java]
     [java] # of tests started   = 2
     [java] # of tests completed = 2
     [java] # of tests passed    = 0
     [java] # of tests failed    = 2
     [java]
     [java] -----------------------------------------
     [java]
     [java]    Date finished:
     [java]       Sun Nov 07 18:29:21 EST 2010
     [java]    Time elapsed:
     [java]       69 seconds
     [java]
     [java] Java Result: 1

collect-result:

BUILD FAILED
/opt/src/river/trunk/qa/build.xml:288: condition satisfied

Total time: 1 minute 17 seconds



Peter Firmstone wrote:
> This felt like it took forever!
>
>     [java] -----------------------------------------
>     [java]
>     [java] # of tests started   = 1410
>     [java] # of tests completed = 1410
>     [java] # of tests skipped   = 46
>     [java] # of tests passed    = 1408
>     [java] # of tests failed    = 2
>     [java]
>     [java] -----------------------------------------
>     [java]
>     [java]    Date finished:
>     [java]       Sun Nov 07 16:17:16 EST 2010
>     [java]    Time elapsed:
>     [java]       78765 seconds
>     [java]
>     [java] Java Result: 1
>
> collect-result:
>
> BUILD FAILED
> /opt/src/river/trunk/build.xml:2096: The following error occurred 
> while executing this line:
> /opt/src/river/trunk/qa/build.xml:337: The following error occurred 
> while executing this line:
> /opt/src/river/trunk/qa/build.xml:311: condition satisfied
>
> Total time: 1,313 minutes 31 seconds
> bash-3.00$
>
> The tests that failed:
>
>     [java] -----------------------------------------
>     [java] 
> com/sun/jini/test/impl/start/ServiceStarterCreateBadTransientServiceTest.td 
>
>     [java] Test Failed: Test Failed: 
> com.sun.jini.qa.harness.TestException: Failed - Created proxy 
> [com.sun.jini.start.NonActivatableServiceDescriptor$Created@16acdd1] 
> with bad policy descriptor: [http://bluto:8080/mercury-dl.jar 
> http://bluto:8080/jsk-dl.jar, 
> file:/opt/src/river/trunk/qa/harness/bogus_policy/defaultmercury.bogus_policy, 
> /opt/src/river/trunk/lib/mercury.jar, 
> com.sun.jini.mercury.TransientMercuryImpl, 
> [/var/tmp/Mercury4562.config], 
> com.sun.jini.start.NonActivatableServiceDescriptor$1@e020c9, 
> BasicProxyPreparer[]]
>     [java]
>     [java] -----------------------------------------
>     [java] com/sun/jini/test/impl/start/ServiceStarterCreateEmptyTest.td
>     [java] Test Passed: OK
>     [java]
>     [java] -----------------------------------------
>     [java] 
> com/sun/jini/test/impl/start/ServiceStarterCreateSharedBadActServiceTest.td 
>
>     [java] Test Failed: Test Failed: 
> com.sun.jini.qa.harness.TestException: Created proxy: 
> com.sun.jini.mercury.MailboxProxy$ConstrainableMailboxProxy@cecf5f15 
> with a bad policy descriptor: [http://bluto:8080/mercury-dl.jar 
> http://bluto:8080/jsk-dl.jar, 
> file:/opt/src/river/trunk/qa/harness/policy_bogus/defaultmercury.policy_bogus, 
> /opt/src/river/trunk/lib/mercury.jar, 
> com.sun.jini.mercury.ActivatableMercuryImpl, 
> [/var/tmp/Mercury39108.config], 
> com.sun.jini.start.NonActivatableServiceDescriptor$1@158f9d3, 
> BasicProxyPreparer[], BasicProxyPreparer[], /var/tmp/sgrp39106dir, 
> true, , 1098]
>     [java]
>     [java] -----------------------------------------
>
>


Mime
View raw message