river-dev mailing list archives

Site index · List index
Message view « Date » · « Thread »
Top « Date » · « Thread »
From Sim IJskes - QCG <...@qcg.nl>
Subject Re: Build failed in Hudson: River-trunk-QA-solaris #1
Date Wed, 03 Nov 2010 07:50:18 GMT
Is this a new error? To see more of the environment i'm going to put the 
diagnostics target earlier in the build.

      [java] -----------------------------------------
      [java] 
com/sun/jini/test/spec/jeri/ssl/SslNewRequestConflictingConstraints.td
      [java] Test Failed: Test Failed with an Unexpected Exception: 
java.lang.OutOfMemoryError: Java heap space
      [java]
      [java] -----------------------------------------
      [java] com/sun/jini/test/spec/jeri/ssl/SslNullPointerException.td
      [java] Test Failed: Test Failed with an Unexpected Exception: 
java.lang.OutOfMemoryError: Java heap space
      [java]
      [java] -----------------------------------------
      [java] com/sun/jini/test/spec/jeri/ssl/SslRobustnessTest.td
      [java] Test Failed: Test Failed with an Unexpected Exception: 
java.lang.OutOfMemoryError: Java heap space
      [java]
      [java] -----------------------------------------
      [java] com/sun/jini/test/spec/jeri/ssl/SslServerEndpoint.td
      [java] Test Failed: Test Failed with an Unexpected Exception: 
java.lang.OutOfMemoryError: Java heap space
      [java]
      [java] -----------------------------------------


On 11/03/2010 07:17 AM, Apache Hudson Server wrote:
> See<https://hudson.apache.org/hudson/job/River-trunk-QA-solaris/1/>
>       [java] # of tests started   = 1410
>       [java] # of tests completed = 1410
>       [java] # of tests skipped   = 46
>       [java] # of tests passed    = 1398
>       [java] # of tests failed    = 12

Mime
View raw message