river-dev mailing list archives

Site index · List index
Message view « Date » · « Thread »
Top « Date » · « Thread »
From Apache Hudson Server <hud...@hudson.apache.org>
Subject Build failed in Hudson: River-QA » eventmailbox,JDK 1.6 (latest),osx #17
Date Mon, 29 Nov 2010 07:53:22 GMT
See <https://hudson.apache.org/hudson/job/River-QA/./category=eventmailbox,jdk=JDK%201.6%20(latest),label=osx/17/>

------------------------------------------
[...truncated 23217 lines...]
     [java] 
     [java] -----------------------------------------
     [java] com/sun/jini/test/spec/eventmailbox/EMSLCT.td
     [java] Test Failed: Test Failed: com.sun.jini.qa.harness.TestException: Exception has
been catched in specifyServices: Problem creating service for net.jini.core.lookup.ServiceRegistrar;
nested exception is: 
     [java] 	RemoteException occurred in server thread; nested exception is: 
     [java] 	java.rmi.RemoteException: Create failed; nested exception is: 
     [java] 	java.lang.reflect.InvocationTargetException
     [java] 
     [java] -----------------------------------------
     [java] com/sun/jini/test/spec/eventmailbox/EMSLCT_PULL.td
     [java] Test Failed: Test Failed: com.sun.jini.qa.harness.TestException: Exception has
been catched in specifyServices: Problem creating service for net.jini.core.lookup.ServiceRegistrar;
nested exception is: 
     [java] 	RemoteException occurred in server thread; nested exception is: 
     [java] 	java.rmi.RemoteException: Create failed; nested exception is: 
     [java] 	java.lang.reflect.InvocationTargetException
     [java] 
     [java] -----------------------------------------
     [java] com/sun/jini/test/spec/eventmailbox/EMSLCT_PULL2.td
     [java] Test Failed: Test Failed: com.sun.jini.qa.harness.TestException: Exception has
been catched in specifyServices: Problem creating service for net.jini.core.lookup.ServiceRegistrar;
nested exception is: 
     [java] 	RemoteException occurred in server thread; nested exception is: 
     [java] 	java.rmi.RemoteException: Create failed; nested exception is: 
     [java] 	java.lang.reflect.InvocationTargetException
     [java] 
     [java] -----------------------------------------
     [java] com/sun/jini/test/spec/eventmailbox/EMSLET.td
     [java] Test Failed: Test Failed: com.sun.jini.qa.harness.TestException: Exception has
been catched in specifyServices: Problem creating service for net.jini.core.lookup.ServiceRegistrar;
nested exception is: 
     [java] 	RemoteException occurred in server thread; nested exception is: 
     [java] 	java.rmi.RemoteException: Create failed; nested exception is: 
     [java] 	java.lang.reflect.InvocationTargetException
     [java] 
     [java] -----------------------------------------
     [java] com/sun/jini/test/spec/eventmailbox/EMSLET_PULL.td
     [java] Test Failed: Test Failed: com.sun.jini.qa.harness.TestException: Exception has
been catched in specifyServices: Problem creating service for net.jini.core.lookup.ServiceRegistrar;
nested exception is: 
     [java] 	RemoteException occurred in server thread; nested exception is: 
     [java] 	java.rmi.RemoteException: Create failed; nested exception is: 
     [java] 	java.lang.reflect.InvocationTargetException
     [java] 
     [java] -----------------------------------------
     [java] com/sun/jini/test/spec/eventmailbox/EMSLST.td
     [java] Test Failed: Test Failed: com.sun.jini.qa.harness.TestException: Exception has
been catched in specifyServices: Problem creating service for net.jini.core.lookup.ServiceRegistrar;
nested exception is: 
     [java] 	RemoteException occurred in server thread; nested exception is: 
     [java] 	java.rmi.RemoteException: Create failed; nested exception is: 
     [java] 	java.lang.reflect.InvocationTargetException
     [java] 
     [java] -----------------------------------------
     [java] com/sun/jini/test/spec/eventmailbox/EMSLST2.td
     [java] Test Failed: Test Failed: com.sun.jini.qa.harness.TestException: Exception has
been catched in specifyServices: Problem creating service for net.jini.core.lookup.ServiceRegistrar;
nested exception is: 
     [java] 	RemoteException occurred in server thread; nested exception is: 
     [java] 	java.rmi.RemoteException: Create failed; nested exception is: 
     [java] 	java.lang.reflect.InvocationTargetException
     [java] 
     [java] -----------------------------------------
     [java] com/sun/jini/test/spec/eventmailbox/EMSLST2_PULL.td
     [java] Test Failed: Test Failed: com.sun.jini.qa.harness.TestException: Exception has
been catched in specifyServices: Problem creating service for net.jini.core.lookup.ServiceRegistrar;
nested exception is: 
     [java] 	RemoteException occurred in server thread; nested exception is: 
     [java] 	java.rmi.RemoteException: Create failed; nested exception is: 
     [java] 	java.lang.reflect.InvocationTargetException
     [java] 
     [java] -----------------------------------------
     [java] com/sun/jini/test/spec/eventmailbox/EMSLST3.td
     [java] Test Failed: Test Failed: com.sun.jini.qa.harness.TestException: Exception has
been catched in specifyServices: Problem creating service for net.jini.core.lookup.ServiceRegistrar;
nested exception is: 
     [java] 	RemoteException occurred in server thread; nested exception is: 
     [java] 	java.rmi.RemoteException: Create failed; nested exception is: 
     [java] 	java.lang.reflect.InvocationTargetException
     [java] 
     [java] -----------------------------------------
     [java] com/sun/jini/test/spec/eventmailbox/EMSLST3_PULL.td
     [java] Test Failed: Test Failed: com.sun.jini.qa.harness.TestException: Exception has
been catched in specifyServices: Problem creating service for net.jini.core.lookup.ServiceRegistrar;
nested exception is: 
     [java] 	RemoteException occurred in server thread; nested exception is: 
     [java] 	java.rmi.RemoteException: Create failed; nested exception is: 
     [java] 	java.lang.reflect.InvocationTargetException
     [java] 
     [java] -----------------------------------------
     [java] com/sun/jini/test/spec/eventmailbox/EMSLST4.td
     [java] Test Failed: Test Failed: com.sun.jini.qa.harness.TestException: Exception has
been catched in specifyServices: Problem creating service for net.jini.core.lookup.ServiceRegistrar;
nested exception is: 
     [java] 	RemoteException occurred in server thread; nested exception is: 
     [java] 	java.rmi.RemoteException: Create failed; nested exception is: 
     [java] 	java.lang.reflect.InvocationTargetException
     [java] 
     [java] -----------------------------------------
     [java] com/sun/jini/test/spec/eventmailbox/EMSLST4_PULL.td
     [java] Test Failed: Test Failed: com.sun.jini.qa.harness.TestException: Exception has
been catched in specifyServices: Problem creating service for net.jini.core.lookup.ServiceRegistrar;
nested exception is: 
     [java] 	RemoteException occurred in server thread; nested exception is: 
     [java] 	java.rmi.RemoteException: Create failed; nested exception is: 
     [java] 	java.lang.reflect.InvocationTargetException
     [java] 
     [java] -----------------------------------------
     [java] com/sun/jini/test/spec/eventmailbox/EMSLST_PULL.td
     [java] Test Failed: Test Failed: com.sun.jini.qa.harness.TestException: Exception has
been catched in specifyServices: Problem creating service for net.jini.core.lookup.ServiceRegistrar;
nested exception is: 
     [java] 	RemoteException occurred in server thread; nested exception is: 
     [java] 	java.rmi.RemoteException: Create failed; nested exception is: 
     [java] 	java.lang.reflect.InvocationTargetException
     [java] 
     [java] -----------------------------------------
     [java] com/sun/jini/test/spec/eventmailbox/EMSNSOT.td
     [java] Test Failed: Test Failed: com.sun.jini.qa.harness.TestException: Exception has
been catched in specifyServices: Problem creating service for net.jini.core.lookup.ServiceRegistrar;
nested exception is: 
     [java] 	RemoteException occurred in server thread; nested exception is: 
     [java] 	java.rmi.RemoteException: Create failed; nested exception is: 
     [java] 	java.lang.reflect.InvocationTargetException
     [java] 
     [java] -----------------------------------------
     [java] com/sun/jini/test/spec/eventmailbox/EMSNSOT_PULL.td
     [java] Test Failed: Test Failed: com.sun.jini.qa.harness.TestException: Exception has
been catched in specifyServices: Problem creating service for net.jini.core.lookup.ServiceRegistrar;
nested exception is: 
     [java] 	RemoteException occurred in server thread; nested exception is: 
     [java] 	java.rmi.RemoteException: Create failed; nested exception is: 
     [java] 	java.lang.reflect.InvocationTargetException
     [java] 
     [java] -----------------------------------------
     [java] com/sun/jini/test/spec/eventmailbox/EMSRET.td
     [java] Test Failed: Test Failed: com.sun.jini.qa.harness.TestException: Exception has
been catched in specifyServices: Problem creating service for net.jini.core.lookup.ServiceRegistrar;
nested exception is: 
     [java] 	RemoteException occurred in server thread; nested exception is: 
     [java] 	java.rmi.RemoteException: Create failed; nested exception is: 
     [java] 	java.lang.reflect.InvocationTargetException
     [java] 
     [java] -----------------------------------------
     [java] com/sun/jini/test/spec/eventmailbox/EMSRET_PULL.td
     [java] Test Failed: Test Failed: com.sun.jini.qa.harness.TestException: Exception has
been catched in specifyServices: Problem creating service for net.jini.core.lookup.ServiceRegistrar;
nested exception is: 
     [java] 	RemoteException occurred in server thread; nested exception is: 
     [java] 	java.rmi.RemoteException: Create failed; nested exception is: 
     [java] 	java.lang.reflect.InvocationTargetException
     [java] 
     [java] -----------------------------------------
     [java] com/sun/jini/test/spec/eventmailbox/EMSRIFT.td
     [java] Test Failed: Test Failed: com.sun.jini.qa.harness.TestException: Exception has
been catched in specifyServices: Problem creating service for net.jini.core.lookup.ServiceRegistrar;
nested exception is: 
     [java] 	RemoteException occurred in server thread; nested exception is: 
     [java] 	java.rmi.RemoteException: Create failed; nested exception is: 
     [java] 	java.lang.reflect.InvocationTargetException
     [java] 
     [java] -----------------------------------------
     [java] com/sun/jini/test/spec/eventmailbox/EMSRIFT2.td
     [java] Test Failed: Test Failed: com.sun.jini.qa.harness.TestException: Exception has
been catched in specifyServices: Problem creating service for net.jini.core.lookup.ServiceRegistrar;
nested exception is: 
     [java] 	RemoteException occurred in server thread; nested exception is: 
     [java] 	java.rmi.RemoteException: Create failed; nested exception is: 
     [java] 	java.lang.reflect.InvocationTargetException
     [java] 
     [java] -----------------------------------------
     [java] com/sun/jini/test/spec/eventmailbox/EMSRIFT2_PULL.td
     [java] Test Failed: Test Failed: com.sun.jini.qa.harness.TestException: Exception has
been catched in specifyServices: Problem creating service for net.jini.core.lookup.ServiceRegistrar;
nested exception is: 
     [java] 	RemoteException occurred in server thread; nested exception is: 
     [java] 	java.rmi.RemoteException: Create failed; nested exception is: 
     [java] 	java.lang.reflect.InvocationTargetException
     [java] 
     [java] -----------------------------------------
     [java] com/sun/jini/test/spec/eventmailbox/EMSRIFT_PULL.td
     [java] Test Failed: Test Failed: com.sun.jini.qa.harness.TestException: Exception has
been catched in specifyServices: Problem creating service for net.jini.core.lookup.ServiceRegistrar;
nested exception is: 
     [java] 	RemoteException occurred in server thread; nested exception is: 
     [java] 	java.rmi.RemoteException: Create failed; nested exception is: 
     [java] 	java.lang.reflect.InvocationTargetException
     [java] 
     [java] -----------------------------------------
     [java] com/sun/jini/test/spec/eventmailbox/EMSRIFT_PULL2.td
     [java] Test Failed: Test Failed: com.sun.jini.qa.harness.TestException: Exception has
been catched in specifyServices: Problem creating service for net.jini.core.lookup.ServiceRegistrar;
nested exception is: 
     [java] 	RemoteException occurred in server thread; nested exception is: 
     [java] 	java.rmi.RemoteException: Create failed; nested exception is: 
     [java] 	java.lang.reflect.InvocationTargetException
     [java] 
     [java] -----------------------------------------
     [java] com/sun/jini/test/spec/eventmailbox/EMSRIFT_PULL3.td
     [java] Test Failed: Test Failed: com.sun.jini.qa.harness.TestException: Exception has
been catched in specifyServices: Problem creating service for net.jini.core.lookup.ServiceRegistrar;
nested exception is: 
     [java] 	RemoteException occurred in server thread; nested exception is: 
     [java] 	java.rmi.RemoteException: Create failed; nested exception is: 
     [java] 	java.lang.reflect.InvocationTargetException
     [java] 
     [java] -----------------------------------------
     [java] com/sun/jini/test/spec/eventmailbox/EMSST.td
     [java] Test Failed: Test Failed: com.sun.jini.qa.harness.TestException: Exception has
been catched in specifyServices: Problem creating service for net.jini.core.lookup.ServiceRegistrar;
nested exception is: 
     [java] 	RemoteException occurred in server thread; nested exception is: 
     [java] 	java.rmi.RemoteException: Create failed; nested exception is: 
     [java] 	java.lang.reflect.InvocationTargetException
     [java] 
     [java] -----------------------------------------
     [java] com/sun/jini/test/spec/eventmailbox/EMSST2.td
     [java] Test Failed: Test Failed: com.sun.jini.qa.harness.TestException: Exception has
been catched in specifyServices: Problem creating service for net.jini.core.lookup.ServiceRegistrar;
nested exception is: 
     [java] 	RemoteException occurred in server thread; nested exception is: 
     [java] 	java.rmi.RemoteException: Create failed; nested exception is: 
     [java] 	java.lang.reflect.InvocationTargetException
     [java] 
     [java] -----------------------------------------
     [java] com/sun/jini/test/spec/eventmailbox/EMSST2_PULL.td
     [java] Test Failed: Test Failed: com.sun.jini.qa.harness.TestException: Exception has
been catched in specifyServices: Problem creating service for net.jini.core.lookup.ServiceRegistrar;
nested exception is: 
     [java] 	RemoteException occurred in server thread; nested exception is: 
     [java] 	java.rmi.RemoteException: Create failed; nested exception is: 
     [java] 	java.lang.reflect.InvocationTargetException
     [java] 
     [java] -----------------------------------------
     [java] com/sun/jini/test/spec/eventmailbox/EMSST2_PULL2.td
     [java] Test Failed: Test Failed: com.sun.jini.qa.harness.TestException: Exception has
been catched in specifyServices: Problem creating service for net.jini.core.lookup.ServiceRegistrar;
nested exception is: 
     [java] 	RemoteException occurred in server thread; nested exception is: 
     [java] 	java.rmi.RemoteException: Create failed; nested exception is: 
     [java] 	java.lang.reflect.InvocationTargetException
     [java] 
     [java] -----------------------------------------
     [java] com/sun/jini/test/spec/eventmailbox/EMSST3.td
     [java] Test Failed: Test Failed: com.sun.jini.qa.harness.TestException: Exception has
been catched in specifyServices: Problem creating service for net.jini.core.lookup.ServiceRegistrar;
nested exception is: 
     [java] 	RemoteException occurred in server thread; nested exception is: 
     [java] 	java.rmi.RemoteException: Create failed; nested exception is: 
     [java] 	java.lang.reflect.InvocationTargetException
     [java] 
     [java] -----------------------------------------
     [java] com/sun/jini/test/spec/eventmailbox/EMSST3_PULL.td
     [java] Test Failed: Test Failed: com.sun.jini.qa.harness.TestException: Exception has
been catched in specifyServices: Problem creating service for net.jini.core.lookup.ServiceRegistrar;
nested exception is: 
     [java] 	RemoteException occurred in server thread; nested exception is: 
     [java] 	java.rmi.RemoteException: Create failed; nested exception is: 
     [java] 	java.lang.reflect.InvocationTargetException
     [java] 
     [java] -----------------------------------------
     [java] com/sun/jini/test/spec/eventmailbox/EMSST3_PULL2.td
     [java] Test Failed: Test Failed: com.sun.jini.qa.harness.TestException: Exception has
been catched in specifyServices: Problem creating service for net.jini.core.lookup.ServiceRegistrar;
nested exception is: 
     [java] 	RemoteException occurred in server thread; nested exception is: 
     [java] 	java.rmi.RemoteException: Create failed; nested exception is: 
     [java] 	java.lang.reflect.InvocationTargetException
     [java] 
     [java] -----------------------------------------
     [java] com/sun/jini/test/spec/eventmailbox/EMSST_PULL.td
     [java] Test Failed: Test Failed: com.sun.jini.qa.harness.TestException: Exception has
been catched in specifyServices: Problem creating service for net.jini.core.lookup.ServiceRegistrar;
nested exception is: 
     [java] 	RemoteException occurred in server thread; nested exception is: 
     [java] 	java.rmi.RemoteException: Create failed; nested exception is: 
     [java] 	java.lang.reflect.InvocationTargetException
     [java] 
     [java] -----------------------------------------
     [java] com/sun/jini/test/spec/eventmailbox/EMSST_PULL2.td
     [java] Test Failed: Test Failed: com.sun.jini.qa.harness.TestException: Exception has
been catched in specifyServices: Problem creating service for net.jini.core.lookup.ServiceRegistrar;
nested exception is: 
     [java] 	RemoteException occurred in server thread; nested exception is: 
     [java] 	java.rmi.RemoteException: Create failed; nested exception is: 
     [java] 	java.lang.reflect.InvocationTargetException
     [java] 
     [java] -----------------------------------------
     [java] 
     [java] # of tests started   = 94
     [java] # of tests completed = 94
     [java] # of tests skipped   = 4
     [java] # of tests passed    = 2
     [java] # of tests failed    = 92
     [java] 
     [java] -----------------------------------------
     [java] 
     [java]    Date finished:
     [java]       Sun Nov 28 23:53:21 PST 2010
     [java]    Time elapsed:
     [java]       858 seconds
     [java] 
     [java] Java Result: 1

collect-result:

BUILD FAILED
<https://hudson.apache.org/hudson/job/River-QA/./category=eventmailbox,jdk=JDK%201.6%20(latest),label=osx/ws/build.xml>:74:
The following error occurred while executing this line:
<https://hudson.apache.org/hudson/job/River-QA/./category=eventmailbox,jdk=JDK%201.6%20(latest),label=osx/ws/qa/build.xml>:352:
condition satisfied

Total time: 14 minutes 23 seconds


Mime
View raw message