river-dev mailing list archives

Site index · List index
Message view « Date » · « Thread »
Top « Date » · « Thread »
From Apache Hudson Server <hud...@hudson.apache.org>
Subject Build failed in Hudson: River-QA » jeri,JDK 1.6 (latest),Solaris #16
Date Sun, 28 Nov 2010 22:08:53 GMT
See <https://hudson.apache.org/hudson/job/River-QA/./category=jeri,jdk=JDK%201.6%20(latest),label=Solaris/16/changes>

Changes:

[sijskes] added new matrix target

------------------------------------------
[...truncated 4023 lines...]
     [java] 
     [java] -----------------------------------------
     [java] com/sun/jini/test/spec/jeri/https/HttpsCheckConstraints.td
     [java] Test Passed: OK
     [java] 
     [java] -----------------------------------------
     [java] com/sun/jini/test/spec/jeri/https/HttpsCheckTrustEquivalence.td
     [java] Test Passed: OK
     [java] 
     [java] -----------------------------------------
     [java] com/sun/jini/test/spec/jeri/https/HttpsConstructorAccessor.td
     [java] Test Passed: OK
     [java] 
     [java] -----------------------------------------
     [java] com/sun/jini/test/spec/jeri/https/HttpsEndpointInUse.td
     [java] Test Passed: OK
     [java] 
     [java] -----------------------------------------
     [java] com/sun/jini/test/spec/jeri/https/HttpsEqualityTest.td
     [java] Test Passed: OK
     [java] 
     [java] -----------------------------------------
     [java] com/sun/jini/test/spec/jeri/https/HttpsIllegalArgumentException.td
     [java] Test Passed: OK
     [java] 
     [java] -----------------------------------------
     [java] com/sun/jini/test/spec/jeri/https/HttpsListenContextException.td
     [java] Test Passed: OK
     [java] 
     [java] -----------------------------------------
     [java] com/sun/jini/test/spec/jeri/https/HttpsNewRequestConflictingConstraints.td
     [java] Test Passed: OK
     [java] 
     [java] -----------------------------------------
     [java] com/sun/jini/test/spec/jeri/https/HttpsNullPointerException.td
     [java] Test Passed: OK
     [java] 
     [java] -----------------------------------------
     [java] com/sun/jini/test/spec/jeri/https/HttpsRobustnessTest.td
     [java] Test Passed: OK
     [java] 
     [java] -----------------------------------------
     [java] com/sun/jini/test/spec/jeri/https/HttpsServerConstructorAccessor.td
     [java] Test Failed: Test Failed with an Unexpected Exception: java.lang.SecurityException:
/zonestorage/hudson/home/hudson/hudson-slave/workspace/River-QA/category/jeri/jdk/JDK%201.6%20(latest)/label/Solaris/qa/src/com/sun/jini/test/spec/jeri/transport/resources/ssl.login
(No such file or directory)
     [java] 
     [java] -----------------------------------------
     [java] com/sun/jini/test/spec/jeri/https/HttpsServerEndpoint.td
     [java] Test Passed: OK
     [java] 
     [java] -----------------------------------------
     [java] com/sun/jini/test/spec/jeri/kerberos/KerberosCheckConstraints.td
     [java] Test Skipped: verifiers are: com.sun.jini.qa.harness.SkipTestVerifier
     [java] -----------------------------------------
     [java] com/sun/jini/test/spec/jeri/kerberos/KerberosCheckTrustEquivalence.td
     [java] Test Skipped: verifiers are: com.sun.jini.qa.harness.SkipTestVerifier
     [java] -----------------------------------------
     [java] com/sun/jini/test/spec/jeri/kerberos/KerberosConstructorAccessor.td
     [java] Test Skipped: verifiers are: com.sun.jini.qa.harness.SkipTestVerifier
     [java] -----------------------------------------
     [java] com/sun/jini/test/spec/jeri/kerberos/KerberosEndpointInUse.td
     [java] Test Skipped: verifiers are: com.sun.jini.qa.harness.SkipTestVerifier
     [java] -----------------------------------------
     [java] com/sun/jini/test/spec/jeri/kerberos/KerberosEqualityTest.td
     [java] Test Skipped: verifiers are: com.sun.jini.qa.harness.SkipTestVerifier
     [java] -----------------------------------------
     [java] com/sun/jini/test/spec/jeri/kerberos/KerberosIllegalArgumentException.td
     [java] Test Skipped: verifiers are: com.sun.jini.qa.harness.SkipTestVerifier
     [java] -----------------------------------------
     [java] com/sun/jini/test/spec/jeri/kerberos/KerberosListenContextException.td
     [java] Test Skipped: verifiers are: com.sun.jini.qa.harness.SkipTestVerifier
     [java] -----------------------------------------
     [java] com/sun/jini/test/spec/jeri/kerberos/KerberosNewRequestConflictingConstraints.td
     [java] Test Skipped: verifiers are: com.sun.jini.qa.harness.SkipTestVerifier
     [java] -----------------------------------------
     [java] com/sun/jini/test/spec/jeri/kerberos/KerberosNullPointerException.td
     [java] Test Skipped: verifiers are: com.sun.jini.qa.harness.SkipTestVerifier
     [java] -----------------------------------------
     [java] com/sun/jini/test/spec/jeri/kerberos/KerberosRobustnessTest.td
     [java] Test Skipped: verifiers are: com.sun.jini.qa.harness.SkipTestVerifier
     [java] -----------------------------------------
     [java] com/sun/jini/test/spec/jeri/kerberos/KerberosServerConstructorAccessor.td
     [java] Test Skipped: verifiers are: com.sun.jini.qa.harness.SkipTestVerifier
     [java] -----------------------------------------
     [java] com/sun/jini/test/spec/jeri/kerberos/KerberosServerEndpoint.td
     [java] Test Skipped: verifiers are: com.sun.jini.qa.harness.SkipTestVerifier
     [java] -----------------------------------------
     [java] com/sun/jini/test/spec/jeri/kerberostrustverifier/IsTrustedObject.td
     [java] Test Passed: OK
     [java] 
     [java] -----------------------------------------
     [java] com/sun/jini/test/spec/jeri/mux/ClientAbortTest.td
     [java] Test Passed: OK
     [java] 
     [java] -----------------------------------------
     [java] com/sun/jini/test/spec/jeri/mux/ClientFlowControlTest.td
     [java] Test Passed: OK
     [java] 
     [java] -----------------------------------------
     [java] com/sun/jini/test/spec/jeri/mux/CloseTest.td
     [java] Test Passed: OK
     [java] 
     [java] -----------------------------------------
     [java] com/sun/jini/test/spec/jeri/mux/MuxClientTest.td
     [java] Test Passed: OK
     [java] 
     [java] -----------------------------------------
     [java] com/sun/jini/test/spec/jeri/mux/MuxServerTest.td
     [java] Test Passed: OK
     [java] 
     [java] -----------------------------------------
     [java] com/sun/jini/test/spec/jeri/mux/ServerAbortTest.td
     [java] Test Passed: OK
     [java] 
     [java] -----------------------------------------
     [java] com/sun/jini/test/spec/jeri/mux/ServerFlowControlTest.td
     [java] Test Passed: OK
     [java] 
     [java] -----------------------------------------
     [java] com/sun/jini/test/spec/jeri/proxytrustilfactory/AccessorTest.td
     [java] Test Passed: OK
     [java] 
     [java] -----------------------------------------
     [java] com/sun/jini/test/spec/jeri/proxytrustilfactory/ConstructorAccessorTest.td
     [java] Test Passed: OK
     [java] 
     [java] -----------------------------------------
     [java] com/sun/jini/test/spec/jeri/ssl/SslCheckConstraints.td
     [java] Test Passed: OK
     [java] 
     [java] -----------------------------------------
     [java] com/sun/jini/test/spec/jeri/ssl/SslCheckTrustEquivalence.td
     [java] Test Passed: OK
     [java] 
     [java] -----------------------------------------
     [java] com/sun/jini/test/spec/jeri/ssl/SslConstructorAccessor.td
     [java] Test Passed: OK
     [java] 
     [java] -----------------------------------------
     [java] com/sun/jini/test/spec/jeri/ssl/SslEndpointInUse.td
     [java] Test Passed: OK
     [java] 
     [java] -----------------------------------------
     [java] com/sun/jini/test/spec/jeri/ssl/SslEqualityTest.td
     [java] Test Passed: OK
     [java] 
     [java] -----------------------------------------
     [java] com/sun/jini/test/spec/jeri/ssl/SslIllegalArgumentException.td
     [java] Test Passed: OK
     [java] 
     [java] -----------------------------------------
     [java] com/sun/jini/test/spec/jeri/ssl/SslListenContextException.td
     [java] Test Passed: OK
     [java] 
     [java] -----------------------------------------
     [java] com/sun/jini/test/spec/jeri/ssl/SslNewRequestConflictingConstraints.td
     [java] Test Passed: OK
     [java] 
     [java] -----------------------------------------
     [java] com/sun/jini/test/spec/jeri/ssl/SslNullPointerException.td
     [java] Test Passed: OK
     [java] 
     [java] -----------------------------------------
     [java] com/sun/jini/test/spec/jeri/ssl/SslRobustnessTest.td
     [java] Test Passed: OK
     [java] 
     [java] -----------------------------------------
     [java] com/sun/jini/test/spec/jeri/ssl/SslServerConstructorAccessor.td
     [java] Test Failed: Test Failed with an Unexpected Exception: java.lang.SecurityException:
/zonestorage/hudson/home/hudson/hudson-slave/workspace/River-QA/category/jeri/jdk/JDK%201.6%20(latest)/label/Solaris/qa/src/com/sun/jini/test/spec/jeri/transport/resources/ssl.login
(No such file or directory)
     [java] 
     [java] -----------------------------------------
     [java] com/sun/jini/test/spec/jeri/ssl/SslServerEndpoint.td
     [java] Test Passed: OK
     [java] 
     [java] -----------------------------------------
     [java] com/sun/jini/test/spec/jeri/ssltrustverifier/IsTrustedObject.td
     [java] Test Passed: OK
     [java] 
     [java] -----------------------------------------
     [java] com/sun/jini/test/spec/jeri/tcp/TcpCheckConstraints.td
     [java] Test Passed: OK
     [java] 
     [java] -----------------------------------------
     [java] com/sun/jini/test/spec/jeri/tcp/TcpCheckTrustEquivalence.td
     [java] Test Passed: OK
     [java] 
     [java] -----------------------------------------
     [java] com/sun/jini/test/spec/jeri/tcp/TcpConstructorAccessor.td
     [java] Test Passed: OK
     [java] 
     [java] -----------------------------------------
     [java] com/sun/jini/test/spec/jeri/tcp/TcpEndpointInUse.td
     [java] Test Passed: OK
     [java] 
     [java] -----------------------------------------
     [java] com/sun/jini/test/spec/jeri/tcp/TcpEqualityTest.td
     [java] Test Passed: OK
     [java] 
     [java] -----------------------------------------
     [java] com/sun/jini/test/spec/jeri/tcp/TcpIllegalArgumentException.td
     [java] Test Passed: OK
     [java] 
     [java] -----------------------------------------
     [java] com/sun/jini/test/spec/jeri/tcp/TcpListenContextException.td
     [java] Test Passed: OK
     [java] 
     [java] -----------------------------------------
     [java] com/sun/jini/test/spec/jeri/tcp/TcpNewRequestConflictingConstraints.td
     [java] Test Passed: OK
     [java] 
     [java] -----------------------------------------
     [java] com/sun/jini/test/spec/jeri/tcp/TcpNullPointerException.td
     [java] Test Passed: OK
     [java] 
     [java] -----------------------------------------
     [java] com/sun/jini/test/spec/jeri/tcp/TcpRobustnessTest.td
     [java] Test Passed: OK
     [java] 
     [java] -----------------------------------------
     [java] com/sun/jini/test/spec/jeri/tcp/TcpServerConstructorAccessor.td
     [java] Test Passed: OK
     [java] 
     [java] -----------------------------------------
     [java] com/sun/jini/test/spec/jeri/tcp/TcpServerEndpoint.td
     [java] Test Passed: OK
     [java] 
     [java] -----------------------------------------
     [java] 
     [java] # of tests started   = 122
     [java] # of tests completed = 122
     [java] # of tests skipped   = 12
     [java] # of tests passed    = 119
     [java] # of tests failed    = 3
     [java] 
     [java] -----------------------------------------
     [java] 
     [java]    Date finished:
     [java]       Sun Nov 28 17:08:52 EST 2010
     [java]    Time elapsed:
     [java]       1388 seconds
     [java] 
     [java] Java Result: 1

collect-result:

BUILD FAILED
/zonestorage/hudson<https://hudson.apache.org/hudson/job/River-QA/./category=jeri,jdk=JDK%201.6%20(latest),label=Solaris/ws/build.xml>:71:
The following error occurred while executing this line:
/zonestorage/hudson<https://hudson.apache.org/hudson/job/River-QA/./category=jeri,jdk=JDK%201.6%20(latest),label=Solaris/ws/qa/build.xml>:352:
condition satisfied

Total time: 23 minutes 20 seconds


Mime
View raw message