river-dev mailing list archives

Site index · List index
Message view « Date » · « Thread »
Top « Date » · « Thread »
From Peter Firmstone <j...@zeus.net.au>
Subject Re: all QA tests pass on ubuntu2!
Date Sat, 18 Sep 2010 23:22:58 GMT
bash-3.00$ ant run-tests
Buildfile: build.xml

run-tests:
     [java]
     [java] -----------------------------------------
     [java] CONFIGURATION FILE:
     [java]
     [java]    
/opt/src/river/trunk/qa/src/com/sun/jini/test/resources/qaHarness.prop
     [java]
     [java] -----------------------------------------
     [java] SETTING UP THE TEST LIST:
     [java]
     [java]    Adding test: 
com/sun/jini/test/impl/start/ServiceStarterCreateBadTransientServiceTest.td
     [java]    Adding test: 
com/sun/jini/test/impl/start/ServiceStarterCreateSharedBadActServiceTest.td
     [java]    Adding test: 
com/sun/jini/test/spec/lookupdiscovery/MulticastMonitorAllChange.td
     [java]
     [java] -----------------------------------------
     [java] GENERAL HARNESS CONFIGURATION INFORMATION:
     [java]
     [java]    Date started:
     [java]       Sun Sep 19 09:18:16 EST 2010
     [java]    Installation directory of the JSK:
     [java]       com.sun.jini.jsk.home=/opt/src/river/trunk
     [java]    Installation directory of the harness:
     [java]       com.sun.jini.qa.home=/opt/src/river/trunk/qa
     [java]    Categories being tested:
     [java]       categories=No Categories
     [java] -----------------------------------------
     [java] ENVIRONMENT PROPERTIES:
     [java]
     [java]    JVM information:
     [java]       Java HotSpot(TM) Server VM, 10.0-b23, 32 bit VM mode
     [java]       Sun Microsystems Inc.
     [java]    OS information:
     [java]       SunOS, 5.10, sparc
     [java]
     [java] -----------------------------------------
     [java] STARTING TO RUN THE TESTS
     [java]
     [java]
     [java] Running 
com/sun/jini/test/impl/start/ServiceStarterCreateBadTransientServiceTest.td
     [java] Time is Sun Sep 19 09:18:16 EST 2010
     [java] Starting test in separate process with command:
     [java] /usr/jdk/instances/jdk1.6.0/jre/bin/java 
-Djava.security.policy=file:/opt/src/river/trunk/qa/harness/policy/defaulttest.policy 
-Djava.rmi.server.codebase=http://bluto:8082/qa1-start-probe-dl.jar -cp 
/opt/src/river/trunk/qa/lib/jiniharness.jar:/opt/src/river/trunk/qa/lib/jinitests.jar:/opt/src/river/trunk/lib/jsk-platform.jar:/opt/src/river/trunk/lib/jsk-lib.jar

-client 
-Djava.ext.dirs=/usr/jdk/instances/jdk1.6.0/jre/lib/ext:/usr/jdk/packages/lib/ext:/opt/src/river/trunk/qa/lib-ext:/opt/src/river/trunk/lib-ext

-Dcom.sun.jini.jsk.port=8080 -Dcom.sun.jini.qa.port=8081 
-Dcom.sun.jini.jsk.home=/opt/src/river/trunk 
-Dcom.sun.jini.qa.home=/opt/src/river/trunk/qa 
-Dcom.sun.jini.qa.harness.harnessJar=/opt/src/river/trunk/qa/lib/jiniharness.jar 
-Dcom.sun.jini.qa.harness.testJar=/opt/src/river/trunk/qa/lib/jinitests.jar 
-Dcom.sun.jini.qa.harness.runjiniserver=true 
-Dcom.sun.jini.qa.harness.runkitserver=true 
-Djava.security.properties=file:/opt/src/river/trunk/qa/harness/trust/dynamic-policy.properties

-Dcom.sun.jini.qa.harness.testhosts= 
-Djava.util.logging.config.file=/home/peter/logging.properties 
-Dcom.sun.jini.test.home=/opt/src/river/trunk/qa 
-Dcom.sun.jini.test.port=8082 
-Dcom.sun.jini.qa.harness.policies=file:/opt/src/river/trunk/qa/src/com/sun/jini/test/resources/jinitest.policy

-Djava.ext.dirs=/usr/jdk/instances/jdk1.6.0/jre/lib/ext:/usr/jdk/packages/lib/ext:/opt/src/river/trunk/qa/lib-ext:/opt/src/river/trunk/lib-ext

com.sun.jini.qa.harness.MasterTest 
com/sun/jini/test/impl/start/ServiceStarterCreateBadTransientServiceTest.td
     [java]
     [java] TIME: 09:18:19
     [java]
     [java] MasterTest.doTest INFO:
     [java] ============================== CALLING SETUP() 
==============================
     [java]
     [java] 19/09/2010 09:18:19 com.sun.jini.tool.ClassServer run
     [java] INFO: ClassServer started [[/opt/src/river/trunk/qa/lib/], 
port 8081]
     [java] 19/09/2010 09:18:19 com.sun.jini.tool.ClassServer run
     [java] INFO: ClassServer started [[/opt/src/river/trunk/lib-dl/], 
port 8080]
     [java] 19/09/2010 09:18:19 com.sun.jini.tool.ClassServer run
     [java] INFO: ClassServer started [[/opt/src/river/trunk/qa/lib/], 
port 8082]
     [java] ActSys-err: 19/09/2010 09:18:24 
com.sun.jini.phoenix.Activation init
     [java] ActSys-err: INFO: activation daemon started
     [java]
     [java] TIME: 09:18:32
     [java]
     [java] MasterTest.doTest INFO:
     [java] =============================== CALLING RUN() 
===============================
     [java]
     [java] ServiceStarterCreateBadTransientServiceTest.run INFO: 
codebase = http://bluto:8080/mercury-dl.jar http://bluto:8080/jsk-dl.jar
     [java] ServiceStarterCreateBadTransientServiceTest.run INFO: policy 
= file:/opt/src/river/trunk/qa/harness/policy/defaultmercury.policy
     [java] ServiceStarterCreateBadTransientServiceTest.run INFO: impl = 
com.sun.jini.mercury.TransientMercuryImpl
     [java] ServiceStarterCreateBadTransientServiceTest.run INFO: 
classpath = /opt/src/river/trunk/lib/mercury.jar
     [java] 19/09/2010 09:18:32 com.sun.jini.start.HTTPDStatus httpdWarning
     [java] WARNING: Problem accessing desired 
URL[http://bluto:8080/mercury-dl_bogus.jar]: 
java.io.FileNotFoundException: http://bluto:8080/mercury-dl_bogus.jar.
     [java] 19/09/2010 09:18:33 com.sun.jini.mercury.MailboxImpl doInit
     [java] INFO: Mercury started: 
com.sun.jini.mercury.TransientMercuryImpl@1315d34
     [java] ServiceStarterCreateBadTransientServiceTest.run INFO: 
Expected Failure with bad codebase descriptor: 
[http://bluto:8080/mercury-dl_bogus.jar http://bluto:8080/jsk-dl.jar, 
file:/opt/src/river/trunk/qa/harness/policy/defaultmercury.policy, 
/opt/src/river/trunk/lib/mercury.jar, 
com.sun.jini.mercury.TransientMercuryImpl, 
[/var/tmp/Mercury38825.config], 
com.sun.jini.start.NonActivatableServiceDescriptor$1@1d7fbfb, 
BasicProxyPreparer[]]
     [java] java.lang.ClassNotFoundException: 
com.sun.jini.mercury.MailboxProxy$ConstrainableMailboxProxy
     [java]     at java.net.URLClassLoader$1.run(URLClassLoader.java:200)
     [java]     at java.security.AccessController.doPrivileged(Native 
Method)
     [java]     at 
java.net.URLClassLoader.findClass(URLClassLoader.java:188)
     [java]     at java.lang.ClassLoader.loadClass(ClassLoader.java:306)
     [java]     at 
net.jini.loader.pref.PreferredClassLoader.loadClass(PreferredClassLoader.java:942)
     [java]     at java.lang.ClassLoader.loadClass(ClassLoader.java:251)
     [java]     at 
java.lang.ClassLoader.loadClassInternal(ClassLoader.java:319)
     [java]     at java.lang.Class.forName0(Native Method)
     [java]     at java.lang.Class.forName(Class.java:247)
     [java]     at 
net.jini.loader.pref.PreferredClassProvider.loadClass(PreferredClassProvider.java:613)
     [java]     at 
java.rmi.server.RMIClassLoader.loadClass(RMIClassLoader.java:247)
     [java]     at 
sun.rmi.server.MarshalInputStream.resolveClass(MarshalInputStream.java:197)
     [java]     at 
java.io.ObjectInputStream.readNonProxyDesc(ObjectInputStream.java:1575)
     [java]     at 
java.io.ObjectInputStream.readClassDesc(ObjectInputStream.java:1496)
     [java]     at 
java.io.ObjectInputStream.readOrdinaryObject(ObjectInputStream.java:1732)
     [java]     at 
java.io.ObjectInputStream.readObject0(ObjectInputStream.java:1329)
     [java]     at 
java.io.ObjectInputStream.readObject(ObjectInputStream.java:351)
     [java]     at java.rmi.MarshalledObject.get(MarshalledObject.java:142)
     [java]     at 
com.sun.jini.start.NonActivatableServiceDescriptor.create(NonActivatableServiceDescriptor.java:644)
     [java]     at 
com.sun.jini.test.impl.start.ServiceStarterCreateBadTransientServiceTest.run(ServiceStarterCreateBadTransientServiceTest.java:85)
     [java]     at 
com.sun.jini.qa.harness.MasterTest.doTest(MasterTest.java:249)
     [java]     at 
com.sun.jini.qa.harness.MasterTest.main(MasterTest.java:139)
     [java] 19/09/2010 09:18:34 com.sun.jini.mercury.MailboxImpl doInit
     [java] INFO: Mercury started: 
com.sun.jini.mercury.TransientMercuryImpl@b03be0
     [java] com.sun.jini.qa.harness.TestException: Failed - Created 
proxy 
[com.sun.jini.start.NonActivatableServiceDescriptor$Created@baa466] with 
bad policy descriptor: [http://bluto:8080/mercury-dl.jar 
http://bluto:8080/jsk-dl.jar, 
file:/opt/src/river/trunk/qa/harness/bogus_policy/defaultmercury.bogus_policy, 
/opt/src/river/trunk/lib/mercury.jar, 
com.sun.jini.mercury.TransientMercuryImpl, 
[/var/tmp/Mercury38825.config], 
com.sun.jini.start.NonActivatableServiceDescriptor$1@1d7fbfb, 
BasicProxyPreparer[]]
     [java]     at 
com.sun.jini.test.impl.start.ServiceStarterCreateBadTransientServiceTest.run(ServiceStarterCreateBadTransientServiceTest.java:101)
     [java]     at 
com.sun.jini.qa.harness.MasterTest.doTest(MasterTest.java:249)
     [java]     at 
com.sun.jini.qa.harness.MasterTest.main(MasterTest.java:139)
     [java] MasterTest.doTest INFO:
     [java] ============================ CALLING TEARDOWN() 
=============================
     [java]
     [java] ActSys-err: 19/09/2010 09:18:39 
com.sun.jini.phoenix.Activation$Shutdown run
     [java] ActSys-err: INFO: activation daemon shut down
     [java] 19/09/2010 09:18:40 com.sun.jini.tool.ClassServer terminate
     [java] INFO: ClassServer terminated [port 8081]
     [java] 19/09/2010 09:18:40 com.sun.jini.tool.ClassServer terminate
     [java] INFO: ClassServer terminated [port 8082]
     [java] 19/09/2010 09:18:40 com.sun.jini.tool.ClassServer terminate
     [java] INFO: ClassServer terminated [port 8082]
     [java] 19/09/2010 09:18:40 com.sun.jini.tool.ClassServer terminate
     [java] INFO: ClassServer terminated [port 8080]
     [java] 19/09/2010 09:18:40 com.sun.jini.tool.ClassServer terminate
     [java] INFO: ClassServer terminated [port 8080]
     [java] 19/09/2010 09:18:40 com.sun.jini.tool.ClassServer terminate
     [java] INFO: ClassServer terminated [port 8081]
     [java]
     [java] TIME: 09:18:41
     [java]
     [java] Test process was destroyed and returned code 1
     [java] 
com/sun/jini/test/impl/start/ServiceStarterCreateBadTransientServiceTest.td
     [java] Test Failed: Test Failed: 
com.sun.jini.qa.harness.TestException: Failed - Created proxy 
[com.sun.jini.start.NonActivatableServiceDescriptor$Created@baa466] with 
bad policy descriptor: [http://bluto:8080/mercury-dl.jar 
http://bluto:8080/jsk-dl.jar, 
file:/opt/src/river/trunk/qa/harness/bogus_policy/defaultmercury.bogus_policy, 
/opt/src/river/trunk/lib/mercury.jar, 
com.sun.jini.mercury.TransientMercuryImpl, 
[/var/tmp/Mercury38825.config], 
com.sun.jini.start.NonActivatableServiceDescriptor$1@1d7fbfb, 
BasicProxyPreparer[]]
     [java]
     [java]
     [java] -----------------------------------------
     [java]
     [java] Running 
com/sun/jini/test/impl/start/ServiceStarterCreateSharedBadActServiceTest.td
     [java] Time is Sun Sep 19 09:18:46 EST 2010
     [java] Starting test in separate process with command:
     [java] /usr/jdk/instances/jdk1.6.0/jre/bin/java 
-Djava.security.policy=file:/opt/src/river/trunk/qa/harness/policy/defaulttest.policy 
-Djava.rmi.server.codebase=http://bluto:8082/qa1-start-probe-dl.jar -cp 
/opt/src/river/trunk/qa/lib/jiniharness.jar:/opt/src/river/trunk/qa/lib/jinitests.jar:/opt/src/river/trunk/lib/jsk-platform.jar:/opt/src/river/trunk/lib/jsk-lib.jar

-client 
-Djava.ext.dirs=/usr/jdk/instances/jdk1.6.0/jre/lib/ext:/usr/jdk/packages/lib/ext:/opt/src/river/trunk/qa/lib-ext:/opt/src/river/trunk/lib-ext

-Dcom.sun.jini.jsk.port=8080 -Dcom.sun.jini.qa.port=8081 
-Dcom.sun.jini.jsk.home=/opt/src/river/trunk 
-Dcom.sun.jini.qa.home=/opt/src/river/trunk/qa 
-Dcom.sun.jini.qa.harness.harnessJar=/opt/src/river/trunk/qa/lib/jiniharness.jar 
-Dcom.sun.jini.qa.harness.testJar=/opt/src/river/trunk/qa/lib/jinitests.jar 
-Dcom.sun.jini.qa.harness.runjiniserver=true 
-Dcom.sun.jini.qa.harness.runkitserver=true 
-Djava.security.properties=file:/opt/src/river/trunk/qa/harness/trust/dynamic-policy.properties

-Dcom.sun.jini.qa.harness.testhosts= 
-Djava.util.logging.config.file=/home/peter/logging.properties 
-Dcom.sun.jini.test.home=/opt/src/river/trunk/qa 
-Dcom.sun.jini.test.port=8082 
-Dcom.sun.jini.qa.harness.policies=file:/opt/src/river/trunk/qa/src/com/sun/jini/test/resources/jinitest.policy

-Djava.ext.dirs=/usr/jdk/instances/jdk1.6.0/jre/lib/ext:/usr/jdk/packages/lib/ext:/opt/src/river/trunk/qa/lib-ext:/opt/src/river/trunk/lib-ext

com.sun.jini.qa.harness.MasterTest 
com/sun/jini/test/impl/start/ServiceStarterCreateSharedBadActServiceTest.td
     [java]
     [java] TIME: 09:18:48
     [java]
     [java] MasterTest.doTest INFO:
     [java] ============================== CALLING SETUP() 
==============================
     [java]
     [java] 19/09/2010 09:18:48 com.sun.jini.tool.ClassServer run
     [java] INFO: ClassServer started [[/opt/src/river/trunk/qa/lib/], 
port 8081]
     [java] 19/09/2010 09:18:48 com.sun.jini.tool.ClassServer run
     [java] INFO: ClassServer started [[/opt/src/river/trunk/lib-dl/], 
port 8080]
     [java] 19/09/2010 09:18:48 com.sun.jini.tool.ClassServer run
     [java] INFO: ClassServer started [[/opt/src/river/trunk/qa/lib/], 
port 8082]
     [java] ActSys-err: 19/09/2010 09:18:53 
com.sun.jini.phoenix.Activation init
     [java] ActSys-err: INFO: activation daemon started
     [java]
     [java] TIME: 09:19:02
     [java]
     [java] MasterTest.doTest INFO:
     [java] =============================== CALLING RUN() 
===============================
     [java]
     [java] ServiceStarterCreateSharedBadActServiceTest.run INFO: 
codebase = http://bluto:8080/mercury-dl.jar http://bluto:8080/jsk-dl.jar
     [java] ServiceStarterCreateSharedBadActServiceTest.run INFO: policy 
= file:/opt/src/river/trunk/qa/harness/policy/defaultmercury.policy
     [java] ServiceStarterCreateSharedBadActServiceTest.run INFO: impl = 
com.sun.jini.mercury.ActivatableMercuryImpl
     [java] ServiceStarterCreateSharedBadActServiceTest.run INFO: 
classpath = /opt/src/river/trunk/lib/mercury.jar
     [java] 19/09/2010 09:19:08 com.sun.jini.start.HTTPDStatus httpdWarning
     [java] WARNING: Problem accessing desired 
URL[http://bluto:8080/mercury-bogus-dl.jar]: 
java.io.FileNotFoundException: http://bluto:8080/mercury-bogus-dl.jar.
     [java] ActSys-err: 19/09/2010 09:19:10:Group-1:err:19/09/2010 
09:19:10 com.sun.jini.mercury.MailboxImpl doInit
     [java] ActSys-err: 19/09/2010 09:19:10:Group-1:err:INFO: Mercury 
started: com.sun.jini.mercury.ActivatableMercuryImpl@969c29
     [java] ServiceStarterCreateSharedBadActServiceTest.run INFO: 
Expected Failure -- with a badcodebase descriptor: 
[http://bluto:8080/mercury-bogus-dl.jar http://bluto:8080/jsk-dl.jar, 
file:/opt/src/river/trunk/qa/harness/policy/defaultmercury.policy, 
/opt/src/river/trunk/lib/mercury.jar, 
com.sun.jini.mercury.ActivatableMercuryImpl, 
[/var/tmp/Mercury7998.config], 
com.sun.jini.start.NonActivatableServiceDescriptor$1@158f9d3, 
BasicProxyPreparer[], BasicProxyPreparer[], /var/tmp/sgrp7996dir, true, 
, 1098]
     [java] java.rmi.UnmarshalException: activation failed; nested 
exception is:
     [java]     java.lang.ClassNotFoundException: 
com.sun.jini.mercury.MailboxBackEnd
     [java]     at com.sun.jini.phoenix.AID.activate(AID.java:79)
     [java]     at 
com.sun.jini.start.SharedActivatableServiceDescriptor.create(SharedActivatableServiceDescriptor.java:630)
     [java]     at 
com.sun.jini.test.impl.start.ServiceStarterCreateSharedBadActServiceTest.run(ServiceStarterCreateSharedBadActServiceTest.java:96)
     [java]     at 
com.sun.jini.qa.harness.MasterTest.doTest(MasterTest.java:249)
     [java]     at 
com.sun.jini.qa.harness.MasterTest.main(MasterTest.java:139)
     [java] Caused by: java.lang.ClassNotFoundException: 
com.sun.jini.mercury.MailboxBackEnd
     [java]     at java.net.URLClassLoader$1.run(URLClassLoader.java:200)
     [java]     at java.security.AccessController.doPrivileged(Native 
Method)
     [java]     at 
java.net.URLClassLoader.findClass(URLClassLoader.java:188)
     [java]     at java.lang.ClassLoader.loadClass(ClassLoader.java:306)
     [java]     at 
net.jini.loader.pref.PreferredClassLoader.loadClass(PreferredClassLoader.java:942)
     [java]     at java.lang.ClassLoader.loadClass(ClassLoader.java:251)
     [java]     at 
java.lang.ClassLoader.loadClassInternal(ClassLoader.java:319)
     [java]     at java.lang.Class.forName0(Native Method)
     [java]     at java.lang.Class.forName(Class.java:247)
     [java]     at 
net.jini.loader.pref.PreferredClassProvider.loadProxyInterfaces(PreferredClassProvider.java:1360)
     [java]     at 
net.jini.loader.pref.PreferredClassProvider.loadProxyClass(PreferredClassProvider.java:1241)
     [java]     at 
net.jini.loader.pref.PreferredClassProvider.loadProxyClass(PreferredClassProvider.java:1145)
     [java]     at 
java.rmi.server.RMIClassLoader.loadProxyClass(RMIClassLoader.java:294)
     [java]     at 
net.jini.loader.ClassLoading.loadProxyClass(ClassLoading.java:240)
     [java]     at 
net.jini.io.MarshalInputStream.resolveProxyClass(MarshalInputStream.java:373)
     [java]     at 
java.io.ObjectInputStream.readProxyDesc(ObjectInputStream.java:1531)
     [java]     at 
java.io.ObjectInputStream.readClassDesc(ObjectInputStream.java:1493)
     [java]     at 
java.io.ObjectInputStream.readOrdinaryObject(ObjectInputStream.java:1732)
     [java]     at 
java.io.ObjectInputStream.readObject0(ObjectInputStream.java:1329)
     [java]     at 
java.io.ObjectInputStream.readObject(ObjectInputStream.java:351)
     [java]     at 
net.jini.io.MarshalledInstance.get(MarshalledInstance.java:358)
     [java]     at 
net.jini.io.MarshalledInstance.get(MarshalledInstance.java:287)
     [java]     at 
com.sun.jini.proxy.MarshalledWrapper.get(MarshalledWrapper.java:127)
     [java]     at com.sun.jini.phoenix.AID.activate(AID.java:73)
     [java]     ... 4 more
     [java] ActSys-err: 19/09/2010 09:19:12:Group-1:err:19/09/2010 
09:19:12 com.sun.jini.mercury.MailboxImpl doInit
     [java] ActSys-err: 19/09/2010 09:19:12:Group-1:err:INFO: Mercury 
started: com.sun.jini.mercury.ActivatableMercuryImpl@159e154
     [java] com.sun.jini.qa.harness.TestException: Created proxy: 
com.sun.jini.mercury.MailboxProxy$ConstrainableMailboxProxy@6d4f732 with 
a bad policy descriptor: [http://bluto:8080/mercury-dl.jar 
http://bluto:8080/jsk-dl.jar, 
file:/opt/src/river/trunk/qa/harness/policy_bogus/defaultmercury.policy_bogus, 
/opt/src/river/trunk/lib/mercury.jar, 
com.sun.jini.mercury.ActivatableMercuryImpl, 
[/var/tmp/Mercury7998.config], 
com.sun.jini.start.NonActivatableServiceDescriptor$1@158f9d3, 
BasicProxyPreparer[], BasicProxyPreparer[], /var/tmp/sgrp7996dir, true, 
, 1098]
     [java]     at 
com.sun.jini.test.impl.start.ServiceStarterCreateSharedBadActServiceTest.run(ServiceStarterCreateSharedBadActServiceTest.java:119)
     [java]     at 
com.sun.jini.qa.harness.MasterTest.doTest(MasterTest.java:249)
     [java]     at 
com.sun.jini.qa.harness.MasterTest.main(MasterTest.java:139)
     [java]
     [java] TIME: 09:19:12
     [java]
     [java] MasterTest.doTest INFO:
     [java] ============================ CALLING TEARDOWN() 
=============================
     [java]
     [java] ActSys-err: 19/09/2010 09:19:17 
com.sun.jini.phoenix.Activation$Shutdown run
     [java] ActSys-err: INFO: activation daemon shut down
     [java] 19/09/2010 09:19:18 com.sun.jini.tool.ClassServer terminate
     [java] INFO: ClassServer terminated [port 8081]
     [java] 19/09/2010 09:19:18 com.sun.jini.tool.ClassServer terminate
     [java] INFO: ClassServer terminated [port 8082]
     [java] 19/09/2010 09:19:18 com.sun.jini.tool.ClassServer terminate
     [java] INFO: ClassServer terminated [port 8081]
     [java] 19/09/2010 09:19:18 com.sun.jini.tool.ClassServer terminate
     [java] INFO: ClassServer terminated [port 8082]
     [java] 19/09/2010 09:19:18 com.sun.jini.tool.ClassServer terminate
     [java] INFO: ClassServer terminated [port 8080]
     [java] 19/09/2010 09:19:18 com.sun.jini.tool.ClassServer terminate
     [java] INFO: ClassServer terminated [port 8080]
     [java]
     [java] TIME: 09:19:19
     [java]
     [java] Test process was destroyed and returned code 1
     [java] 
com/sun/jini/test/impl/start/ServiceStarterCreateSharedBadActServiceTest.td
     [java] Test Failed: Test Failed: 
com.sun.jini.qa.harness.TestException: Created proxy: 
com.sun.jini.mercury.MailboxProxy$ConstrainableMailboxProxy@6d4f732 with 
a bad policy descriptor: [http://bluto:8080/mercury-dl.jar 
http://bluto:8080/jsk-dl.jar, 
file:/opt/src/river/trunk/qa/harness/policy_bogus/defaultmercury.policy_bogus, 
/opt/src/river/trunk/lib/mercury.jar, 
com.sun.jini.mercury.ActivatableMercuryImpl, 
[/var/tmp/Mercury7998.config], 
com.sun.jini.start.NonActivatableServiceDescriptor$1@158f9d3, 
BasicProxyPreparer[], BasicProxyPreparer[], /var/tmp/sgrp7996dir, true, 
, 1098]
     [java]
     [java]
     [java] -----------------------------------------
     [java]
     [java] Running 
com/sun/jini/test/spec/lookupdiscovery/MulticastMonitorAllChange.td
     [java] Time is Sun Sep 19 09:19:24 EST 2010
     [java] Starting test in separate process with command:
     [java] /usr/jdk/instances/jdk1.6.0/jre/bin/java 
-Djava.security.policy=file:/opt/src/river/trunk/qa/harness/policy/defaulttest.policy 
-cp 
/opt/src/river/trunk/qa/lib/jiniharness.jar:/opt/src/river/trunk/qa/lib/jinitests.jar:/opt/src/river/trunk/lib/jsk-platform.jar:/opt/src/river/trunk/lib/jsk-lib.jar

-client 
-Djava.ext.dirs=/usr/jdk/instances/jdk1.6.0/jre/lib/ext:/usr/jdk/packages/lib/ext:/opt/src/river/trunk/qa/lib-ext:/opt/src/river/trunk/lib-ext

-Dcom.sun.jini.jsk.port=8080 -Dcom.sun.jini.qa.port=8081 
-Dcom.sun.jini.jsk.home=/opt/src/river/trunk 
-Dcom.sun.jini.qa.home=/opt/src/river/trunk/qa 
-Dcom.sun.jini.qa.harness.harnessJar=/opt/src/river/trunk/qa/lib/jiniharness.jar 
-Dcom.sun.jini.qa.harness.testJar=/opt/src/river/trunk/qa/lib/jinitests.jar 
-Dcom.sun.jini.qa.harness.runjiniserver=true 
-Dcom.sun.jini.qa.harness.runkitserver=true 
-Djava.security.properties=file:/opt/src/river/trunk/qa/harness/trust/dynamic-policy.properties

-Dcom.sun.jini.qa.harness.testhosts= 
-Djava.util.logging.config.file=/home/peter/logging.properties 
-Dcom.sun.jini.test.home=/opt/src/river/trunk/qa 
-Dcom.sun.jini.test.port=8082 
-Dcom.sun.jini.qa.harness.policies=file:/opt/src/river/trunk/qa/src/com/sun/jini/test/resources/jinitest.policy

-Djava.ext.dirs=/usr/jdk/instances/jdk1.6.0/jre/lib/ext:/usr/jdk/packages/lib/ext:/opt/src/river/trunk/qa/lib-ext:/opt/src/river/trunk/lib-ext

com.sun.jini.qa.harness.MasterTest 
com/sun/jini/test/spec/lookupdiscovery/MulticastMonitorAllChange.td
     [java]
     [java] TIME: 09:19:26
     [java]
     [java] MasterTest.doTest INFO:
     [java] ============================== CALLING SETUP() 
==============================
     [java]
     [java] 19/09/2010 09:19:27 com.sun.jini.tool.ClassServer run
     [java] INFO: ClassServer started [[/opt/src/river/trunk/qa/lib/], 
port 8081]
     [java] 19/09/2010 09:19:27 com.sun.jini.tool.ClassServer run
     [java] INFO: ClassServer started [[/opt/src/river/trunk/lib-dl/], 
port 8080]
     [java] 19/09/2010 09:19:27 com.sun.jini.tool.ClassServer run
     [java] INFO: ClassServer started [[/opt/src/river/trunk/qa/lib/], 
port 8082]
     [java] NonActGrp-out: 19/09/2010 09:19:33 
com.sun.jini.reggie.RegistrarImpl init
     [java] NonActGrp-out: INFO: started Reggie: 
3e6be223-9b49-4029-ba6e-4460865178db, [LDGroup0_A_bluto_1284851964415, 
LDGroup0_B_bluto_1284851964415, LDGroup0_C_bluto_1284851964415], 
ConstrainableLookupLocator[[jini://bluto/], [null]]
     [java] NonActGrp-out: 19/09/2010 09:19:36 
com.sun.jini.reggie.RegistrarImpl init
     [java] NonActGrp-out: INFO: started Reggie: 
105295e7-1e30-4cfc-ac43-e1ee95dfa4c2, [LDGroup1_A_bluto_1284851964415, 
LDGroup1_B_bluto_1284851964415, LDGroup1_C_bluto_1284851964415, 
LDGroup1_D_bluto_1284851964415], 
ConstrainableLookupLocator[[jini://bluto:61552/], [null]]
     [java] NonActGrp-out: 19/09/2010 09:19:37 
com.sun.jini.reggie.RegistrarImpl init
     [java] NonActGrp-out: INFO: started Reggie: 
56b49450-20ea-4261-9b8b-63c05e4427db, [LDGroup2_A_bluto_1284851964415, 
LDGroup2_B_bluto_1284851964415, LDGroup2_C_bluto_1284851964415], 
ConstrainableLookupLocator[[jini://bluto:61555/], [null]]
     [java]
     [java] TIME: 09:19:38
     [java]
     [java] MasterTest.doTest INFO:
     [java] =============================== CALLING RUN() 
===============================
     [java]
     [java]
     [java] TIME: 09:20:39
     [java]
     [java] MasterTest.doTest INFO:
     [java] ============================ CALLING TEARDOWN() 
=============================
     [java]
     [java] NonActGrp-out: 19/09/2010 09:20:39 
com.sun.jini.reggie.RegistrarImpl destroy
     [java] NonActGrp-out: INFO: starting Reggie shutdown
     [java] NonActGrp-out: 19/09/2010 09:20:39 
com.sun.jini.reggie.RegistrarImpl destroy
     [java] NonActGrp-out: INFO: starting Reggie shutdown
     [java] NonActGrp-out: 19/09/2010 09:20:39 
com.sun.jini.reggie.RegistrarImpl destroy
     [java] NonActGrp-out: INFO: starting Reggie shutdown
     [java] NonActGrp-out: 19/09/2010 09:20:40 
com.sun.jini.reggie.RegistrarImpl$DestroyThread run
     [java] NonActGrp-out: INFO: Reggie shutdown completed
     [java] NonActGrp-out: 19/09/2010 09:20:40 
com.sun.jini.reggie.RegistrarImpl$DestroyThread run
     [java] NonActGrp-out: INFO: Reggie shutdown completed
     [java] NonActGrp-out: 19/09/2010 09:20:40 
com.sun.jini.reggie.RegistrarImpl$DestroyThread run
     [java] NonActGrp-out: INFO: Reggie shutdown completed
     [java] 19/09/2010 09:20:41 com.sun.jini.tool.ClassServer terminate
     [java] INFO: ClassServer terminated [port 8080]
     [java] 19/09/2010 09:20:41 com.sun.jini.tool.ClassServer terminate
     [java] INFO: ClassServer terminated [port 8080]
     [java] 19/09/2010 09:20:41 com.sun.jini.tool.ClassServer terminate
     [java] INFO: ClassServer terminated [port 8082]
     [java] 19/09/2010 09:20:41 com.sun.jini.tool.ClassServer terminate
     [java] INFO: ClassServer terminated [port 8082]
     [java] 19/09/2010 09:20:41 com.sun.jini.tool.ClassServer terminate
     [java] INFO: ClassServer terminated [port 8081]
     [java] 19/09/2010 09:20:41 com.sun.jini.tool.ClassServer terminate
     [java] INFO: ClassServer terminated [port 8081]
     [java]
     [java] TIME: 09:20:42
     [java]
     [java] Test process was destroyed and returned code 0
     [java] 
com/sun/jini/test/spec/lookupdiscovery/MulticastMonitorAllChange.td
     [java] Test Passed: OK
     [java]
     [java]
     [java] -----------------------------------------
     [java]
     [java] SUMMARY =================================
     [java]
     [java] 
com/sun/jini/test/impl/start/ServiceStarterCreateBadTransientServiceTest.td
     [java] Test Failed: Test Failed: 
com.sun.jini.qa.harness.TestException: Failed - Created proxy 
[com.sun.jini.start.NonActivatableServiceDescriptor$Created@baa466] with 
bad policy descriptor: [http://bluto:8080/mercury-dl.jar 
http://bluto:8080/jsk-dl.jar, 
file:/opt/src/river/trunk/qa/harness/bogus_policy/defaultmercury.bogus_policy, 
/opt/src/river/trunk/lib/mercury.jar, 
com.sun.jini.mercury.TransientMercuryImpl, 
[/var/tmp/Mercury38825.config], 
com.sun.jini.start.NonActivatableServiceDescriptor$1@1d7fbfb, 
BasicProxyPreparer[]]
     [java]
     [java] -----------------------------------------
     [java] 
com/sun/jini/test/impl/start/ServiceStarterCreateSharedBadActServiceTest.td
     [java] Test Failed: Test Failed: 
com.sun.jini.qa.harness.TestException: Created proxy: 
com.sun.jini.mercury.MailboxProxy$ConstrainableMailboxProxy@6d4f732 with 
a bad policy descriptor: [http://bluto:8080/mercury-dl.jar 
http://bluto:8080/jsk-dl.jar, 
file:/opt/src/river/trunk/qa/harness/policy_bogus/defaultmercury.policy_bogus, 
/opt/src/river/trunk/lib/mercury.jar, 
com.sun.jini.mercury.ActivatableMercuryImpl, 
[/var/tmp/Mercury7998.config], 
com.sun.jini.start.NonActivatableServiceDescriptor$1@158f9d3, 
BasicProxyPreparer[], BasicProxyPreparer[], /var/tmp/sgrp7996dir, true, 
, 1098]
     [java]
     [java] -----------------------------------------
     [java] 
com/sun/jini/test/spec/lookupdiscovery/MulticastMonitorAllChange.td
     [java] Test Passed: OK
     [java]
     [java] -----------------------------------------
     [java]
     [java] # of tests started   = 3
     [java] # of tests completed = 3
     [java] # of tests passed    = 1
     [java] # of tests failed    = 2
     [java]
     [java] -----------------------------------------
     [java]
     [java]    Date finished:
     [java]       Sun Sep 19 09:20:47 EST 2010
     [java]    Time elapsed:
     [java]       151 seconds
     [java]

BUILD FAILED
/opt/src/river/trunk/qa/build.xml:290: The following error occurred 
while executing this line:
/opt/src/river/trunk/qa/build.xml:217: Java returned: 1

Total time: 2 minutes 37 seconds


Peter Firmstone wrote:
> Jonathan Costers wrote:
>> 2010/9/18 Patricia Shanahan <pats@acm.org>
>>
>>  
>>> I've created an Open Solaris installation in a VirtualBox. I'm in the
>>> process of installing software, such as a JDK, on it.
>>>
>>> Regardless of whether it reproduces this specific problem, it will 
>>> give us
>>> another test configuration - the more the better.
>>>
>>>
>>>     
>> Great news! I'd like to do the same when I get a chance
>>
>>
>>  
>>>
>>> On 9/18/2010 1:10 AM, Jonathan Costers wrote:
>>>
>>>    
>>>> Hmmm
>>>>
>>>> Hudson just finished a build (#24) on *solaris1*, and we still get 
>>>> that
>>>> one
>>>> failure:
>>>>
>>>> [java] 
>>>> com/sun/jini/test/spec/lookupdiscovery/MulticastMonitorAllChange.td
>>>> [java] Test Failed: Test Failed:
>>>> com.sun.jini.qa.harness.TestException: change failed -- waited 870
>>>> seconds (14 minutes) -- 3 change event(s) expected, 0 change event(s)
>>>> received
>>>> [java]
>>>>
>>>> However, one *ubuntu1*, the same test passes ... (build #21)
>>>> On my local machines, I have this test passing on both Linux and 
>>>> Windows.
>>>> I do not have a Solaris installation available though, anyone?
>>>>
>>>> Would anyone be able to reproduce this situation?
>>>> - pass the whole suite on Linux
>>>> - fail the above test on Solaris
>>>>
>>>> Thanks
>>>> Jonathan
>>>>
>>>> 2010/9/18 Peter Firmstone<jini@zeus.net.au>
>>>>
>>>>  Jonathan Costers wrote:
>>>>      
>>>>>  2010/9/17 Peter Firmstone<jini@zeus.net.au>
>>>>>        
>>>>>>
>>>>>>  Jonathan, this progress is excellent news for anybody trying to
>>>>>>          
>>>>>>> actively
>>>>>>> develop.
>>>>>>>
>>>>>>>
>>>>>>>
>>>>>>>
>>>>>>>             
>>>>>> Are the rest of us allowed to commit to the trunk again at this 
>>>>>> point?
>>>>>>
>>>>>>
>>>>>>
>>>>>>  Definitely, cleared for takeoff.
>>>>>>           
>>>>> Cheers,
>>>>>
>>>>> Peter.
>>>>>
>>>>>
>>>>>         
>>
>>   
> Two failed tests:
>
>     [java] -----------------------------------------
>     [java] 
> com/sun/jini/test/impl/start/ServiceStarterCreateBadTransientServiceTest.td 
>
>     [java] Test Failed: Test Failed: 
> com.sun.jini.qa.harness.TestException: Failed - Created proxy 
> [com.sun.jini.start. NonActivatableServiceDescriptor$Created@1e232b5] 
> with bad policy descriptor: [http://bluto:8080/mercury-dl.jar 
> http://bl uto:8080/jsk-dl.jar, 
> file:/opt/src/river/trunk/qa/harness/bogus_policy/defaultmercury.bogus_policy, 
> /opt/src/river/trunk /lib/mercury.jar, 
> com.sun.jini.mercury.TransientMercuryImpl, 
> [/var/tmp/Mercury12604.config], com.sun.jini.start.NonActiv 
> atableServiceDescriptor$1@d3db51, BasicProxyPreparer[]]
>     [java]
>     [java] -----------------------------------------
>
>     [java] 
> com/sun/jini/test/impl/start/ServiceStarterCreateSharedBadActServiceTest.td 
>
>     [java] Test Failed: Test Failed: 
> com.sun.jini.qa.harness.TestException: Created proxy: 
> com.sun.jini.mercury.Mailbox Proxy$ConstrainableMailboxProxy@37e3c899 
> with a bad policy descriptor: [http://bluto:8080/mercury-dl.jar 
> http://bluto:80 80/jsk-dl.jar, 
> file:/opt/src/river/trunk/qa/harness/policy_bogus/defaultmercury.policy_bogus, 
> /opt/src/river/trunk/lib/m ercury.jar, 
> com.sun.jini.mercury.ActivatableMercuryImpl, 
> [/var/tmp/Mercury7507.config], com.sun.jini.start.NonActivatabl 
> eServiceDescriptor$1@1f66cff, BasicProxyPreparer[], 
> BasicProxyPreparer[], /var/tmp/sgrp7505dir, true, , 1098]
>     [java]
>
>
>     [java]
>     [java] # of tests started   = 1116
>     [java] # of tests completed = 1116
>     [java] # of tests skipped   = 41
>     [java] # of tests passed    = 1114
>     [java] # of tests failed    = 2
>     [java]
>     [java] -----------------------------------------
>     [java]
>     [java]    Date finished:
>     [java]       Sun Sep 19 08:52:21 EST 2010
>     [java]    Time elapsed:
>     [java]       61025 seconds
>     [java]
>
>


Mime
View raw message