river-dev mailing list archives

Site index · List index
Message view « Date » · « Thread »
Top « Date » · « Thread »
From Jonathan Costers <jonathan.cost...@googlemail.com>
Subject QA test failures while running "start" test category
Date Fri, 27 Aug 2010 12:35:44 GMT
-----------------------------------------

# of tests started   = 56
# of tests completed = 56
# of tests skipped   = 3
# of tests passed    = 48
# of tests failed    = 8

-----------------------------------------

   Date finished:
      Fri Aug 27 14:26:09 CEST 2010
   Time elapsed:
      743 seconds


Tests that failed:

-----------------------------------------
com/sun/jini/test/impl/start/ActivateWrapperRegisterUnsharedImpl.td
Test Failed: Test Failed: com.sun.jini.qa.harness.TestException: Unexpected
Exception; nested exception is:
        Problem creating service for
com.sun.jini.test.impl.start.UnsharedProbe; nested exception is:
        exception constructing object; nested exception is:
        java.lang.SecurityException: ProtectionDomain ProtectionDomain
(file:/home/jonathan/Documenten/NetBeansProjects/River/jtsk/trunk/qa/lib/qa1-start-probe.jar
<no signer certificates>)
 null
 <no principals>
 java.security.Permissions@59fb21 (
 (java.util.PropertyPermission line.separator read)
 (java.util.PropertyPermission java.vm.version read)
 (java.util.PropertyPermission java.vm.specification.version read)
 (java.util.PropertyPermission java.vm.specification.vendor read)
 (java.util.PropertyPermission java.vendor.url read)
 (java.util.PropertyPermission java.vm.name read)
 (java.util.PropertyPermission os.name read)
 (java.util.PropertyPermission java.vm.vendor read)
 (java.util.PropertyPermission path.separator read)
 (java.util.PropertyPermission java.specification.name read)
 (java.util.PropertyPermission os.version read)
 (java.util.PropertyPermission
com.sun.jini.reggie.enableImplToStubReplacement read)
 (java.util.PropertyPermission os.arch read)
 (java.util.PropertyPermission java.class.version read)
 (java.util.PropertyPermission java.version read)
 (java.util.PropertyPermission file.separator read)
 (java.util.PropertyPermission java.vendor read)
 (java.util.PropertyPermission java.vm.specification.name read)
 (java.util.PropertyPermission java.specification.version read)
 (java.util.PropertyPermission java.specification.vendor read)
 (java.net.SocketPermission localhost:1024- listen,resolve)
 (unresolved com.sun.jini.start.SharedActivationPolicyPermission
jar:file:/home/jonathan/Documenten/NetBeansProjects/River/jtsk/trunk/qa/lib/jiniharness.jar!/harness/policy/policy.all
null)
 (unresolved com.sun.jini.start.SharedActivationPolicyPermission
jar:file:/home/jonathan/Documenten/NetBeansProjects/River/jtsk/trunk/qa/lib/jiniharness.jar!/harness/policy/all.policy
null)
 (java.lang.RuntimePermission stopThread)
 (java.io.FilePermission
/home/jonathan/Documenten/NetBeansProjects/River/jtsk/trunk/qa/lib/- read)
)

 does not have required permission:
(com.sun.jini.start.SharedActivationPolicyPermission
file:/home/jonathan/Documenten/NetBeansProjects/River/jtsk/trunk/qa/harness/policy/policy.all)

-----------------------------------------
com/sun/jini/test/impl/start/ClassLoaderTest.td
Test Failed: Test Failed: com.sun.jini.qa.harness.TestException: Problem
creating service for com.sun.jini.test.impl.start.ClassLoaderTest1; nested
exception is:
        exception constructing object; nested exception is:
        java.lang.SecurityException: ProtectionDomain ProtectionDomain
(file:/home/jonathan/Documenten/NetBeansProjects/River/jtsk/trunk/qa/lib/qa1-start-testservice1.jar
<no signer certificates>)
 null
 <no principals>
 java.security.Permissions@a77106 (
 (java.util.PropertyPermission line.separator read)
 (java.util.PropertyPermission java.vm.version read)
 (java.util.PropertyPermission java.vm.specification.version read)
 (java.util.PropertyPermission java.vm.specification.vendor read)
 (java.util.PropertyPermission java.vendor.url read)
 (java.util.PropertyPermission java.vm.name read)
 (java.util.PropertyPermission os.name read)
 (java.util.PropertyPermission java.vm.vendor read)
 (java.util.PropertyPermission path.separator read)
 (java.util.PropertyPermission java.specification.name read)
 (java.util.PropertyPermission os.version read)
 (java.util.PropertyPermission
com.sun.jini.reggie.enableImplToStubReplacement read)
 (java.util.PropertyPermission os.arch read)
 (java.util.PropertyPermission java.class.version read)
 (java.util.PropertyPermission java.version read)
 (java.util.PropertyPermission file.separator read)
 (java.util.PropertyPermission java.vendor read)
 (java.util.PropertyPermission java.vm.specification.name read)
 (java.util.PropertyPermission java.specification.version read)
 (java.util.PropertyPermission java.specification.vendor read)
 (java.net.SocketPermission localhost:1024- listen,resolve)
 (java.lang.RuntimePermission stopThread)
 (java.io.FilePermission
/home/jonathan/Documenten/NetBeansProjects/River/jtsk/trunk/qa/lib/- read)
 (unresolved com.sun.jini.start.SharedActivationPolicyPermission
jar:file:/home/jonathan/Documenten/NetBeansProjects/River/jtsk/trunk/qa/lib/jiniharness.jar!/harness/policy/policy.all
null)
 (unresolved com.sun.jini.start.SharedActivationPolicyPermission
jar:file:/home/jonathan/Documenten/NetBeansProjects/River/jtsk/trunk/qa/lib/jiniharness.jar!/harness/policy/all.policy
null)
)

 does not have required permission:
(com.sun.jini.start.SharedActivationPolicyPermission
file:/home/jonathan/Documenten/NetBeansProjects/River/jtsk/trunk/qa/harness/policy/all.policy)

-----------------------------------------
com/sun/jini/test/impl/start/ClassLoaderUtilTest.td
Test Passed: OK

-----------------------------------------
com/sun/jini/test/impl/start/ClasspathTest.td
Test Failed: Test Failed: com.sun.jini.qa.harness.TestException: Problem
creating service for com.sun.jini.test.impl.start.ClasspathTest1; nested
exception is:
        exception constructing object; nested exception is:
        java.lang.SecurityException: ProtectionDomain ProtectionDomain
(file:/home/jonathan/Documenten/NetBeansProjects/River/jtsk/trunk/qa/lib/qa1-start-testservice1.jar
<no signer certificates>)
 null
 <no principals>
 java.security.Permissions@15575e0 (
 (java.lang.RuntimePermission stopThread)
 (java.util.PropertyPermission line.separator read)
 (java.util.PropertyPermission java.vm.version read)
 (java.util.PropertyPermission java.vm.specification.version read)
 (java.util.PropertyPermission java.vm.specification.vendor read)
 (java.util.PropertyPermission java.vendor.url read)
 (java.util.PropertyPermission java.vm.name read)
 (java.util.PropertyPermission os.name read)
 (java.util.PropertyPermission java.vm.vendor read)
 (java.util.PropertyPermission path.separator read)
 (java.util.PropertyPermission java.specification.name read)
 (java.util.PropertyPermission os.version read)
 (java.util.PropertyPermission
com.sun.jini.reggie.enableImplToStubReplacement read)
 (java.util.PropertyPermission os.arch read)
 (java.util.PropertyPermission java.class.version read)
 (java.util.PropertyPermission java.version read)
 (java.util.PropertyPermission file.separator read)
 (java.util.PropertyPermission java.vendor read)
 (java.util.PropertyPermission java.vm.specification.name read)
 (java.util.PropertyPermission java.specification.version read)
 (java.util.PropertyPermission java.specification.vendor read)
 (java.io.FilePermission
/home/jonathan/Documenten/NetBeansProjects/River/jtsk/trunk/qa/lib/- read)
 (java.net.SocketPermission localhost:1024- listen,resolve)
 (unresolved com.sun.jini.start.SharedActivationPolicyPermission
jar:file:/home/jonathan/Documenten/NetBeansProjects/River/jtsk/trunk/qa/lib/jiniharness.jar!/harness/policy/policy.all
null)
 (unresolved com.sun.jini.start.SharedActivationPolicyPermission
jar:file:/home/jonathan/Documenten/NetBeansProjects/River/jtsk/trunk/qa/lib/jiniharness.jar!/harness/policy/all.policy
null)
)

 does not have required permission:
(com.sun.jini.start.SharedActivationPolicyPermission
file:/home/jonathan/Documenten/NetBeansProjects/River/jtsk/trunk/qa/harness/policy/all.policy)

-----------------------------------------
com/sun/jini/test/impl/start/CodebaseTest.td
Test Failed: Test Failed: com.sun.jini.qa.harness.TestException: Problem
creating service for com.sun.jini.test.impl.start.CodebaseTest1; nested
exception is:
        exception constructing object; nested exception is:
        java.lang.SecurityException: ProtectionDomain ProtectionDomain
(file:/home/jonathan/Documenten/NetBeansProjects/River/jtsk/trunk/qa/lib/qa1-start-testservice1.jar
<no signer certificates>)
 null
 <no principals>
 java.security.Permissions@59fb21 (
 (java.io.FilePermission
/home/jonathan/Documenten/NetBeansProjects/River/jtsk/trunk/qa/lib/- read)
 (java.util.PropertyPermission line.separator read)
 (java.util.PropertyPermission java.vm.version read)
 (java.util.PropertyPermission java.vm.specification.version read)
 (java.util.PropertyPermission java.vm.specification.vendor read)
 (java.util.PropertyPermission java.vendor.url read)
 (java.util.PropertyPermission java.vm.name read)
 (java.util.PropertyPermission os.name read)
 (java.util.PropertyPermission java.vm.vendor read)
 (java.util.PropertyPermission path.separator read)
 (java.util.PropertyPermission java.specification.name read)
 (java.util.PropertyPermission os.version read)
 (java.util.PropertyPermission
com.sun.jini.reggie.enableImplToStubReplacement read)
 (java.util.PropertyPermission os.arch read)
 (java.util.PropertyPermission java.class.version read)
 (java.util.PropertyPermission java.version read)
 (java.util.PropertyPermission file.separator read)
 (java.util.PropertyPermission java.vendor read)
 (java.util.PropertyPermission java.vm.specification.name read)
 (java.util.PropertyPermission java.specification.version read)
 (java.util.PropertyPermission java.specification.vendor read)
 (java.net.SocketPermission localhost:1024- listen,resolve)
 (unresolved com.sun.jini.start.SharedActivationPolicyPermission
jar:file:/home/jonathan/Documenten/NetBeansProjects/River/jtsk/trunk/qa/lib/jiniharness.jar!/harness/policy/policy.all
null)
 (unresolved com.sun.jini.start.SharedActivationPolicyPermission
jar:file:/home/jonathan/Documenten/NetBeansProjects/River/jtsk/trunk/qa/lib/jiniharness.jar!/harness/policy/all.policy
null)
 (java.lang.RuntimePermission stopThread)
)

 does not have required permission:
(com.sun.jini.start.SharedActivationPolicyPermission
file:/home/jonathan/Documenten/NetBeansProjects/River/jtsk/trunk/qa/harness/policy/all.policy)

-----------------------------------------
com/sun/jini/test/impl/start/ServiceStarterCreateBadServiceProxyAccessorTest.td
Test Failed: Test Failed: com.sun.jini.qa.harness.TestException: Problem
creating service for
com.sun.jini.test.impl.start.BadServiceProxyAccessorImpl; nested exception
is:
        exception constructing object; nested exception is:
        java.lang.SecurityException: ProtectionDomain ProtectionDomain
(file:/home/jonathan/Documenten/NetBeansProjects/River/jtsk/trunk/qa/lib/qa1-start-probe.jar
<no signer certificates>)
 null
 <no principals>
 java.security.Permissions@a77106 (
 (java.util.PropertyPermission line.separator read)
 (java.util.PropertyPermission java.vm.version read)
 (java.util.PropertyPermission java.vm.specification.version read)
 (java.util.PropertyPermission java.vm.specification.vendor read)
 (java.util.PropertyPermission java.vendor.url read)
 (java.util.PropertyPermission java.vm.name read)
 (java.util.PropertyPermission os.name read)
 (java.util.PropertyPermission java.vm.vendor read)
 (java.util.PropertyPermission path.separator read)
 (java.util.PropertyPermission java.specification.name read)
 (java.util.PropertyPermission os.version read)
 (java.util.PropertyPermission
com.sun.jini.reggie.enableImplToStubReplacement read)
 (java.util.PropertyPermission os.arch read)
 (java.util.PropertyPermission java.class.version read)
 (java.util.PropertyPermission java.version read)
 (java.util.PropertyPermission file.separator read)
 (java.util.PropertyPermission java.vendor read)
 (java.util.PropertyPermission java.vm.specification.name read)
 (java.util.PropertyPermission java.specification.version read)
 (java.util.PropertyPermission java.specification.vendor read)
 (java.net.SocketPermission localhost:1024- listen,resolve)
 (java.lang.RuntimePermission stopThread)
 (java.io.FilePermission
/home/jonathan/Documenten/NetBeansProjects/River/jtsk/trunk/qa/lib/- read)
 (unresolved com.sun.jini.start.SharedActivationPolicyPermission
jar:file:/home/jonathan/Documenten/NetBeansProjects/River/jtsk/trunk/qa/lib/jiniharness.jar!/harness/policy/policy.all
null)
 (unresolved com.sun.jini.start.SharedActivationPolicyPermission
jar:file:/home/jonathan/Documenten/NetBeansProjects/River/jtsk/trunk/qa/lib/jiniharness.jar!/harness/policy/all.policy
null)
)

 does not have required permission:
(com.sun.jini.start.SharedActivationPolicyPermission
file:/home/jonathan/Documenten/NetBeansProjects/River/jtsk/trunk/qa/harness/policy/policy.all)

-----------------------------------------
com/sun/jini/test/impl/start/aggregatepolicyprovider/NullCasesTest.td
Test Failed: Test Failed: com.sun.jini.qa.harness.TestException:
Successfully granted: null, new Principal[]{ null }, null

-----------------------------------------
com/sun/jini/test/impl/start/aggregatepolicyprovider/SubPoliciesTest.td
Test Failed: Test Failed with an Unexpected Exception:
sun.misc.ServiceConfigurationError:
org.apache.river.imp.security.policy.spi.RevokeableDynamicPolicySpi:
Provider
org.apache.river.imp.security.policy.se.DynamicConcurrentPolicyProvider not
found

-----------------------------------------
com/sun/jini/test/impl/start/loadersplitpolicyprovider/LoaderSplitPolicyProviderTest.td
Test Failed: Test Failed: com.sun.jini.qa.harness.TestException: Does not
satisfy getPermissions conditions for (java.lang.RuntimePermission
defaultPolicyGrant).

Mime
  • Unnamed multipart/alternative (inline, None, 0 bytes)
View raw message