river-dev mailing list archives

Site index · List index
Message view « Date » · « Thread »
Top « Date » · « Thread »
From Peter Firmstone <j...@zeus.net.au>
Subject Re: Build failed in Hudson: River-trunk #239
Date Wed, 31 Mar 2010 11:06:39 GMT
Hmm, still getting occasional stale processes on Hudson.


  Caused by: java.net.BindException: Address already in use
     [java]     at java.net.PlainSocketImpl.socketBind(Native Method)
     [java]     at java.net.PlainSocketImpl.bind(PlainSocketImpl.java:365)
     [java]     at java.net.ServerSocket.bind(ServerSocket.java:319)
     [java]     at java.net.ServerSocket.<init>(ServerSocket.java:185)
     [java]     at java.net.ServerSocket.<init>(ServerSocket.java:97)
     [java]     at 
javax.net.DefaultServerSocketFactory.createServerSocket(ServerSocketFactory.java:157)
     [java]     at 
com.sun.jini.reggie.RegistrarImpl$UnicastThread.<init>(Unknown Source)
     [java]     at com.sun.jini.reggie.RegistrarImpl.init(Unknown Source)
     [java]     at com.sun.jini.reggie.RegistrarImpl.access$000(Unknown 
Source)
     [java]     at com.sun.jini.reggie.RegistrarImpl$1.run(Unknown Source)
     [java]     at com.sun.jini.reggie.RegistrarImpl.<init>(Unknown Source)
     [java]     at 
com.sun.jini.reggie.TransientRegistrarImpl.<init>(Unknown Source)

 Caused by: java.net.BindException: Address already in use
     [java]     at java.net.PlainSocketImpl.socketBind(Native Method)
     [java]     at java.net.PlainSocketImpl.bind(PlainSocketImpl.java:365)
     [java]     at java.net.ServerSocket.bind(ServerSocket.java:319)
     [java]     at java.net.ServerSocket.<init>(ServerSocket.java:185)
     [java]     at java.net.ServerSocket.<init>(ServerSocket.java:97)
     [java]     at com.sun.jini.tool.ClassServer.init(Unknown Source)
     [java]     at com.sun.jini.tool.ClassServer.<init>(Unknown Source)
Apache Hudson Server wrote:
> See <http://hudson.zones.apache.org/hudson/job/River-trunk/239/changes>
>
> Changes:
>
> [peter_firmstone] PolicyEntry refactor java 1.5 dependant
>
> [peter_firmstone] PolicyEntry refactor java 1.5 dependant
>
> ------------------------------------------
> [...truncated 222779 lines...]
>      [java] Test Passed: OK
>      [java] 
>      [java] -----------------------------------------
>      [java] com/sun/jini/test/spec/iiop/iiopexporter/Unexport_IllegalStateExceptionTest1.td
>      [java] Test Passed: OK
>      [java] 
>      [java] -----------------------------------------
>      [java] com/sun/jini/test/spec/iiop/iiopexporter/Unexport_IllegalStateExceptionTest2.td
>      [java] Test Passed: OK
>      [java] 
>      [java] -----------------------------------------
>      [java] com/sun/jini/test/spec/jrmp/jrmpexporter/Constructor_NullPointerExceptionTest.td
>      [java] Test Passed: OK
>      [java] 
>      [java] -----------------------------------------
>      [java] com/sun/jini/test/spec/jrmp/jrmpexporter/Constructor_NullPointerExceptionTest1.td
>      [java] Test Passed: OK
>      [java] 
>      [java] -----------------------------------------
>      [java] com/sun/jini/test/spec/jrmp/jrmpexporter/Export_ExportExceptionTest.td
>      [java] Test Skipped: verifiers are: com.sun.jini.qa.harness.SkipPostJDK14TestVerifier
>      [java] -----------------------------------------
>      [java] com/sun/jini/test/spec/jrmp/jrmpexporter/Export_ExportExceptionTest1.td
>      [java] Test Skipped: verifiers are: com.sun.jini.qa.harness.SkipPostJDK14TestVerifier
>      [java] -----------------------------------------
>      [java] com/sun/jini/test/spec/jrmp/jrmpexporter/Export_ExportExceptionTest2.td
>      [java] Test Skipped: verifiers are: com.sun.jini.qa.harness.SkipPostJDK14TestVerifier
>      [java] -----------------------------------------
>      [java] com/sun/jini/test/spec/jrmp/jrmpexporter/Export_ExportExceptionTest3.td
>      [java] Test Skipped: verifiers are: com.sun.jini.qa.harness.SkipPostJDK14TestVerifier
>      [java] -----------------------------------------
>      [java] com/sun/jini/test/spec/jrmp/jrmpexporter/Export_ExportExceptionTest4.td
>      [java] Test Skipped: verifiers are: com.sun.jini.qa.harness.SkipPostJDK14TestVerifier
>      [java] -----------------------------------------
>      [java] com/sun/jini/test/spec/jrmp/jrmpexporter/Export_IllegalStateExceptionTest.td
>      [java] Test Passed: OK
>      [java] 
>      [java] -----------------------------------------
>      [java] com/sun/jini/test/spec/jrmp/jrmpexporter/Export_IllegalStateExceptionTest1.td
>      [java] Test Passed: OK
>      [java] 
>      [java] -----------------------------------------
>      [java] com/sun/jini/test/spec/jrmp/jrmpexporter/Export_IllegalStateExceptionTest2.td
>      [java] Test Passed: OK
>      [java] 
>      [java] -----------------------------------------
>      [java] com/sun/jini/test/spec/jrmp/jrmpexporter/Export_IllegalStateExceptionTest3.td
>      [java] Test Passed: OK
>      [java] 
>      [java] -----------------------------------------
>      [java] com/sun/jini/test/spec/jrmp/jrmpexporter/Export_IllegalStateExceptionTest4.td
>      [java] Test Passed: OK
>      [java] 
>      [java] -----------------------------------------
>      [java] com/sun/jini/test/spec/jrmp/jrmpexporter/Export_NullPointerExceptionTest.td
>      [java] Test Passed: OK
>      [java] 
>      [java] -----------------------------------------
>      [java] com/sun/jini/test/spec/jrmp/jrmpexporter/Export_NullPointerExceptionTest1.td
>      [java] Test Passed: OK
>      [java] 
>      [java] -----------------------------------------
>      [java] com/sun/jini/test/spec/jrmp/jrmpexporter/Export_NullPointerExceptionTest2.td
>      [java] Test Passed: OK
>      [java] 
>      [java] -----------------------------------------
>      [java] com/sun/jini/test/spec/jrmp/jrmpexporter/Export_NullPointerExceptionTest3.td
>      [java] Test Passed: OK
>      [java] 
>      [java] -----------------------------------------
>      [java] com/sun/jini/test/spec/jrmp/jrmpexporter/Export_NullPointerExceptionTest4.td
>      [java] Test Passed: OK
>      [java] 
>      [java] -----------------------------------------
>      [java] com/sun/jini/test/spec/jrmp/jrmpexporter/GetActivationID_BehaviorTest.td
>      [java] Test Passed: OK
>      [java] 
>      [java] -----------------------------------------
>      [java] com/sun/jini/test/spec/jrmp/jrmpexporter/GetActivationID_BehaviorTest1.td
>      [java] Test Passed: OK
>      [java] 
>      [java] -----------------------------------------
>      [java] com/sun/jini/test/spec/jrmp/jrmpexporter/GetActivationID_BehaviorTest2.td
>      [java] Test Passed: OK
>      [java] 
>      [java] -----------------------------------------
>      [java] com/sun/jini/test/spec/jrmp/jrmpexporter/GetActivationID_BehaviorTest3.td
>      [java] Test Passed: OK
>      [java] 
>      [java] -----------------------------------------
>      [java] com/sun/jini/test/spec/jrmp/jrmpexporter/GetActivationID_BehaviorTest4.td
>      [java] Test Passed: OK
>      [java] 
>      [java] -----------------------------------------
>      [java] com/sun/jini/test/spec/jrmp/jrmpexporter/GetClientSocketFactory_BehaviorTest.td
>      [java] Test Passed: OK
>      [java] 
>      [java] -----------------------------------------
>      [java] com/sun/jini/test/spec/jrmp/jrmpexporter/GetClientSocketFactory_BehaviorTest1.td
>      [java] Test Passed: OK
>      [java] 
>      [java] -----------------------------------------
>      [java] com/sun/jini/test/spec/jrmp/jrmpexporter/GetClientSocketFactory_BehaviorTest2.td
>      [java] Test Passed: OK
>      [java] 
>      [java] -----------------------------------------
>      [java] com/sun/jini/test/spec/jrmp/jrmpexporter/GetClientSocketFactory_BehaviorTest3.td
>      [java] Test Passed: OK
>      [java] 
>      [java] -----------------------------------------
>      [java] com/sun/jini/test/spec/jrmp/jrmpexporter/GetClientSocketFactory_BehaviorTest4.td
>      [java] Test Passed: OK
>      [java] 
>      [java] -----------------------------------------
>      [java] com/sun/jini/test/spec/jrmp/jrmpexporter/GetPort_BehaviorTest.td
>      [java] Test Passed: OK
>      [java] 
>      [java] -----------------------------------------
>      [java] com/sun/jini/test/spec/jrmp/jrmpexporter/GetPort_BehaviorTest1.td
>      [java] Test Passed: OK
>      [java] 
>      [java] -----------------------------------------
>      [java] com/sun/jini/test/spec/jrmp/jrmpexporter/GetPort_BehaviorTest2.td
>      [java] Test Passed: OK
>      [java] 
>      [java] -----------------------------------------
>      [java] com/sun/jini/test/spec/jrmp/jrmpexporter/GetPort_BehaviorTest3.td
>      [java] Test Passed: OK
>      [java] 
>      [java] -----------------------------------------
>      [java] com/sun/jini/test/spec/jrmp/jrmpexporter/GetPort_BehaviorTest4.td
>      [java] Test Passed: OK
>      [java] 
>      [java] -----------------------------------------
>      [java] com/sun/jini/test/spec/jrmp/jrmpexporter/GetServerSocketFactory_BehaviorTest.td
>      [java] Test Passed: OK
>      [java] 
>      [java] -----------------------------------------
>      [java] com/sun/jini/test/spec/jrmp/jrmpexporter/GetServerSocketFactory_BehaviorTest1.td
>      [java] Test Passed: OK
>      [java] 
>      [java] -----------------------------------------
>      [java] com/sun/jini/test/spec/jrmp/jrmpexporter/GetServerSocketFactory_BehaviorTest2.td
>      [java] Test Passed: OK
>      [java] 
>      [java] -----------------------------------------
>      [java] com/sun/jini/test/spec/jrmp/jrmpexporter/GetServerSocketFactory_BehaviorTest3.td
>      [java] Test Passed: OK
>      [java] 
>      [java] -----------------------------------------
>      [java] com/sun/jini/test/spec/jrmp/jrmpexporter/GetServerSocketFactory_BehaviorTest4.td
>      [java] Test Passed: OK
>      [java] 
>      [java] -----------------------------------------
>      [java] com/sun/jini/test/spec/jrmp/jrmpexporter/Unexport_BehaviorTest.td
>      [java] Test Passed: OK
>      [java] 
>      [java] -----------------------------------------
>      [java] com/sun/jini/test/spec/jrmp/jrmpexporter/Unexport_BehaviorTest1.td
>      [java] Test Passed: OK
>      [java] 
>      [java] -----------------------------------------
>      [java] com/sun/jini/test/spec/jrmp/jrmpexporter/Unexport_BehaviorTest2.td
>      [java] Test Passed: OK
>      [java] 
>      [java] -----------------------------------------
>      [java] com/sun/jini/test/spec/jrmp/jrmpexporter/Unexport_BehaviorTest3.td
>      [java] Test Passed: OK
>      [java] 
>      [java] -----------------------------------------
>      [java] com/sun/jini/test/spec/jrmp/jrmpexporter/Unexport_BehaviorTest4.td
>      [java] Test Passed: OK
>      [java] 
>      [java] -----------------------------------------
>      [java] com/sun/jini/test/spec/jrmp/jrmpexporter/Unexport_IllegalStateExceptionTest.td
>      [java] Test Passed: OK
>      [java] 
>      [java] -----------------------------------------
>      [java] com/sun/jini/test/spec/jrmp/jrmpexporter/Unexport_IllegalStateExceptionTest1.td
>      [java] Test Passed: OK
>      [java] 
>      [java] -----------------------------------------
>      [java] com/sun/jini/test/spec/jrmp/jrmpexporter/Unexport_IllegalStateExceptionTest2.td
>      [java] Test Passed: OK
>      [java] 
>      [java] -----------------------------------------
>      [java] com/sun/jini/test/spec/jrmp/jrmpexporter/Unexport_IllegalStateExceptionTest3.td
>      [java] Test Passed: OK
>      [java] 
>      [java] -----------------------------------------
>      [java] com/sun/jini/test/spec/jrmp/jrmpexporter/Unexport_IllegalStateExceptionTest4.td
>      [java] Test Passed: OK
>      [java] 
>      [java] -----------------------------------------
>      [java] com/sun/jini/test/spec/jrmp/jrmpservercontext/GetServerContext_Test.td
>      [java] Test Passed: OK
>      [java] 
>      [java] -----------------------------------------
>      [java] com/sun/jini/test/spec/jrmp/jrmpservercontext/GetServerContext_Test1.td
>      [java] Test Passed: OK
>      [java] 
>      [java] -----------------------------------------
>      [java] com/sun/jini/test/spec/jrmp/jrmpservercontext/GetServerContext_Test2.td
>      [java] Test Passed: OK
>      [java] 
>      [java] -----------------------------------------
>      [java] com/sun/jini/test/spec/jrmp/jrmpservercontext/GetServerContext_Test3.td
>      [java] Test Passed: OK
>      [java] 
>      [java] -----------------------------------------
>      [java] com/sun/jini/test/spec/jrmp/jrmpservercontext/GetServerContext_Test4.td
>      [java] Test Passed: OK
>      [java] 
>      [java] -----------------------------------------
>      [java] com/sun/jini/test/impl/reliability/TransportReliability.td
>      [java] Test Skipped: verifiers are: com.sun.jini.qa.harness.SkipConfigTestVerifier
>      [java] -----------------------------------------
>      [java] com/sun/jini/test/impl/thread/TaskManagerTaskExceptionTest.td
>      [java] Test Passed: OK
>      [java] 
>      [ Caused by: java.net.BindException: Address already in usejava] -----------------------------------------
>      [java] com/sun/jini/test/impl/thread/WakeupManagerTaskExceptionTest.td
>      [java] Test Passed: OK
>      [java] 
>      [java] -----------------------------------------
>      [java] 
>      [java] # of tests started   = 397
>      [java] # of tests completed = 397
>      [java] # of tests skipped   = 18
>      [java] # of tests passed    = 395
>      [java] # of tests failed    = 2
>      [java] 
>      [java] -----------------------------------------
>      [java] 
>      [java]    Date finished:
>      [java]       Wed Mar 31 06:06:05 UTC 2010
>      [java]    Time elapsed:
>      [java]       9119 seconds
>      [java] 
>
> BUILD FAILED
> <http://hudson.zones.apache.org/hudson/job/River-trunk/ws/jtsk/trunk/build.xml>:2039:
The following error occurred while executing this line:
> <http://hudson.zones.apache.org/hudson/job/River-trunk/ws/jtsk/trunk/qa/build.xml>:268:
The following error occurred while executing this line:
> <http://hudson.zones.apache.org/hudson/job/River-trunk/ws/jtsk/trunk/qa/build.xml>:199:
Java returned: 1
>
> Total time: 152 minutes 1 second
> Publishing Javadoc
> Archiving artifacts
> Recording test results
>
>
>   


Mime
View raw message