reef-dev mailing list archives

Site index · List index
Message view « Date » · « Thread »
Top « Date » · « Thread »
From Shouheng Yi <shouhen...@gmail.com>
Subject Failed to build REEF on Windows' Ubuntu Bash
Date Mon, 09 Jan 2017 23:56:57 GMT
Hi REEF devs,

I tried to build REEF on my Windows machine using Ubuntu Bash; and it
failed after I did "mvn clean install -e." Has anybody done such a thing?
Thanks!


Results :

Tests in error:
  TestRuntimeStartHandler.testHttpHandlerBindingWithRuntimeClock:72 »
Runtime or...
  TestRuntimeStartHandler.testRunTimeStartStopHandler:86 » Injection Could
not i...

Tests run: 47, Failures: 0, Errors: 2, Skipped: 0

[INFO]
------------------------------------------------------------------------
[INFO] Reactor Summary:
[INFO]
[INFO] REEF .............................................. SUCCESS [10.602s]
[INFO] REEF Dot Net ...................................... SUCCESS [4.317s]
[INFO] REEF Annotations .................................. SUCCESS [6.985s]
[INFO] REEF Utils ........................................ SUCCESS [26.122s]
[INFO] REEF Tang Project ................................. SUCCESS [1.675s]
[INFO] Tang Test Jar A ................................... SUCCESS [4.831s]
[INFO] Tang Test Jar B ................................... SUCCESS [5.030s]
[INFO] Tang Test Jar AB .................................. SUCCESS [4.865s]
[INFO] Tang Test Jar B conflict A ........................ SUCCESS [0.894s]
[INFO] REEF Tang ......................................... SUCCESS [30.030s]
[INFO] REEF Wake Project ................................. SUCCESS [1.331s]
[INFO] REEF Wake ......................................... SUCCESS
[3:25.818s]
[INFO] REEF Common ....................................... SUCCESS [38.141s]
[INFO] REEF Runtime Local ................................ SUCCESS [41.855s]
[INFO] REEF Applications ................................. SUCCESS [0.914s]
[INFO] REEF Vortex ....................................... SUCCESS [14.791s]
[INFO] REEF HTTP Server .................................. FAILURE [48.582s]
[INFO] REEF Utils for Hadoop ............................. SKIPPED
[INFO] REEF Runtime for YARN ............................. SKIPPED
[INFO] REEF Runtime for HDInsight ........................ SKIPPED
[INFO] REEF IO ........................................... SKIPPED
[INFO] REEF Checkpoint ................................... SKIPPED
[INFO] REEF Bridge Java .................................. SKIPPED
[INFO] REEF Runtime for multiple runtime scenarios ....... SKIPPED
[INFO] REEF Bridge (Client) .............................. SKIPPED
[INFO] REEF Runtime Standalone ........................... SKIPPED
[INFO] REEF Runtime for Mesos ............................ SKIPPED
[INFO] REEF Poison ....................................... SKIPPED
[INFO] REEF Examples ..................................... SKIPPED
[INFO] REEF Examples CLR ................................. SKIPPED
[INFO] REEF Examples on HDInsight ........................ SKIPPED
[INFO] REEF Tang Tint .................................... SKIPPED
[INFO] REEF Tests ........................................ SKIPPED
[INFO] REEF Website ...................................... SKIPPED
[INFO]
------------------------------------------------------------------------
[INFO] BUILD FAILURE
[INFO]
------------------------------------------------------------------------
[INFO] Total time: 7:27.365s
[INFO] Finished at: Mon Jan 09 23:54:23 GMT 2017
[INFO] Final Memory: 80M/1441M
[INFO]
------------------------------------------------------------------------
[ERROR] Failed to execute goal
org.apache.maven.plugins:maven-surefire-plugin:2.19.1:test (default-test)
on project reef-webserver: There are test failures.
[ERROR]
[ERROR] Please refer to
/mnt/e/reef/lang/java/reef-webserver/target/surefire-reports for the
individual test results.
[ERROR] -> [Help 1]
org.apache.maven.lifecycle.LifecycleExecutionException: Failed to execute
goal org.apache.maven.plugins:maven-surefire-plugin:2.19.1:test
(default-test) on project reef-webserver: There are test failures.

Please refer to
/mnt/e/reef/lang/java/reef-webserver/target/surefire-reports for the
individual test results.
        at
org.apache.maven.lifecycle.internal.MojoExecutor.execute(MojoExecutor.java:213)
        at
org.apache.maven.lifecycle.internal.MojoExecutor.execute(MojoExecutor.java:153)
        at
org.apache.maven.lifecycle.internal.MojoExecutor.execute(MojoExecutor.java:145)
        at
org.apache.maven.lifecycle.internal.LifecycleModuleBuilder.buildProject(LifecycleModuleBuilder.java:84)
        at
org.apache.maven.lifecycle.internal.LifecycleModuleBuilder.buildProject(LifecycleModuleBuilder.java:59)
        at
org.apache.maven.lifecycle.internal.LifecycleStarter.singleThreadedBuild(LifecycleStarter.java:183)
        at
org.apache.maven.lifecycle.internal.LifecycleStarter.execute(LifecycleStarter.java:161)
        at org.apache.maven.DefaultMaven.doExecute(DefaultMaven.java:320)
        at org.apache.maven.DefaultMaven.execute(DefaultMaven.java:156)
        at org.apache.maven.cli.MavenCli.execute(MavenCli.java:537)
        at org.apache.maven.cli.MavenCli.doMain(MavenCli.java:196)
        at org.apache.maven.cli.MavenCli.main(MavenCli.java:141)
        at sun.reflect.NativeMethodAccessorImpl.invoke0(Native Method)
        at
sun.reflect.NativeMethodAccessorImpl.invoke(NativeMethodAccessorImpl.java:62)
        at
sun.reflect.DelegatingMethodAccessorImpl.invoke(DelegatingMethodAccessorImpl.java:43)
        at java.lang.reflect.Method.invoke(Method.java:498)
        at
org.codehaus.plexus.classworlds.launcher.Launcher.launchEnhanced(Launcher.java:289)
        at
org.codehaus.plexus.classworlds.launcher.Launcher.launch(Launcher.java:229)
        at
org.codehaus.plexus.classworlds.launcher.Launcher.mainWithExitCode(Launcher.java:415)
        at
org.codehaus.plexus.classworlds.launcher.Launcher.main(Launcher.java:356)
Caused by: org.apache.maven.plugin.MojoFailureException: There are test
failures.

Please refer to
/mnt/e/reef/lang/java/reef-webserver/target/surefire-reports for the
individual test results.
        at
org.apache.maven.plugin.surefire.SurefireHelper.reportExecution(SurefireHelper.java:91)
        at
org.apache.maven.plugin.surefire.SurefirePlugin.handleSummary(SurefirePlugin.java:320)
        at
org.apache.maven.plugin.surefire.AbstractSurefireMojo.executeAfterPreconditionsChecked(AbstractSurefireMojo.java:892)
        at
org.apache.maven.plugin.surefire.AbstractSurefireMojo.execute(AbstractSurefireMojo.java:755)
        at
org.apache.maven.plugin.DefaultBuildPluginManager.executeMojo(DefaultBuildPluginManager.java:101)
        at
org.apache.maven.lifecycle.internal.MojoExecutor.execute(MojoExecutor.java:209)
        ... 19 more
[ERROR]
[ERROR] Re-run Maven using the -X switch to enable full debug logging.
[ERROR]
[ERROR] For more information about the errors and possible solutions,
please read the following articles:
[ERROR] [Help 1]
http://cwiki.apache.org/confluence/display/MAVEN/MojoFailureException
[ERROR]
[ERROR] After correcting the problems, you can resume the build with the
command
[ERROR]   mvn <goals> -rf :reef-webserver

Mime
  • Unnamed multipart/alternative (inline, None, 0 bytes)
View raw message