reef-dev mailing list archives

Site index · List index
Message view « Date » · « Thread »
Top « Date » · « Thread »
From "Mariia Mykhailova (JIRA)" <j...@apache.org>
Subject [jira] [Commented] (REEF-291) Sporadic job failures in REEF-Tests
Date Tue, 27 Sep 2016 01:01:21 GMT

    [ https://issues.apache.org/jira/browse/REEF-291?page=com.atlassian.jira.plugin.system.issuetabpanels:comment-tabpanel&focusedCommentId=15524667#comment-15524667
] 

Mariia Mykhailova commented on REEF-291:
----------------------------------------

The tests listed here got fixed, but new ones started failing. Right now, for example, I see
3 identical test failures in last 25 [Travis CI|https://travis-ci.org/apache/reef/pull_requests]
runs:

{noformat}
Failed tests: 

  EvaluatorCloseTest.testEvaluatorClosingState:72 The result state of evaluator closing state
test is FAILED(org.apache.reef.tests.library.exceptions.DriverSideFailure: Evaluator's state
was not changed to closing.)
{noformat}

https://travis-ci.org/apache/reef/jobs/159741335
https://travis-ci.org/apache/reef/jobs/159982890
https://travis-ci.org/apache/reef/jobs/161986044

Maybe we should close this particular JIRA, since it hasn't been updated for almost a year,
and open another for {{testEvaluatorClosingState}} specifically.

> Sporadic job failures in REEF-Tests
> -----------------------------------
>
>                 Key: REEF-291
>                 URL: https://issues.apache.org/jira/browse/REEF-291
>             Project: REEF
>          Issue Type: Bug
>          Components: REEF-Tests
>            Reporter: Brian Cho
>            Assignee: Brian Cho
>
> We've been seeing sporadic reef-tests failures in the Windows CI, e.g. [Windows-265|https://builds.apache.org/job/Reef-pull-request-windows/265/consoleFull].
It appears jobs that should fail right away are instead reaching the one-minute timeout. I
am now also seeing this semi-regularly on a Ubuntu box.
> This:
> {code}
> Apr 27, 2015 11:05:31 AM org.apache.reef.client.DriverLauncher run
> WARNING: The Job timed out.
> Apr 27, 2015 11:05:31 AM org.apache.reef.runtime.common.client.RunningJobsImpl closeAllJobs
> WARNING: Force close job FailTaskClose
> {code}
> Leads to this:
> {code}
> Tests run: 7, Failures: 1, Errors: 0, Skipped: 0, Time elapsed: 85.547 sec <<<
FAILURE! - in org.apache.reef.tests.fail.FailTaskTest
> testFailTaskClose(org.apache.reef.tests.fail.FailTaskTest)  Time elapsed: 60.183 sec
 <<< FAILURE!
> java.lang.AssertionError: expected:<FAILED> but was:<FORCE_CLOSED>
> 	at org.junit.Assert.fail(Assert.java:88)
> 	at org.junit.Assert.failNotEquals(Assert.java:743)
> 	at org.junit.Assert.assertEquals(Assert.java:118)
> 	at org.junit.Assert.assertEquals(Assert.java:144)
> 	at org.apache.reef.tests.TestUtils.assertLauncherFailure(TestUtils.java:39)
> 	at org.apache.reef.tests.fail.FailTaskTest.failOn(FailTaskTest.java:52)
> 	at org.apache.reef.tests.fail.FailTaskTest.testFailTaskClose(FailTaskTest.java:91)
> {code}



--
This message was sent by Atlassian JIRA
(v6.3.4#6332)

Mime
View raw message