reef-dev mailing list archives

Site index · List index
Message view « Date » · « Thread »
Top « Date » · « Thread »
From Dhruv Mahajan <dhruv.maha...@gmail.com>
Subject Re: REEF.NET test failures with current master
Date Tue, 05 Apr 2016 21:11:29 GMT
Hi

I tried running tests from powershell on master branch...It ran for a
while, but then failed with the below message. Something seems wrong.

[‎4/‎5/‎2016 2:08 PM] Dhruv Mahajan:

No Title

  Org.Apache.REEF.Driver.Bridge.ClrClientHelper Information: 0 :
2016-04-05T14:08:09.5891371-07:00 0029

  INFO: files are extracted.

  Org.Apache.REEF.Driver.DriverConfigGenerator Warning: 0 :
2016-04-05T14:08:09.5891371-07:00 0029

  WARNING: There is no file driverClassHierarchy.bin extracted from the jar
file at .\.

    Finished:    Org.Apache.REEF.Tests

  === TEST EXECUTION SUMMARY ===

     Org.Apache.REEF.Tests  Total: 42, Errors: 0, Failed: 2, Skipped: 7,
Time: 361.946s

C:\Users\dhrumaha\Desktop\projects\reef\lang\cs\xunit.targets(49,5): error
MSB3073: The command "..\packages\xunit.runn

er.console.2.1.0\tools\xunit.console.exe
..\bin\x64\Debug\Org.Apache.REEF.Tests\\Org.Apache.REEF.Tests.dll" exited
with

 code 2. [
C:\Users\dhrumaha\Desktop\projects\reef\lang\cs\Org.Apache.REEF.Tests\Org.Apache.REEF.Tests.csproj
]

Done Building Project "
C:\Users\dhrumaha\Desktop\projects\reef\lang\cs\Org.Apache.REEF.Tests\Org.Apache.REEF.Tests.cspr

oj" (Test target(s)) -- FAILED.



Done Building Project "
C:\Users\dhrumaha\Desktop\projects\reef\lang\cs\TestRunner.proj" (default
targets) -- FAILED.





Build FAILED.



"C:\Users\dhrumaha\Desktop\projects\reef\lang\cs\TestRunner.proj" (default
target) (1) ->

"
C:\Users\dhrumaha\Desktop\projects\reef\lang\cs\Org.Apache.REEF.Tests\Org.Apache.REEF.Tests.csproj"
(Test target) (9)

->

(Test target) ->

  C:\Users\dhrumaha\Desktop\projects\reef\lang\cs\xunit.targets(49,5):
error MSB3073: The command "..\packages\xunit.ru

nner.console.2.1.0\tools\xunit.console.exe
..\bin\x64\Debug\Org.Apache.REEF.Tests\\Org.Apache.REEF.Tests.dll" exited wi

th code 2. [
C:\Users\dhrumaha\Desktop\projects\reef\lang\cs\Org.Apache.REEF.Tests\Org.Apache.REEF.Tests.csproj
]



    0 Warning(s)

    1 Error(s)



On Tue, Apr 5, 2016 at 11:03 AM, Mariia Mykhailova <mamykhai@microsoft.com>
wrote:

> Yes, that indicates success. If there is failure at one of the tests,
> "build" stops at it and doesn't proceed (and shows some error message).
>
> A lot of msbuild experiences are different from equivalent maven ones :-(
>
> -Mariia
>
> -----Original Message-----
> From: Markus Weimer [mailto:markus@weimo.de]
> Sent: Monday, April 4, 2016 6:05 PM
> To: dev@reef.apache.org
> Subject: Re: REEF.NET test failures with current master
>
> On 2016-04-04 17:02, Mariia Mykhailova wrote:
> > For xUnit console runner, as a temporary solution, please install it
> > manually from NuGet.
>
> That seems to have worked:
>
> ```
> Build succeeded.
>      0 Warning(s)
>      0 Error(s)
> ```
>
> Does this indicate that the tests pass? There doesn't seem to be a final
> summary like with maven?
>
> Thanks,
>
> Markus
>

Mime
  • Unnamed multipart/alternative (inline, None, 0 bytes)
View raw message