reef-dev mailing list archives

Site index · List index
Message view « Date » · « Thread »
Top « Date » · « Thread »
From Mariia Mykhailova <mamyk...@microsoft.com>
Subject RE: running tests from powershell
Date Tue, 05 Apr 2016 17:41:51 GMT
You don't have xUnit.runner.console installed. As a temporary solution, please install it manually
from NuGet. I'll see how to modify our setup so that it gets installed automatically.

-Mariia

-----Original Message-----
From: Dhruv Mahajan [mailto:dhruv.mahajan@gmail.com] 
Sent: Tuesday, April 5, 2016 10:40 AM
To: dev@reef.apache.org
Subject: running tests from powershell

Hi

I tried running C# tests from powershell from reef folder. I got the following error. Any
idea why? There is some path not found error. I verifies and Client.Tests.dll was present
there.

Test:
  ..\packages\xunit.runner.console.2.1.0\tools\xunit.console.exe
..\bin\x64\Debug\Org.Apache.REEF.Client.Tests\\Org.Apa
  che.REEF.Client.Tests.dll
  The system cannot find the path specified.
C:\Users\dhrumaha\Desktop\projects\reef\lang\cs\xunit.targets(49,5): error
MSB3073: The command "..\packages\xunit.runn er.console.2.1.0\tools\xunit.console.exe
..\bin\x64\Debug\Org.Apache.REEF.Client.Tests\\Org.Apache.REEF.Client.Tests.dl
l" exited with code 3.
[C:\Users\dhrumaha\Desktop\projects\reef\lang\cs\Org.Apache.REEF.Client.Tests\
https://na01.safelinks.protection.outlook.com/?url=Org.Apache.REEF.Cl&data=01%7c01%7cmamykhai%40microsoft.com%7c7f086e77ae9a4e36214908d35d79442c%7c72f988bf86f141af91ab2d7cd011db47%7c1&sdata=B5CWFhaBKmHO049of%2bVCYCK0UBFYNtuE3GvyeddZOVU%3d
ient.Tests.csproj]
Done Building Project
"C:\Users\dhrumaha\Desktop\projects\reef\lang\cs\Org.Apache.REEF.Client.Tests\Org.Apache.REEF.Cli
ent.Tests.csproj" (Test target(s)) -- FAILED.

Done Building Project
"C:\Users\dhrumaha\Desktop\projects\reef\lang\cs\TestRunner.proj" (default
targets) -- FAILED.


Build FAILED.

"C:\Users\dhrumaha\Desktop\projects\reef\lang\cs\TestRunner.proj" (default
target) (1) ->
"C:\Users\dhrumaha\Desktop\projects\reef\lang\cs\Org.Apache.REEF.Client.Tests\Org.Apache.REEF.Client.Tests.csproj"
(Tes
t target) (2) ->
(Test target) ->
  C:\Users\dhrumaha\Desktop\projects\reef\lang\cs\xunit.targets(49,5):
error MSB3073: The command "..\packages\xunit.ru nner.console.2.1.0\tools\xunit.console.exe
..\bin\x64\Debug\Org.Apache.REEF.Client.Tests\\Org.Apache.REEF.Client.Tests.
dll" exited with code 3.
[C:\Users\dhrumaha\Desktop\projects\reef\lang\cs\Org.Apache.REEF.Client.Tests\Org.Apache.REEF.
Client.Tests.csproj]

    0 Warning(s)
    1 Error(s)
Mime
View raw message