reef-dev mailing list archives

Site index · List index
Message view « Date » · « Thread »
Top « Date » · « Thread »
From Boris Shulman <shulm...@gmail.com>
Subject Re: Jenkins build failure
Date Mon, 29 Feb 2016 07:02:25 GMT
Just noticed that other PRs failing because of the same issue. Is it a
known problem with our build?

On Sun, Feb 28, 2016 at 9:38 PM, Boris Shulman <shulmanb@gmail.com> wrote:

> Hi,
>
> My PR started failing with following errors:
>
> [WARNING] Failed to notify spy hudson.maven.Maven3Builder$JenkinsEventSpy: Unable to
load resource jar:file:/C:/Windows/system32/config/systemprofile/.jenkins/cache/jars/E1/2CFD76F12D93953A10911C2505CB59.jar!/hudson/maven/reporters/Messages.propertiesERROR:
Failed to parse POMshudson.util.IOException2 <http://stacktrace.jenkins-ci.org/search?query=hudson.util.IOException2>:
java.util.MissingResourceException: Unable to load resource jar:file:/C:/Windows/system32/config/systemprofile/.jenkins/cache/jars/E1/2CFD76F12D93953A10911C2505CB59.jar!/hudson/maven/Messages.properties
> 	at hudson.maven.Maven3Builder.call(Maven3Builder.java:184) <http://stacktrace.jenkins-ci.org/search/?query=hudson.maven.Maven3Builder.call&entity=method>
> 	at hudson.maven.Maven3Builder.call(Maven3Builder.java:71) <http://stacktrace.jenkins-ci.org/search/?query=hudson.maven.Maven3Builder.call&entity=method>
> 	at hudson.remoting.UserRequest.perform(UserRequest.java:118) <http://stacktrace.jenkins-ci.org/search/?query=hudson.remoting.UserRequest.perform&entity=method>
> 	at hudson.remoting.UserRequest.perform(UserRequest.java:48) <http://stacktrace.jenkins-ci.org/search/?query=hudson.remoting.UserRequest.perform&entity=method>
> 	at hudson.remoting.Request$2.run(Request.java:328) <http://stacktrace.jenkins-ci.org/search/?query=hudson.remoting.Request$2.run&entity=method>
> 	at hudson.remoting.InterceptingExecutorService$1.call(InterceptingExecutorService.java:72)
<http://stacktrace.jenkins-ci.org/search/?query=hudson.remoting.InterceptingExecutorService$1.call&entity=method>
> 	at java.util.concurrent.FutureTask.run(FutureTask.java:266) <http://stacktrace.jenkins-ci.org/search/?query=java.util.concurrent.FutureTask.run&entity=method>
> 	at java.util.concurrent.ThreadPoolExecutor.runWorker(ThreadPoolExecutor.java:1142) <http://stacktrace.jenkins-ci.org/search/?query=java.util.concurrent.ThreadPoolExecutor.runWorker&entity=method>
> 	at java.util.concurrent.ThreadPoolExecutor$Worker.run(ThreadPoolExecutor.java:617) <http://stacktrace.jenkins-ci.org/search/?query=java.util.concurrent.ThreadPoolExecutor$Worker.run&entity=method>
> 	at java.lang.Thread.run(Thread.java:745) <http://stacktrace.jenkins-ci.org/search/?query=java.lang.Thread.run&entity=method>
> 	at ......remote call to Channel to Maven [f:\jenkins\jenkins-slave\tools\hudson.model.JDK\jdk1.8.0_45/bin/java,
-Xmx2g, -Xms512m, -XX:MaxPermSize=1024m, -cp, f:\jenkins\jenkins-slave\maven31-agent.jar;f:\jenkins\tools\maven\latest3\boot\plexus-classworlds-2.5.1.jar;f:\jenkins\tools\maven\latest3/conf/logging,
jenkins.maven3.agent.Maven31Main, f:\jenkins\tools\maven\latest3, F:\jenkins\jenkins-slave\slave.jar,
f:\jenkins\jenkins-slave\maven31-interceptor.jar, f:\jenkins\jenkins-slave\maven3-interceptor-commons.jar,
59788](Native Method)
> 	at hudson.remoting.Channel.attachCallSiteStackTrace(Channel.java:1416)
> 	at hudson.remoting.UserResponse.retrieve(UserRequest.java:220)
> 	at hudson.remoting.Channel.call(Channel.java:781)
> 	at hudson.maven.ProcessCache$MavenProcess.call(ProcessCache.java:161)
> 	at hudson.maven.MavenModuleSetBuild$MavenModuleSetBuildExecution.doRun(MavenModuleSetBuild.java:853)
> 	at hudson.model.AbstractBuild$AbstractBuildExecution.run(AbstractBuild.java:534)
> 	at hudson.model.Run.execute(Run.java:1738)
> 	at hudson.maven.MavenModuleSetBuild.run(MavenModuleSetBuild.java:531)
> 	at hudson.model.ResourceController.execute(ResourceController.java:98)
> 	at hudson.model.Executor.run(Executor.java:410)
> Caused by: java.util.MissingResourceException: Unable to load resource jar:file:/C:/Windows/system32/config/systemprofile/.jenkins/cache/jars/E1/2CFD76F12D93953A10911C2505CB59.jar!/hudson/maven/Messages.properties
> 	at org.jvnet.localizer.ResourceBundleHolder.get(ResourceBundleHolder.java:121)
> 	at org.jvnet.localizer.ResourceBundleHolder.get(ResourceBundleHolder.java:128)
> 	at org.jvnet.localizer.ResourceBundleHolder.get(ResourceBundleHolder.java:128)
> 	at org.jvnet.localizer.ResourceBundleHolder.format(ResourceBundleHolder.java:170)
> 	at hudson.maven.Messages.MavenBuilder_Waiting(Messages.java:475)
> 	at hudson.maven.AbstractMavenBuilder.waitForAsynchronousExecutions(AbstractMavenBuilder.java:184)
> 	at hudson.maven.Maven3Builder.call(Maven3Builder.java:143)
> 	at hudson.maven.Maven3Builder.call(Maven3Builder.java:71)
> 	at hudson.remoting.UserRequest.perform(UserRequest.java:118)
> 	at hudson.remoting.UserRequest.perform(UserRequest.java:48)
> 	at hudson.remoting.Request$2.run(Request.java:328)
> 	at hudson.remoting.InterceptingExecutorService$1.call(InterceptingExecutorService.java:72)
> 	at java.util.concurrent.FutureTask.run(FutureTask.java:266)
> 	at java.util.concurrent.ThreadPoolExecutor.runWorker(ThreadPoolExecutor.java:1142)
> 	at java.util.concurrent.ThreadPoolExecutor$Worker.run(ThreadPoolExecutor.java:617)
> 	at java.lang.Thread.run(Thread.java:745)
> Caused by: java.util.zip.ZipException: zip file is empty
> 	at java.util.zip.ZipFile.open(Native Method)
> 	at java.util.zip.ZipFile.<init>(ZipFile.java:220)
> 	at java.util.zip.ZipFile.<init>(ZipFile.java:150)
> 	at java.util.jar.JarFile.<init>(JarFile.java:166)
> 	at java.util.jar.JarFile.<init>(JarFile.java:103)
> 	at sun.net.www.protocol.jar.URLJarFile.<init>(URLJarFile.java:93)
> 	at sun.net.www.protocol.jar.URLJarFile.getJarFile(URLJarFile.java:69)
> 	at sun.net.www.protocol.jar.JarFileFactory.get(JarFileFactory.java:109)
> 	at sun.net.www.protocol.jar.JarURLConnection.connect(JarURLConnection.java:122)
> 	at sun.net.www.protocol.jar.JarURLConnection.getInputStream(JarURLConnection.java:150)
> 	at org.jvnet.localizer.ResourceBundleHolder.get(ResourceBundleHolder.java:113)
> 	... 15 more
> channel stopped
> Putting comment on the pull request
> Finished: FAILURE
>
>
>
> Any ideas?
>
>

Mime
  • Unnamed multipart/alternative (inline, None, 0 bytes)
View raw message