rave-commits mailing list archives

Site index · List index
Message view « Date » · « Thread »
Top « Date » · « Thread »
From Apache Jenkins Server <jenk...@builds.apache.org>
Subject Build failed in Jenkins: rave-project-trunk #412
Date Mon, 06 Feb 2012 02:24:03 GMT
See <https://builds.apache.org/job/rave-project-trunk/412/changes>

Changes:

[mfranklin] [maven-release-plugin] prepare for next development iteration

[mfranklin] [maven-release-plugin] prepare release 0.8-incubating

[mfranklin] Updated CHANGELOG for 0.8-incubating release

------------------------------------------
Started by an SCM change
Started by upstream project "rave-master-pom-trunk" build number 19
Building remotely on ubuntu3
Updating http://svn.apache.org/repos/asf/incubator/rave/trunk
U         rave-components/rave-core/pom.xml
U         rave-components/rave-commons/pom.xml
U         rave-components/rave-web/pom.xml
U         rave-components/pom.xml
U         rave-portal-dependencies/pom.xml
U         rave-shindig/pom.xml
U         rave-portal-resources/pom.xml
U         CHANGELOG
U         rave-providers/rave-opensocial-provider/pom.xml
U         rave-providers/rave-w3c-provider/pom.xml
U         rave-providers/pom.xml
U         pom.xml
U         rave-demo-gadgets/pom.xml
U         rave-portal/pom.xml
At revision 1240879
[locks-and-latches] Checking to see if we really have the locks
[locks-and-latches] Have all the locks, build can start
Parsing POMs
Failed to transfer Could not find artifact org.apache.rave:rave-master:pom:0.8-incubating
in spring-milestone (http://maven.springframework.org/milestone)
Failed to transfer Could not find artifact org.apache.rave:rave-master:pom:0.8-incubating
in central (http://repo1.maven.org/maven2)
[locks-and-latches] Releasing all the locks
[locks-and-latches] All the locks released
ERROR: Failed to parse POMs
hudson.util.IOException2: remote file operation failed: <https://builds.apache.org/job/rave-project-trunk/ws/trunk>
at hudson.remoting.Channel@3bf2e5c0:ubuntu3
	at hudson.FilePath.act(FilePath.java:780)
	at hudson.FilePath.act(FilePath.java:766)
	at hudson.maven.MavenModuleSetBuild$RunnerImpl.parsePoms(MavenModuleSetBuild.java:913)
	at hudson.maven.MavenModuleSetBuild$RunnerImpl.doRun(MavenModuleSetBuild.java:658)
	at hudson.model.AbstractBuild$AbstractRunner.run(AbstractBuild.java:467)
	at hudson.model.Run.run(Run.java:1404)
	at hudson.maven.MavenModuleSetBuild.run(MavenModuleSetBuild.java:481)
	at hudson.model.ResourceController.execute(ResourceController.java:88)
	at hudson.model.Executor.run(Executor.java:238)
Caused by: hudson.remoting.ProxyException: hudson.maven.MavenModuleSetBuild$MavenExecutionException:
org.apache.maven.project.ProjectBuildingException: Some problems were encountered while processing
the POMs:
[FATAL] Non-resolvable parent POM: Could not find artifact org.apache.rave:rave-master:pom:0.8-incubating
in spring-milestone (http://maven.springframework.org/milestone) and 'parent.relativePath'
points at wrong local POM @ line 26, column 13

	at hudson.maven.MavenModuleSetBuild$PomParser.invoke(MavenModuleSetBuild.java:1271)
	at hudson.maven.MavenModuleSetBuild$PomParser.invoke(MavenModuleSetBuild.java:1048)
	at hudson.FilePath$FileCallableWrapper.call(FilePath.java:2045)
	at hudson.remoting.UserRequest.perform(UserRequest.java:118)
	at hudson.remoting.UserRequest.perform(UserRequest.java:48)
	at hudson.remoting.Request$2.run(Request.java:287)
	at java.util.concurrent.Executors$RunnableAdapter.call(Executors.java:441)
	at java.util.concurrent.FutureTask$Sync.innerRun(FutureTask.java:303)
	at java.util.concurrent.FutureTask.run(FutureTask.java:138)
	at java.util.concurrent.ThreadPoolExecutor$Worker.runTask(ThreadPoolExecutor.java:886)
	at java.util.concurrent.ThreadPoolExecutor$Worker.run(ThreadPoolExecutor.java:908)
	at java.lang.Thread.run(Thread.java:662)
Caused by: hudson.remoting.ProxyException: org.apache.maven.project.ProjectBuildingException:
Some problems were encountered while processing the POMs:
[FATAL] Non-resolvable parent POM: Could not find artifact org.apache.rave:rave-master:pom:0.8-incubating
in spring-milestone (http://maven.springframework.org/milestone) and 'parent.relativePath'
points at wrong local POM @ line 26, column 13

	at org.apache.maven.project.DefaultProjectBuilder.build(DefaultProjectBuilder.java:339)
	at hudson.maven.MavenEmbedder.buildProjects(MavenEmbedder.java:361)
	at hudson.maven.MavenEmbedder.readProjects(MavenEmbedder.java:331)
	at hudson.maven.MavenModuleSetBuild$PomParser.invoke(MavenModuleSetBuild.java:1221)
	... 11 more
Skipping Cobertura coverage report as build was not UNSTABLE or better ...


Mime
View raw message