rave-commits mailing list archives

Site index · List index
Message view « Date » · « Thread »
Top « Date » · « Thread »
From Apache Jenkins Server <jenk...@builds.apache.org>
Subject Build failed in Jenkins: rave-project-trunk #297
Date Fri, 04 Nov 2011 15:04:21 GMT
See <https://builds.apache.org/job/rave-project-trunk/297/changes>

Changes:

[scottbw] Added back in W3C provider with a few improvements: uses RegionWidget ID for the
sharedDataKey rather than hardcoded, supports height and width attributes

[jasha] RAVE-317 add delete user box in admin interface

------------------------------------------
[...truncated 3923 lines...]
DEBUG: org.apache.rave.provider.opensocial.web.renderer.OpenSocialWidgetRenderer - Gadget
Script Data: <script>rave.registerWidget(widgetsByRegionIdMap, 1, {type: 'OpenSocial',
regionWidgetId: null, widgetUrl: 'null',  securityToken: 'null',  metadata: null, userPrefs:
{}, collapsed: false});</script>
Tests run: 4, Failures: 0, Errors: 0, Skipped: 0, Time elapsed: 0.015 sec
Running org.apache.rave.provider.opensocial.repository.ShindigGadgetMetadataRepositoryTest
DEBUG: org.apache.rave.provider.opensocial.repository.impl.ShindigGadgetMetadataRepository
- Shindig render Url: null://null/rpc
DEBUG: org.apache.rave.provider.opensocial.repository.impl.ShindigGadgetMetadataRepository
- requestContent: [{"id":"gadgets.metadata","method":"gadgets.metadata","params":{"groupId":"@self","ids":["http://www.example.com/gadget.xml"],"container":"default","userId":"@viewer","fields":["iframeUrl","modulePrefs.*","needsTokenRefresh","userPrefs.*","views.preferredHeight","views.preferredWidth","expireTimeMs","responseTimeMs"]}}]
DEBUG: org.apache.rave.provider.opensocial.repository.impl.ShindigGadgetMetadataRepository
- shindig metadata raw response: [{"id":"gadgets.metadata","result":{"http://www.example.com/gadget.xml":{"data-snipped":"here-for-brevity","userPrefs":{"age":{"dataType":"STRING","default":"0","displayName":"Age"}}
  }}}]
DEBUG: org.apache.rave.provider.opensocial.repository.impl.ShindigGadgetMetadataRepository
- shindig metadata trimmed response: {"userPrefs":{"age":{"dataType":"STRING","default":"0","displayName":"Age"}},"hasPrefsToEdit":true,"data-snipped":"here-for-brevity"}
DEBUG: org.apache.rave.provider.opensocial.repository.impl.ShindigGadgetMetadataRepository
- Shindig render Url: null://null/rpc
DEBUG: org.apache.rave.provider.opensocial.repository.impl.ShindigGadgetMetadataRepository
- requestContent: [{"id":"gadgets.metadata","method":"gadgets.metadata","params":{"groupId":"@self","ids":["http://www.example.com/gadget.xml"],"container":"default","userId":"@viewer","fields":["iframeUrl","modulePrefs.*","needsTokenRefresh","userPrefs.*","views.preferredHeight","views.preferredWidth","expireTimeMs","responseTimeMs"]}}]
DEBUG: org.apache.rave.provider.opensocial.repository.impl.ShindigGadgetMetadataRepository
- shindig metadata raw response: [{"id":"gadgets.metadata","result":{"http://www.example.com/gadget.xml":{"data-snipped":"here-for-brevity","userPrefs":{}}}}]
DEBUG: org.apache.rave.provider.opensocial.repository.impl.ShindigGadgetMetadataRepository
- shindig metadata trimmed response: {"userPrefs":{},"hasPrefsToEdit":false,"data-snipped":"here-for-brevity"}
DEBUG: org.apache.rave.provider.opensocial.repository.impl.ShindigGadgetMetadataRepository
- Shindig render Url: null://null/rpc
DEBUG: org.apache.rave.provider.opensocial.repository.impl.ShindigGadgetMetadataRepository
- requestContent: [{"id":"gadgets.metadata","method":"gadgets.metadata","params":{"groupId":"@self","ids":["http://www.example.com/gadget.xml"],"container":"default","userId":"@viewer","fields":["iframeUrl","modulePrefs.*","needsTokenRefresh","userPrefs.*","views.preferredHeight","views.preferredWidth","expireTimeMs","responseTimeMs"]}}]
DEBUG: org.apache.rave.provider.opensocial.repository.impl.ShindigGadgetMetadataRepository
- shindig metadata raw response: [{"id":"gadgets.metadata","result":{"http://www.example.com/gadget.xml":{"data-snipped":"here-for-brevity","userPrefs":{"age":{"dataType":"HIDDEN","default":"0","displayName":"Age"}}
  }}}]
DEBUG: org.apache.rave.provider.opensocial.repository.impl.ShindigGadgetMetadataRepository
- shindig metadata trimmed response: {"userPrefs":{"age":{"dataType":"HIDDEN","default":"0","displayName":"Age"}},"hasPrefsToEdit":false,"data-snipped":"here-for-brevity"}
DEBUG: org.apache.rave.provider.opensocial.repository.impl.ShindigGadgetMetadataRepository
- Shindig render Url: null://null/rpc
DEBUG: org.apache.rave.provider.opensocial.repository.impl.ShindigGadgetMetadataRepository
- requestContent: [{"id":"gadgets.metadata","method":"gadgets.metadata","params":{"groupId":"@self","ids":["http://www.example.com/gadget.xml"],"container":"default","userId":"@viewer","fields":["iframeUrl","modulePrefs.*","needsTokenRefresh","userPrefs.*","views.preferredHeight","views.preferredWidth","expireTimeMs","responseTimeMs"]}}]
DEBUG: org.apache.rave.provider.opensocial.repository.impl.ShindigGadgetMetadataRepository
- shindig metadata raw response: BAD RESPONSE STRING
Tests run: 4, Failures: 0, Errors: 0, Skipped: 0, Time elapsed: 0.02 sec

Results :

Tests run: 24, Failures: 0, Errors: 0, Skipped: 0

[JENKINS] Recording test results
[INFO] 
[INFO] --- maven-jar-plugin:2.3.1:jar (default-jar) @ rave-opensocial-provider ---
[INFO] Building jar: <https://builds.apache.org/job/rave-project-trunk/ws/trunk/rave-providers/rave-opensocial-provider/target/rave-opensocial-provider-0.6-incubating-SNAPSHOT.jar>
[INFO] 
[INFO] --- maven-site-plugin:3.0:attach-descriptor (attach-descriptor) @ rave-opensocial-provider
---
[INFO] [INFO] Installing <https://builds.apache.org/job/rave-project-trunk/ws/trunk/rave-providers/rave-opensocial-provider/target/rave-opensocial-provider-0.6-incubating-SNAPSHOT.jar>
to /home/jenkins/.m2/repository/org/apache/rave/rave-opensocial-provider/0.6-incubating-SNAPSHOT/rave-opensocial-provider-0.6-incubating-SNAPSHOT.jar
[INFO] Installing <https://builds.apache.org/job/rave-project-trunk/ws/trunk/rave-providers/rave-opensocial-provider/pom.xml>
to /home/jenkins/.m2/repository/org/apache/rave/rave-opensocial-provider/0.6-incubating-SNAPSHOT/rave-opensocial-provider-0.6-incubating-SNAPSHOT.pom

[INFO] --- maven-install-plugin:2.3.1:install (default-install) @ rave-opensocial-provider
---
[JENKINS] Configuring cobertura-maven-plugin to enable xml reports
[INFO] 
[INFO] --- maven-remote-resources-plugin:1.2.1:process (default) @ rave-opensocial-provider
---
[INFO] [debug] execute contextualize
[INFO] Using 'UTF-8' encoding to copy filtered resources.
[INFO] Copying 1 resource
[INFO] Copying 4 resources
[INFO] Copying 4 resources

[INFO] --- maven-resources-plugin:2.5:resources (default-resources) @ rave-opensocial-provider
---
[INFO] [INFO] Nothing to compile - all classes are up to date

[INFO] --- maven-compiler-plugin:2.3.2:compile (default-compile) @ rave-opensocial-provider
---
[INFO] 
[INFO] --- cobertura-maven-plugin:2.5.1:instrument (default-cli) @ rave-opensocial-provider
---
[INFO] Cobertura 1.9.4.1 - GNU GPL License (NO WARRANTY) - See COPYRIGHT file
Instrumenting 11 files to <https://builds.apache.org/job/rave-project-trunk/ws/trunk/rave-providers/rave-opensocial-provider/target/generated-classes/cobertura>
Cobertura: Saved information on 11 classes.
Instrument time: 103ms

[INFO] Instrumentation was successful.
[INFO] NOT adding cobertura ser file to attached artifacts list.
[debug] execute contextualize
[INFO] [INFO] Using 'UTF-8' encoding to copy filtered resources.
[INFO] Copying 2 resources

[INFO] [INFO] Copying 4 resources
[INFO] Copying 4 resources
--- maven-resources-plugin:2.5:testResources (default-testResources) @ rave-opensocial-provider
---
[INFO] 
[INFO] --- maven-compiler-plugin:2.3.2:testCompile (default-testCompile) @ rave-opensocial-provider
---
[INFO] Nothing to compile - all classes are up to date
[INFO] [INFO] Surefire report directory: <https://builds.apache.org/job/rave-project-trunk/ws/trunk/rave-providers/rave-opensocial-provider/target/surefire-reports>

[INFO] 
-------------------------------------------------------
--- maven-surefire-plugin:2.9:test (default-test) @ rave-opensocial-provider --- T E S T S
-------------------------------------------------------

Running org.apache.rave.provider.opensocial.service.SecurityTokenServiceTest
Tests run: 15, Failures: 0, Errors: 0, Skipped: 0, Time elapsed: 0.654 sec
Running org.apache.rave.provider.opensocial.service.OpenSocialServiceTest
Tests run: 1, Failures: 0, Errors: 0, Skipped: 0, Time elapsed: 0.004 sec
Running org.apache.rave.provider.opensocial.web.renderer.OpenSocialWidgetRendererTest
ERROR: org.apache.rave.provider.opensocial.web.renderer.OpenSocialWidgetRenderer - Exception
caught adding preference to JSONObject: RegionWidgetPreference{entityId=3, name='null', value='null'}
org.json.JSONException: Null key.
	at org.json.JSONObject.put(JSONObject.java:1052)
	at org.apache.rave.provider.opensocial.web.renderer.OpenSocialWidgetRenderer.getWidgetScript(OpenSocialWidgetRenderer.java:106)
	at org.apache.rave.provider.opensocial.web.renderer.OpenSocialWidgetRenderer.render(OpenSocialWidgetRenderer.java:94)
	at org.apache.rave.provider.opensocial.web.renderer.OpenSocialWidgetRenderer.render(OpenSocialWidgetRenderer.java:45)
	at org.apache.rave.provider.opensocial.web.renderer.OpenSocialWidgetRendererTest.render_valid(OpenSocialWidgetRendererTest.java:107)
	at sun.reflect.NativeMethodAccessorImpl.invoke0(Native Method)
	at sun.reflect.NativeMethodAccessorImpl.invoke(NativeMethodAccessorImpl.java:39)
	at sun.reflect.DelegatingMethodAccessorImpl.invoke(DelegatingMethodAccessorImpl.java:25)
	at java.lang.reflect.Method.invoke(Method.java:597)
	at org.junit.runners.model.FrameworkMethod$1.runReflectiveCall(FrameworkMethod.java:44)
	at org.junit.internal.runners.model.ReflectiveCallable.run(ReflectiveCallable.java:15)
	at org.junit.runners.model.FrameworkMethod.invokeExplosively(FrameworkMethod.java:41)
	at org.junit.internal.runners.statements.InvokeMethod.evaluate(InvokeMethod.java:20)
	at org.junit.internal.runners.statements.RunBefores.evaluate(RunBefores.java:28)
	at org.junit.runners.BlockJUnit4ClassRunner.runChild(BlockJUnit4ClassRunner.java:76)
	at org.junit.runners.BlockJUnit4ClassRunner.runChild(BlockJUnit4ClassRunner.java:50)
	at org.junit.runners.ParentRunner$3.run(ParentRunner.java:193)
	at org.junit.runners.ParentRunner$1.schedule(ParentRunner.java:52)
	at org.junit.runners.ParentRunner.runChildren(ParentRunner.java:191)
	at org.junit.runners.ParentRunner.access$000(ParentRunner.java:42)
	at org.junit.runners.ParentRunner$2.evaluate(ParentRunner.java:184)
	at org.junit.runners.ParentRunner.run(ParentRunner.java:236)
	at org.apache.maven.surefire.junit4.JUnit4TestSet.execute(JUnit4TestSet.java:53)
	at org.apache.maven.surefire.junit4.JUnit4Provider.executeTestSet(JUnit4Provider.java:123)
	at org.apache.maven.surefire.junit4.JUnit4Provider.invoke(JUnit4Provider.java:104)
	at sun.reflect.NativeMethodAccessorImpl.invoke0(Native Method)
	at sun.reflect.NativeMethodAccessorImpl.invoke(NativeMethodAccessorImpl.java:39)
	at sun.reflect.DelegatingMethodAccessorImpl.invoke(DelegatingMethodAccessorImpl.java:25)
	at java.lang.reflect.Method.invoke(Method.java:597)
	at org.apache.maven.surefire.util.ReflectionUtils.invokeMethodWithArray(ReflectionUtils.java:164)
	at org.apache.maven.surefire.booter.ProviderFactory$ProviderProxy.invoke(ProviderFactory.java:110)
	at org.apache.maven.surefire.booter.SurefireStarter.invokeProvider(SurefireStarter.java:172)
	at org.apache.maven.surefire.booter.SurefireStarter.runSuitesInProcessWhenForked(SurefireStarter.java:104)
	at org.apache.maven.surefire.booter.ForkedBooter.main(ForkedBooter.java:70)
DEBUG: org.apache.rave.provider.opensocial.web.renderer.OpenSocialWidgetRenderer - Gadget
Script Data: <script>rave.registerWidget(widgetsByRegionIdMap, 1, {type: 'OpenSocial',
regionWidgetId: 1, widgetUrl: 'http://www.example.com/gadget.xml',  securityToken: 'securityToken',
 metadata: metadata, userPrefs: {"speed":"fast","color":"blue"}, collapsed: true});</script>
DEBUG: org.apache.rave.provider.opensocial.web.renderer.OpenSocialWidgetRenderer - Gadget
Script Data: <script>rave.registerWidget(widgetsByRegionIdMap, 1, {type: 'OpenSocial',
regionWidgetId: null, widgetUrl: 'null',  securityToken: 'null',  metadata: null, userPrefs:
{}, collapsed: false});</script>
Tests run: 4, Failures: 0, Errors: 0, Skipped: 0, Time elapsed: 0.015 sec
Running org.apache.rave.provider.opensocial.repository.ShindigGadgetMetadataRepositoryTest
DEBUG: org.apache.rave.provider.opensocial.repository.impl.ShindigGadgetMetadataRepository
- Shindig render Url: null://null/rpc
DEBUG: org.apache.rave.provider.opensocial.repository.impl.ShindigGadgetMetadataRepository
- requestContent: [{"id":"gadgets.metadata","method":"gadgets.metadata","params":{"groupId":"@self","ids":["http://www.example.com/gadget.xml"],"container":"default","userId":"@viewer","fields":["iframeUrl","modulePrefs.*","needsTokenRefresh","userPrefs.*","views.preferredHeight","views.preferredWidth","expireTimeMs","responseTimeMs"]}}]
DEBUG: org.apache.rave.provider.opensocial.repository.impl.ShindigGadgetMetadataRepository
- shindig metadata raw response: [{"id":"gadgets.metadata","result":{"http://www.example.com/gadget.xml":{"data-snipped":"here-for-brevity","userPrefs":{"age":{"dataType":"STRING","default":"0","displayName":"Age"}}
  }}}]
DEBUG: org.apache.rave.provider.opensocial.repository.impl.ShindigGadgetMetadataRepository
- shindig metadata trimmed response: {"userPrefs":{"age":{"dataType":"STRING","default":"0","displayName":"Age"}},"hasPrefsToEdit":true,"data-snipped":"here-for-brevity"}
DEBUG: org.apache.rave.provider.opensocial.repository.impl.ShindigGadgetMetadataRepository
- Shindig render Url: null://null/rpc
DEBUG: org.apache.rave.provider.opensocial.repository.impl.ShindigGadgetMetadataRepository
- requestContent: [{"id":"gadgets.metadata","method":"gadgets.metadata","params":{"groupId":"@self","ids":["http://www.example.com/gadget.xml"],"container":"default","userId":"@viewer","fields":["iframeUrl","modulePrefs.*","needsTokenRefresh","userPrefs.*","views.preferredHeight","views.preferredWidth","expireTimeMs","responseTimeMs"]}}]
DEBUG: org.apache.rave.provider.opensocial.repository.impl.ShindigGadgetMetadataRepository
- shindig metadata raw response: [{"id":"gadgets.metadata","result":{"http://www.example.com/gadget.xml":{"data-snipped":"here-for-brevity","userPrefs":{}}}}]
DEBUG: org.apache.rave.provider.opensocial.repository.impl.ShindigGadgetMetadataRepository
- shindig metadata trimmed response: {"userPrefs":{},"hasPrefsToEdit":false,"data-snipped":"here-for-brevity"}
DEBUG: org.apache.rave.provider.opensocial.repository.impl.ShindigGadgetMetadataRepository
- Shindig render Url: null://null/rpc
DEBUG: org.apache.rave.provider.opensocial.repository.impl.ShindigGadgetMetadataRepository
- requestContent: [{"id":"gadgets.metadata","method":"gadgets.metadata","params":{"groupId":"@self","ids":["http://www.example.com/gadget.xml"],"container":"default","userId":"@viewer","fields":["iframeUrl","modulePrefs.*","needsTokenRefresh","userPrefs.*","views.preferredHeight","views.preferredWidth","expireTimeMs","responseTimeMs"]}}]
DEBUG: org.apache.rave.provider.opensocial.repository.impl.ShindigGadgetMetadataRepository
- shindig metadata raw response: [{"id":"gadgets.metadata","result":{"http://www.example.com/gadget.xml":{"data-snipped":"here-for-brevity","userPrefs":{"age":{"dataType":"HIDDEN","default":"0","displayName":"Age"}}
  }}}]
DEBUG: org.apache.rave.provider.opensocial.repository.impl.ShindigGadgetMetadataRepository
- shindig metadata trimmed response: {"userPrefs":{"age":{"dataType":"HIDDEN","default":"0","displayName":"Age"}},"hasPrefsToEdit":false,"data-snipped":"here-for-brevity"}
DEBUG: org.apache.rave.provider.opensocial.repository.impl.ShindigGadgetMetadataRepository
- Shindig render Url: null://null/rpc
DEBUG: org.apache.rave.provider.opensocial.repository.impl.ShindigGadgetMetadataRepository
- requestContent: [{"id":"gadgets.metadata","method":"gadgets.metadata","params":{"groupId":"@self","ids":["http://www.example.com/gadget.xml"],"container":"default","userId":"@viewer","fields":["iframeUrl","modulePrefs.*","needsTokenRefresh","userPrefs.*","views.preferredHeight","views.preferredWidth","expireTimeMs","responseTimeMs"]}}]
DEBUG: org.apache.rave.provider.opensocial.repository.impl.ShindigGadgetMetadataRepository
- shindig metadata raw response: BAD RESPONSE STRING
Tests run: 4, Failures: 0, Errors: 0, Skipped: 0, Time elapsed: 0.021 sec
Flushing results...
Flushing results done
Cobertura: Loaded information on 11 classes.
Cobertura: Saved information on 11 classes.

Results :

Tests run: 24, Failures: 0, Errors: 0, Skipped: 0

[JENKINS] Recording test results
[JENKINS] Archiving <https://builds.apache.org/job/rave-project-trunk/ws/trunk/rave-providers/rave-opensocial-provider/pom.xml>
to /home/hudson/hudson/jobs/rave-project-trunk/modules/org.apache.rave$rave-opensocial-provider/builds/2011-11-04_15-03-07/archive/org.apache.rave/rave-opensocial-provider/0.6-incubating-SNAPSHOT/rave-opensocial-provider-0.6-incubating-SNAPSHOT.pom
[JENKINS] cobertura-maven-plugin already configured with xml reports enabled
[INFO] 
[INFO] --- cobertura-maven-plugin:2.5.1:cobertura (default-cli) @ rave-opensocial-provider
---
[INFO] Cobertura 1.9.4.1 - GNU GPL License (NO WARRANTY) - See COPYRIGHT file
Cobertura: Loaded information on 11 classes.
Report time: 148ms

[INFO] Cobertura Report generation was successful.
[JENKINS] Recording coverage results
[JENKINS] Archiving <https://builds.apache.org/job/rave-project-trunk/ws/trunk/rave-providers/rave-opensocial-provider/target/rave-opensocial-provider-0.6-incubating-SNAPSHOT.jar>
to /home/hudson/hudson/jobs/rave-project-trunk/modules/org.apache.rave$rave-opensocial-provider/builds/2011-11-04_15-03-07/archive/org.apache.rave/rave-opensocial-provider/0.6-incubating-SNAPSHOT/rave-opensocial-provider-0.6-incubating-SNAPSHOT.jar
[INFO]                                                                         
[INFO] ------------------------------------------------------------------------
[INFO] Building Apache Rave :: rave-w3c-provider 0.6-incubating-SNAPSHOT
[INFO] ------------------------------------------------------------------------
Downloading: http://repository.apache.org/snapshots/org/apache/wookie/wookie-java-connector/0.9.2-incubating-SNAPSHOT/maven-metadata.xml
Downloading: http://repository.apache.org/snapshots/org/apache/wookie/wookie-java-connector/0.9.2-incubating-SNAPSHOT/wookie-java-connector-0.9.2-incubating-SNAPSHOT.pom
[WARNING] The POM for org.apache.wookie:wookie-java-connector:jar:0.9.2-incubating-SNAPSHOT
is missing, no dependency information available
Downloading: http://repository.apache.org/snapshots/org/apache/wookie/wookie-java-connector/0.9.2-incubating-SNAPSHOT/wookie-java-connector-0.9.2-incubating-SNAPSHOT.jar
[JENKINS] Archiving <https://builds.apache.org/job/rave-project-trunk/ws/trunk/rave-providers/rave-w3c-provider/pom.xml>
to /home/hudson/hudson/jobs/rave-project-trunk/modules/org.apache.rave$rave-w3c-provider/builds/2011-11-04_15-03-07/archive/org.apache.rave/rave-w3c-provider/0.6-incubating-SNAPSHOT/rave-w3c-provider-0.6-incubating-SNAPSHOT.pom
[INFO] ------------------------------------------------------------------------
[INFO] Reactor Summary:
[INFO] 
[INFO] Apache Rave :: rave-project ....................... SUCCESS [4.132s]
[INFO] Apache Rave :: rave-components .................... SUCCESS [0.489s]
[INFO] Apache Rave :: rave-commons ....................... SUCCESS [18.977s]
[INFO] Apache Rave :: rave-core .......................... SUCCESS [23.064s]
[INFO] Apache Rave :: rave-web ........................... SUCCESS [9.381s]
[INFO] Apache Rave :: rave-providers ..................... SUCCESS [0.746s]
[INFO] Apache Rave :: rave-opensocial-provider ........... SUCCESS [6.505s]
[INFO] Apache Rave :: rave-w3c-provider .................. FAILURE [0.493s]
[INFO] Apache Rave :: rave-portal-resources .............. SKIPPED
[INFO] Apache Rave :: rave-portal-dependencies ........... SKIPPED
[INFO] Apache Rave :: rave-shindig ....................... SKIPPED
[INFO] Apache Rave :: Demo Gadgets ....................... SKIPPED
[INFO] Apache Rave :: rave-portal ........................ SKIPPED
[INFO] ------------------------------------------------------------------------
[INFO] BUILD FAILURE
[INFO] ------------------------------------------------------------------------
[INFO] Total time: 1:07.700s
[INFO] Finished at: Fri Nov 04 15:04:19 UTC 2011
[INFO] Final Memory: 67M/173M
[INFO] ------------------------------------------------------------------------
mavenExecutionResult exceptions not empty
message : Failed to execute goal on project rave-w3c-provider: Could not resolve dependencies
for project org.apache.rave:rave-w3c-provider:jar:0.6-incubating-SNAPSHOT: Could not find
artifact org.apache.wookie:wookie-java-connector:jar:0.9.2-incubating-SNAPSHOT in Nexus (http://repository.apache.org/snapshots)
cause : Could not resolve dependencies for project org.apache.rave:rave-w3c-provider:jar:0.6-incubating-SNAPSHOT:
Could not find artifact org.apache.wookie:wookie-java-connector:jar:0.9.2-incubating-SNAPSHOT
in Nexus (http://repository.apache.org/snapshots)
Stack trace : 
org.apache.maven.lifecycle.LifecycleExecutionException: Failed to execute goal on project
rave-w3c-provider: Could not resolve dependencies for project org.apache.rave:rave-w3c-provider:jar:0.6-incubating-SNAPSHOT:
Could not find artifact org.apache.wookie:wookie-java-connector:jar:0.9.2-incubating-SNAPSHOT
in Nexus (http://repository.apache.org/snapshots)
	at org.apache.maven.lifecycle.internal.LifecycleDependencyResolver.getDependencies(LifecycleDependencyResolver.java:196)
	at org.apache.maven.lifecycle.internal.LifecycleDependencyResolver.resolveProjectDependencies(LifecycleDependencyResolver.java:108)
	at org.apache.maven.lifecycle.internal.MojoExecutor.ensureDependenciesAreResolved(MojoExecutor.java:258)
	at org.apache.maven.lifecycle.internal.MojoExecutor.execute(MojoExecutor.java:201)
	at org.apache.maven.lifecycle.internal.MojoExecutor.execute(MojoExecutor.java:153)
	at org.apache.maven.lifecycle.internal.MojoExecutor.execute(MojoExecutor.java:145)
	at org.apache.maven.lifecycle.internal.LifecycleModuleBuilder.buildProject(LifecycleModuleBuilder.java:84)
	at org.apache.maven.lifecycle.internal.LifecycleModuleBuilder.buildProject(LifecycleModuleBuilder.java:59)
	at org.apache.maven.lifecycle.internal.LifecycleStarter.singleThreadedBuild(LifecycleStarter.java:183)
	at org.apache.maven.lifecycle.internal.LifecycleStarter.execute(LifecycleStarter.java:161)
	at org.apache.maven.DefaultMaven.doExecute(DefaultMaven.java:319)
	at org.apache.maven.DefaultMaven.execute(DefaultMaven.java:156)
	at org.jvnet.hudson.maven3.launcher.Maven3Launcher.main(Maven3Launcher.java:79)
	at sun.reflect.NativeMethodAccessorImpl.invoke0(Native Method)
	at sun.reflect.NativeMethodAccessorImpl.invoke(NativeMethodAccessorImpl.java:39)
	at sun.reflect.DelegatingMethodAccessorImpl.invoke(DelegatingMethodAccessorImpl.java:25)
	at java.lang.reflect.Method.invoke(Method.java:597)
	at org.codehaus.plexus.classworlds.launcher.Launcher.launchStandard(Launcher.java:329)
	at org.codehaus.plexus.classworlds.launcher.Launcher.launch(Launcher.java:239)
	at org.jvnet.hudson.maven3.agent.Maven3Main.launch(Maven3Main.java:158)
	at hudson.maven.Maven3Builder.call(Maven3Builder.java:122)
	at hudson.maven.Maven3Builder.call(Maven3Builder.java:74)
	at hudson.remoting.UserRequest.perform(UserRequest.java:118)
	at hudson.remoting.UserRequest.perform(UserRequest.java:48)
	at hudson.remoting.Request$2.run(Request.java:287)
	at java.util.concurrent.Executors$RunnableAdapter.call(Executors.java:441)
	at java.util.concurrent.FutureTask$Sync.innerRun(FutureTask.java:303)
	at java.util.concurrent.FutureTask.run(FutureTask.java:138)
	at java.util.concurrent.ThreadPoolExecutor$Worker.runTask(ThreadPoolExecutor.java:886)
	at java.util.concurrent.ThreadPoolExecutor$Worker.run(ThreadPoolExecutor.java:908)
	at java.lang.Thread.run(Thread.java:662)
Caused by: org.apache.maven.project.DependencyResolutionException: Could not resolve dependencies
for project org.apache.rave:rave-w3c-provider:jar:0.6-incubating-SNAPSHOT: Could not find
artifact org.apache.wookie:wookie-java-connector:jar:0.9.2-incubating-SNAPSHOT in Nexus (http://repository.apache.org/snapshots)
	at org.apache.maven.project.DefaultProjectDependenciesResolver.resolve(DefaultProjectDependenciesResolver.java:170)
	at org.apache.maven.lifecycle.internal.LifecycleDependencyResolver.getDependencies(LifecycleDependencyResolver.java:171)
	... 30 more
Caused by: org.sonatype.aether.resolution.DependencyResolutionException: Could not find artifact
org.apache.wookie:wookie-java-connector:jar:0.9.2-incubating-SNAPSHOT in Nexus (http://repository.apache.org/snapshots)
	at org.sonatype.aether.impl.internal.DefaultRepositorySystem.resolveDependencies(DefaultRepositorySystem.java:412)
	at org.apache.maven.project.DefaultProjectDependenciesResolver.resolve(DefaultProjectDependenciesResolver.java:164)
	... 31 more
Caused by: org.sonatype.aether.resolution.ArtifactResolutionException: Could not find artifact
org.apache.wookie:wookie-java-connector:jar:0.9.2-incubating-SNAPSHOT in Nexus (http://repository.apache.org/snapshots)
	at org.sonatype.aether.impl.internal.DefaultArtifactResolver.resolve(DefaultArtifactResolver.java:541)
	at org.sonatype.aether.impl.internal.DefaultArtifactResolver.resolveArtifacts(DefaultArtifactResolver.java:220)
	at org.sonatype.aether.impl.internal.DefaultRepositorySystem.resolveDependencies(DefaultRepositorySystem.java:395)
	... 32 more
Caused by: org.sonatype.aether.transfer.ArtifactNotFoundException: Could not find artifact
org.apache.wookie:wookie-java-connector:jar:0.9.2-incubating-SNAPSHOT in Nexus (http://repository.apache.org/snapshots)
	at org.sonatype.aether.connector.wagon.WagonRepositoryConnector$4.wrap(WagonRepositoryConnector.java:945)
	at org.sonatype.aether.connector.wagon.WagonRepositoryConnector$4.wrap(WagonRepositoryConnector.java:940)
	at org.sonatype.aether.connector.wagon.WagonRepositoryConnector$GetTask.flush(WagonRepositoryConnector.java:695)
	at org.sonatype.aether.connector.wagon.WagonRepositoryConnector$GetTask.flush(WagonRepositoryConnector.java:689)
	at org.sonatype.aether.connector.wagon.WagonRepositoryConnector.get(WagonRepositoryConnector.java:445)
	at org.sonatype.aether.impl.internal.DefaultArtifactResolver.resolve(DefaultArtifactResolver.java:460)
	... 34 more
Sending e-mails to: rave-commits@incubator.apache.org
channel stopped
[locks-and-latches] Releasing all the locks
[locks-and-latches] All the locks released
Skipping Cobertura coverage report as build was not UNSTABLE or better ...


Mime
View raw message