ranger-dev mailing list archives

Site index · List index
Message view « Date » · « Thread »
Top « Date » · « Thread »
From "Velmurugan Periasamy (JIRA)" <j...@apache.org>
Subject [jira] [Commented] (RANGER-1980) Build failure for Ranger 0.7 branch
Date Mon, 12 Feb 2018 14:16:00 GMT

    [ https://issues.apache.org/jira/browse/RANGER-1980?page=com.atlassian.jira.plugin.system.issuetabpanels:comment-tabpanel&focusedCommentId=16360788#comment-16360788
] 

Velmurugan Periasamy commented on RANGER-1980:
----------------------------------------------

Master is not compiling with 0.8.2. I am getting below error. CC [~abhayk] / [~madhan.neethiraj]
{quote}[ERROR] Failed to execute goal org.apache.maven.plugins:maven-compiler-plugin:3.3:compile
(default-compile) on project ranger-tagsync: Compilation failure: Compilation failure:

[ERROR] /Users/vperiasamy/git/tlp-ranger/master/ranger/tagsync/src/main/java/org/apache/ranger/tagsync/source/atlasrest/RangerAtlasEntityWithTags.java:[24,45]
error: package org.apache.atlas.v1.model.notification does not exist

[ERROR] /Users/vperiasamy/git/tlp-ranger/master/ranger/tagsync/src/main/java/org/apache/ranger/tagsync/source/atlasrest/RangerAtlasEntityWithTags.java:[25,41]
error: package org.apache.atlas.v1.model.instance does not exist

[ERROR] /Users/vperiasamy/git/tlp-ranger/master/ranger/tagsync/src/main/java/org/apache/ranger/tagsync/source/atlasrest/RangerAtlasEntityWithTags.java:[26,41]
error: package org.apache.atlas.v1.model.instance does not exist

[ERROR] /Users/vperiasamy/git/tlp-ranger/master/ranger/tagsync/src/main/java/org/apache/ranger/tagsync/source/atlasrest/RangerAtlasEntityWithTags.java:[38,37]
error: cannot find symbol

[ERROR]   symbol:   class EntityNotificationV1

[ERROR]   location: class RangerAtlasEntityWithTags

[ERROR] /Users/vperiasamy/git/tlp-ranger/master/ranger/tagsync/src/main/java/org/apache/ranger/tagsync/source/atlas/AtlasTagSource.java:[26,45]
error: package org.apache.atlas.v1.model.notification does not exist

[ERROR] /Users/vperiasamy/git/tlp-ranger/master/ranger/tagsync/src/main/java/org/apache/ranger/tagsync/source/atlas/AtlasTagSource.java:[141,54]
error: cannot find symbol

[ERROR]   symbol:   class EntityNotificationV1

[ERROR]   location: class AtlasTagSource

[ERROR] /Users/vperiasamy/git/tlp-ranger/master/ranger/tagsync/src/main/java/org/apache/ranger/tagsync/source/atlas/AtlasTagSource.java:[154,37]
error: cannot find symbol

[ERROR]   symbol:   class EntityNotificationV1

[ERROR]   location: class AtlasTagSource.ConsumerRunnable

[ERROR] /Users/vperiasamy/git/tlp-ranger/master/ranger/tagsync/src/main/java/org/apache/ranger/tagsync/source/atlas/AtlasTagSource.java:[156,48]
error: cannot find symbol

[ERROR]   symbol:   class EntityNotificationV1

[ERROR]   location: class AtlasTagSource.ConsumerRunnable

[ERROR] /Users/vperiasamy/git/tlp-ranger/master/ranger/tagsync/src/main/java/org/apache/ranger/tagsync/source/atlas/AtlasNotificationMapper.java:[22,45]
error: package org.apache.atlas.v1.model.notification does not exist

[ERROR] /Users/vperiasamy/git/tlp-ranger/master/ranger/tagsync/src/main/java/org/apache/ranger/tagsync/source/atlas/AtlasNotificationMapper.java:[23,41]
error: package org.apache.atlas.v1.model.instance does not exist

[ERROR] /Users/vperiasamy/git/tlp-ranger/master/ranger/tagsync/src/main/java/org/apache/ranger/tagsync/source/atlas/AtlasNotificationMapper.java:[24,41]
error: package org.apache.atlas.v1.model.instance does not exist

[ERROR] /Users/vperiasamy/git/tlp-ranger/master/ranger/tagsync/src/main/java/org/apache/ranger/tagsync/source/atlas/AtlasNotificationMapper.java:[49,52]
error: cannot find symbol

[ERROR]   symbol:   class EntityNotificationV1

[ERROR]   location: class AtlasNotificationMapper

[ERROR] /Users/vperiasamy/git/tlp-ranger/master/ranger/tagsync/src/main/java/org/apache/ranger/tagsync/source/atlas/AtlasNotificationMapper.java:[79,53]
error: cannot find symbol

[ERROR]   symbol:   class EntityNotificationV1

[ERROR]   location: class AtlasNotificationMapper

[ERROR] /Users/vperiasamy/git/tlp-ranger/master/ranger/tagsync/src/main/java/org/apache/ranger/tagsync/source/atlas/AtlasNotificationMapper.java:[114,46]
error: cannot find symbol

[ERROR]   symbol:   class EntityNotificationV1

[ERROR]   location: class AtlasNotificationMapper

[ERROR] /Users/vperiasamy/git/tlp-ranger/master/ranger/tagsync/src/main/java/org/apache/ranger/tagsync/source/atlasrest/RangerAtlasEntityWithTags.java:[39,8]
error: cannot find symbol

[ERROR]   symbol:   class Referenceable

[ERROR]   location: class RangerAtlasEntityWithTags

[ERROR] /Users/vperiasamy/git/tlp-ranger/master/ranger/tagsync/src/main/java/org/apache/ranger/tagsync/source/atlasrest/RangerAtlasEntityWithTags.java:[48,13]
error: cannot find symbol

[ERROR]   symbol:   class Struct

[ERROR]   location: class RangerAtlasEntityWithTags

[ERROR] /Users/vperiasamy/git/tlp-ranger/master/ranger/tagsync/src/main/java/org/apache/ranger/tagsync/source/atlasrest/RangerAtlasEntityWithTags.java:[49,13]
error: cannot find symbol

[ERROR]   symbol:   class Struct

[ERROR]   location: class RangerAtlasEntityWithTags

[ERROR] /Users/vperiasamy/git/tlp-ranger/master/ranger/tagsync/src/main/java/org/apache/ranger/tagsync/source/atlas/AtlasTagSource.java:[104,29]
error: cannot find symbol

[ERROR]   symbol:   class EntityNotificationV1

[ERROR]   location: class AtlasTagSource

[ERROR] /Users/vperiasamy/git/tlp-ranger/master/ranger/tagsync/src/main/java/org/apache/ranger/tagsync/source/atlas/AtlasTagSource.java:[168,28]
error: cannot find symbol

[ERROR]   symbol:   class EntityNotificationV1

[ERROR]   location: class AtlasTagSource.ConsumerRunnable

[ERROR] /Users/vperiasamy/git/tlp-ranger/master/ranger/tagsync/src/main/java/org/apache/ranger/tagsync/source/atlas/AtlasTagSource.java:[170,28]
error: cannot find symbol

[ERROR]   symbol:   class EntityNotificationV1

[ERROR]   location: class AtlasTagSource.ConsumerRunnable

[ERROR] /Users/vperiasamy/git/tlp-ranger/master/ranger/tagsync/src/main/java/org/apache/ranger/tagsync/source/atlas/AtlasTagSource.java:[171,6]
error: cannot find symbol

[ERROR]   symbol:   class EntityNotificationV1

[ERROR]   location: class AtlasTagSource.ConsumerRunnable

[ERROR] /Users/vperiasamy/git/tlp-ranger/master/ranger/tagsync/src/main/java/org/apache/ranger/tagsync/source/atlas/AtlasNotificationMapper.java:[87,69]
error: package EntityNotificationV1 does not exist

[ERROR] /Users/vperiasamy/git/tlp-ranger/master/ranger/tagsync/src/main/java/org/apache/ranger/tagsync/source/atlas/AtlasNotificationMapper.java:[117,22]
error: package EntityNotificationV1 does not exist

[ERROR] /Users/vperiasamy/git/tlp-ranger/master/ranger/tagsync/src/main/java/org/apache/ranger/tagsync/source/atlas/AtlasNotificationMapper.java:[121,9]
error: cannot find symbol

[ERROR]   symbol:   variable ENTITY_CREATE

[ERROR]   location: class AtlasNotificationMapper

[ERROR] /Users/vperiasamy/git/tlp-ranger/master/ranger/tagsync/src/main/java/org/apache/ranger/tagsync/source/atlas/AtlasNotificationMapper.java:[124,9]
error: cannot find symbol

[ERROR]   symbol:   variable ENTITY_UPDATE

[ERROR]   location: class AtlasNotificationMapper

[ERROR] /Users/vperiasamy/git/tlp-ranger/master/ranger/tagsync/src/main/java/org/apache/ranger/tagsync/source/atlas/AtlasNotificationMapper.java:[125,9]
error: cannot find symbol

[ERROR]   symbol:   variable ENTITY_DELETE

[ERROR]   location: class AtlasNotificationMapper

[ERROR] /Users/vperiasamy/git/tlp-ranger/master/ranger/tagsync/src/main/java/org/apache/ranger/tagsync/source/atlas/AtlasNotificationMapper.java:[126,9]
error: cannot find symbol

[ERROR]   symbol:   variable TRAIT_ADD

[ERROR]   location: class AtlasNotificationMapper

[ERROR] /Users/vperiasamy/git/tlp-ranger/master/ranger/tagsync/src/main/java/org/apache/ranger/tagsync/source/atlas/AtlasNotificationMapper.java:[127,9]
error: cannot find symbol

[ERROR]   symbol:   variable TRAIT_UPDATE

[ERROR]   location: class AtlasNotificationMapper

[ERROR] /Users/vperiasamy/git/tlp-ranger/master/ranger/tagsync/src/main/java/org/apache/ranger/tagsync/source/atlas/AtlasNotificationMapper.java:[128,9]
error: cannot find symbol

[ERROR]   symbol:   variable TRAIT_DELETE

[ERROR]   location: class AtlasNotificationMapper

[ERROR] /Users/vperiasamy/git/tlp-ranger/master/ranger/tagsync/src/main/java/org/apache/ranger/tagsync/source/atlas/AtlasNotificationMapper.java:[137,10]
error: cannot find symbol

[ERROR]   symbol:   class Referenceable

[ERROR]   location: class AtlasNotificationMapper

[ERROR] /Users/vperiasamy/git/tlp-ranger/master/ranger/tagsync/src/main/java/org/apache/ranger/tagsync/source/atlas/AtlasNotificationMapper.java:[140,40]
error: package Id does not exist

[ERROR] -> [Help 1]

 
{quote}
 

> Build failure for Ranger 0.7 branch
> -----------------------------------
>
>                 Key: RANGER-1980
>                 URL: https://issues.apache.org/jira/browse/RANGER-1980
>             Project: Ranger
>          Issue Type: Bug
>          Components: build-infra
>    Affects Versions: 0.7.2
>            Reporter: Don Bosco Durai
>            Assignee: Pradeep Agrawal
>            Priority: Major
>             Fix For: 0.7.2
>
>         Attachments: 0001-RANGER-1980-Build-failure-for-Ranger-0.7-branch.patch
>
>   Original Estimate: 48h
>  Remaining Estimate: 48h
>
> Ranger 0.7 compilation is failing with the following error.
>  
>  
> [ERROR] Failed to execute goal on project ranger-tagsync: Could not resolve dependencies
for project org.apache.ranger:ranger-tagsync:jar:0.7.0.3.1.0: The following artifacts could
not be resolved: org.apache.atlas:atlas-notification:jar:0.8.2-SNAPSHOT, org.apache.atlas:atlas-typesystem:jar:0.8.2-SNAPSHOT,
org.apache.atlas:atlas-client-v1:jar:0.8.2-SNAPSHOT, org.apache.atlas:atlas-client-common:jar:0.8.2-SNAPSHOT,
org.apache.atlas:atlas-client-v2:jar:0.8.2-SNAPSHOT, org.apache.atlas:atlas-common:jar:0.8.2-SNAPSHOT,
org.apache.atlas:atlas-intg:jar:0.8.2-SNAPSHOT: Could not find artifact org.apache.atlas:atlas-notification:jar:0.8.2-SNAPSHOT
in apache.snapshots.https ([https://repository.apache.org/content/repositories/snapshots])
-> [Help 1]
>  
>  
>  
>  
> Seems, Atlas snapshot jars are not found



--
This message was sent by Atlassian JIRA
(v7.6.3#76005)

Mime
View raw message