ranger-dev mailing list archives

Site index · List index
Message view « Date » · « Thread »
Top « Date » · « Thread »
From "Nigel Jones (JIRA)" <j...@apache.org>
Subject [jira] [Resolved] (RANGER-1908) Build (unit tests) failed in HBase Security Plugin
Date Mon, 27 Nov 2017 14:02:00 GMT

     [ https://issues.apache.org/jira/browse/RANGER-1908?page=com.atlassian.jira.plugin.system.issuetabpanels:all-tabpanel
]

Nigel Jones resolved RANGER-1908.
---------------------------------
    Resolution: Cannot Reproduce

> Build (unit tests) failed in HBase Security Plugin
> --------------------------------------------------
>
>                 Key: RANGER-1908
>                 URL: https://issues.apache.org/jira/browse/RANGER-1908
>             Project: Ranger
>          Issue Type: Bug
>          Components: Ranger
>            Reporter: Nigel Jones
>            Assignee: Nigel Jones
>         Attachments: ranger-20171124a.log
>
>
> MacOS
> Java 1.8 (152, oracle)
> Maven 3.5.0
> Build fails at
> [INFO] HBase Security Plugin .............................. FAILURE [11:36 min]
> The failing test is:
> [INFO] Running org.apache.ranger.authorization.hbase.HBaseRangerAuthorizationTest
> Formatting using clusterid: testClusterID
> [ERROR] Tests run: 20, Failures: 0, Errors: 1, Skipped: 0, Time elapsed: 689.962 s <<<
FAILURE! - in org.apache.ranger.authorization.hbase.HBaseRangerAuthorizationTest
> [ERROR] testTagBasedTablePolicy(org.apache.ranger.authorization.hbase.HBaseRangerAuthorizationTest)
 Time elapsed: 611.879 s  <<< ERROR!
> org.apache.hadoop.hbase.exceptions.TimeoutIOException: java.util.concurrent.TimeoutException:
The procedure 18 is still running
> 	at org.apache.ranger.authorization.hbase.HBaseRangerAuthorizationTest.testTagBasedTablePolicy(HBaseRangerAuthorizationTest.java:780)
> Caused by: java.util.concurrent.TimeoutException: The procedure 18 is still running
> 	at org.apache.ranger.authorization.hbase.HBaseRangerAuthorizationTest.testTagBasedTablePolicy(HBaseRangerAuthorizationTest.java:780)
> The next part of the test is ok:
> [INFO] Running org.apache.ranger.authorization.hbase.RangerAuthorizationFilterTest
> [INFO] Tests run: 1, Failures: 0, Errors: 0, Skipped: 0, Time elapsed: 0.505 s - in org.apache.ranger.authorization.hbase.RangerAuthorizationFilterTest



--
This message was sent by Atlassian JIRA
(v6.4.14#64029)

Mime
View raw message