qpid-notifications mailing list archives

Site index · List index
Message view « Date » · « Thread »
Top « Date » · « Thread »
From Apache Jenkins Server <jenk...@builds.apache.org>
Subject Build failed in Jenkins: Qpid » Qpid-Broker-J-TestMatrix » JDK 1.8 (latest),java-bdb.0-10 #20
Date Wed, 07 Oct 2020 19:39:33 GMT
See <https://ci-builds.apache.org/job/Qpid/job/Qpid-Broker-J-TestMatrix/jdk=JDK%201.8%20(latest),profile=java-bdb.0-10/20/display/redirect?page=changes>

Changes:

[oleksandr.rudyy] NO-JIRA: Report test logs into standard system output when running tests
on travis


------------------------------------------
[...truncated 532.21 KB...]
[INFO] --- maven-remote-resources-plugin:1.5:process (process-resource-bundles) @ qpid-java-doc-broker
---
[INFO] 
[INFO] --- maven-resources-plugin:3.1.0:resources (default-resources) @ qpid-java-doc-broker
---
[INFO] Using 'UTF-8' encoding to copy filtered resources.
[INFO] Copying 78 resources
[INFO] 
[INFO] --- maven-compiler-plugin:3.7.0:compile (default-compile) @ qpid-java-doc-broker ---
[INFO] No sources to compile
[INFO] 
[INFO] --- maven-resources-plugin:3.1.0:testResources (default-testResources) @ qpid-java-doc-broker
---
[INFO] Using 'UTF-8' encoding to copy filtered resources.
[INFO] Copying 78 resources
[INFO] 
[INFO] --- maven-compiler-plugin:3.7.0:testCompile (default-testCompile) @ qpid-java-doc-broker
---
[INFO] No sources to compile
[INFO] 
[INFO] --- maven-surefire-plugin:2.22.0:test (default-test) @ qpid-java-doc-broker ---
[INFO] Tests are skipped.
[INFO] 
[INFO] --- maven-jar-plugin:3.1.0:jar (default-jar) @ qpid-java-doc-broker ---
[WARNING] JAR will be empty - no content was marked for inclusion!
[INFO] Building jar: <https://ci-builds.apache.org/job/Qpid/job/Qpid-Broker-J-TestMatrix/jdk=JDK%201.8%20(latest),profile=java-bdb.0-10/ws/doc/java-broker/target/qpid-java-doc-broker-9.0.0-SNAPSHOT.jar>
[INFO] 
[INFO] --- maven-site-plugin:3.7.1:attach-descriptor (attach-descriptor) @ qpid-java-doc-broker
---
[INFO] Skipping because packaging 'jar' is not pom.
[INFO] 
[INFO] --- maven-assembly-plugin:3.0.0:single (default) @ qpid-java-doc-broker ---
[INFO] Assemblies have been skipped per configuration of the skipAssembly parameter.
[INFO] 
[INFO] --------------< org.apache.qpid:qpid-java-doc-perftests >---------------
[INFO] Building Apache Qpid Broker-J Performance Test Docbook 9.0.0-SNAPSHOT [47/49]
[INFO] --------------------------------[ jar ]---------------------------------
[INFO] 
[INFO] --- maven-clean-plugin:3.1.0:clean (default-clean) @ qpid-java-doc-perftests ---
[INFO] 
[INFO] --- buildnumber-maven-plugin:1.4:create (default) @ qpid-java-doc-perftests ---
[INFO] Executing: /bin/sh -c cd '<https://ci-builds.apache.org/job/Qpid/job/Qpid-Broker-J-TestMatrix/jdk=JDK%201.8%20(latest),profile=java-bdb.0-10/ws/doc/java-perftests'>
&& 'git' 'rev-parse' '--verify' 'HEAD'
[INFO] Working directory: <https://ci-builds.apache.org/job/Qpid/job/Qpid-Broker-J-TestMatrix/jdk=JDK%201.8%20(latest),profile=java-bdb.0-10/ws/doc/java-perftests>
[INFO] Storing buildNumber: d3cacdc24c6f43e88532ab6feb95b1c0f6686d01 at timestamp: 1602099432800
[WARNING] Cannot get the branch information from the git repository: 
Detecting the current branch failed: fatal: ref HEAD is not a symbolic ref

[INFO] Executing: /bin/sh -c cd '<https://ci-builds.apache.org/job/Qpid/job/Qpid-Broker-J-TestMatrix/jdk=JDK%201.8%20(latest),profile=java-bdb.0-10/ws/doc/java-perftests'>
&& 'git' 'rev-parse' '--verify' 'HEAD'
[INFO] Working directory: <https://ci-builds.apache.org/job/Qpid/job/Qpid-Broker-J-TestMatrix/jdk=JDK%201.8%20(latest),profile=java-bdb.0-10/ws/doc/java-perftests>
[INFO] Storing buildScmBranch: UNKNOWN
[INFO] 
[INFO] --- maven-antrun-plugin:1.8:run (output-test-properties) @ qpid-java-doc-perftests
---
[INFO] Executing tasks

main:
     [echo] Qpid Test Profile Properties
     [echo] [profile] java-bdb.0-10
     [echo] [profile.broker.version] 0-10
     [echo] [profile.virtualhostnode.type] BDB
     [echo] [profile.virtualhostnode.context.blueprint] {"type":"ProvidedStore","globalAddressDomains":"${qpid.globalAddressDomains}"}
     [echo] [profile.test_receive_timeout] 3000
[INFO] Executed tasks
[INFO] 
[INFO] --- maven-enforcer-plugin:3.0.0-M2:enforce (enforce-maven-version) @ qpid-java-doc-perftests
---
[INFO] 
[INFO] --- maven-enforcer-plugin:3.0.0-M2:enforce (enforce-minimum-versions) @ qpid-java-doc-perftests
---
[INFO] 
[INFO] --- maven-enforcer-plugin:3.0.0-M2:enforce (enforce-versions-standard-properties) @
qpid-java-doc-perftests ---
[INFO] 
[INFO] --- maven-enforcer-plugin:3.0.0-M2:enforce (enforce-enableAmqp0x) @ qpid-java-doc-perftests
---
[INFO] 
[INFO] --- jacoco-maven-plugin:0.8.5:prepare-agent (default-prepare-agent) @ qpid-java-doc-perftests
---
[INFO] argLine set to "-javaagent:/home/jenkins/.m2/repository/org/jacoco/org.jacoco.agent/0.8.5/org.jacoco.agent-0.8.5-runtime.jar=destfile=<https://ci-builds.apache.org/job/Qpid/job/Qpid-Broker-J-TestMatrix/jdk=JDK%201.8%20(latest),profile=java-bdb.0-10/ws/doc/java-perftests/target/jacoco.exec">
-Xmx512m
[INFO] 
[INFO] --- maven-resources-plugin:3.1.0:copy-resources (filter-docbook-sources) @ qpid-java-doc-perftests
---
[INFO] Using 'UTF-8' encoding to copy filtered resources.
[INFO] Copying 1 resource
[INFO] 
[INFO] --- maven-remote-resources-plugin:1.5:process (process-resource-bundles) @ qpid-java-doc-perftests
---
[INFO] 
[INFO] --- maven-resources-plugin:3.1.0:resources (default-resources) @ qpid-java-doc-perftests
---
[INFO] Using 'UTF-8' encoding to copy filtered resources.
[INFO] Copying 1 resource
[INFO] 
[INFO] --- maven-compiler-plugin:3.7.0:compile (default-compile) @ qpid-java-doc-perftests
---
[INFO] No sources to compile
[INFO] 
[INFO] --- maven-resources-plugin:3.1.0:testResources (default-testResources) @ qpid-java-doc-perftests
---
[INFO] Using 'UTF-8' encoding to copy filtered resources.
[INFO] Copying 1 resource
[INFO] 
[INFO] --- maven-compiler-plugin:3.7.0:testCompile (default-testCompile) @ qpid-java-doc-perftests
---
[INFO] No sources to compile
[INFO] 
[INFO] --- maven-surefire-plugin:2.22.0:test (default-test) @ qpid-java-doc-perftests ---
[INFO] Tests are skipped.
[INFO] 
[INFO] --- maven-jar-plugin:3.1.0:jar (default-jar) @ qpid-java-doc-perftests ---
[WARNING] JAR will be empty - no content was marked for inclusion!
[INFO] Building jar: <https://ci-builds.apache.org/job/Qpid/job/Qpid-Broker-J-TestMatrix/jdk=JDK%201.8%20(latest),profile=java-bdb.0-10/ws/doc/java-perftests/target/qpid-java-doc-perftests-9.0.0-SNAPSHOT.jar>
[INFO] 
[INFO] --- maven-site-plugin:3.7.1:attach-descriptor (attach-descriptor) @ qpid-java-doc-perftests
---
[INFO] Skipping because packaging 'jar' is not pom.
[INFO] 
[INFO] --- maven-assembly-plugin:3.0.0:single (default) @ qpid-java-doc-perftests ---
[INFO] Assemblies have been skipped per configuration of the skipAssembly parameter.
[INFO] 
[INFO] -----------< org.apache.qpid:qpid-broker-j-developer-guide >------------
[INFO] Building Apache Qpid Broker-J Developer Guide 9.0.0-SNAPSHOT     [48/49]
[INFO] --------------------------------[ jar ]---------------------------------
[INFO] 
[INFO] --- maven-clean-plugin:3.1.0:clean (default-clean) @ qpid-broker-j-developer-guide
---
[INFO] 
[INFO] --- buildnumber-maven-plugin:1.4:create (default) @ qpid-broker-j-developer-guide ---
[INFO] Executing: /bin/sh -c cd '<https://ci-builds.apache.org/job/Qpid/job/Qpid-Broker-J-TestMatrix/jdk=JDK%201.8%20(latest),profile=java-bdb.0-10/ws/doc/developer-guide'>
&& 'git' 'rev-parse' '--verify' 'HEAD'
[INFO] Working directory: <https://ci-builds.apache.org/job/Qpid/job/Qpid-Broker-J-TestMatrix/jdk=JDK%201.8%20(latest),profile=java-bdb.0-10/ws/doc/developer-guide>
[INFO] Storing buildNumber: d3cacdc24c6f43e88532ab6feb95b1c0f6686d01 at timestamp: 1602099432910
[WARNING] Cannot get the branch information from the git repository: 
Detecting the current branch failed: fatal: ref HEAD is not a symbolic ref

[INFO] Executing: /bin/sh -c cd '<https://ci-builds.apache.org/job/Qpid/job/Qpid-Broker-J-TestMatrix/jdk=JDK%201.8%20(latest),profile=java-bdb.0-10/ws/doc/developer-guide'>
&& 'git' 'rev-parse' '--verify' 'HEAD'
[INFO] Working directory: <https://ci-builds.apache.org/job/Qpid/job/Qpid-Broker-J-TestMatrix/jdk=JDK%201.8%20(latest),profile=java-bdb.0-10/ws/doc/developer-guide>
[INFO] Storing buildScmBranch: UNKNOWN
[INFO] 
[INFO] --- maven-antrun-plugin:1.8:run (output-test-properties) @ qpid-broker-j-developer-guide
---
[INFO] Executing tasks

main:
     [echo] Qpid Test Profile Properties
     [echo] [profile] java-bdb.0-10
     [echo] [profile.broker.version] 0-10
     [echo] [profile.virtualhostnode.type] BDB
     [echo] [profile.virtualhostnode.context.blueprint] {"type":"ProvidedStore","globalAddressDomains":"${qpid.globalAddressDomains}"}
     [echo] [profile.test_receive_timeout] 3000
[INFO] Executed tasks
[INFO] 
[INFO] --- maven-enforcer-plugin:3.0.0-M2:enforce (enforce-maven-version) @ qpid-broker-j-developer-guide
---
[INFO] 
[INFO] --- maven-enforcer-plugin:3.0.0-M2:enforce (enforce-minimum-versions) @ qpid-broker-j-developer-guide
---
[INFO] 
[INFO] --- maven-enforcer-plugin:3.0.0-M2:enforce (enforce-versions-standard-properties) @
qpid-broker-j-developer-guide ---
[INFO] 
[INFO] --- maven-enforcer-plugin:3.0.0-M2:enforce (enforce-enableAmqp0x) @ qpid-broker-j-developer-guide
---
[INFO] 
[INFO] --- jacoco-maven-plugin:0.8.5:prepare-agent (default-prepare-agent) @ qpid-broker-j-developer-guide
---
[INFO] argLine set to "-javaagent:/home/jenkins/.m2/repository/org/jacoco/org.jacoco.agent/0.8.5/org.jacoco.agent-0.8.5-runtime.jar=destfile=<https://ci-builds.apache.org/job/Qpid/job/Qpid-Broker-J-TestMatrix/jdk=JDK%201.8%20(latest),profile=java-bdb.0-10/ws/doc/developer-guide/target/jacoco.exec">
-Xmx512m
[INFO] 
[INFO] --- maven-resources-plugin:3.1.0:copy-resources (filter-docbook-sources) @ qpid-broker-j-developer-guide
---
[INFO] Using 'UTF-8' encoding to copy filtered resources.
[INFO] skip non existing resourceDirectory <https://ci-builds.apache.org/job/Qpid/job/Qpid-Broker-J-TestMatrix/jdk=JDK%201.8%20(latest),profile=java-bdb.0-10/ws/doc/developer-guide/src/docbkx>
[INFO] 
[INFO] --- maven-remote-resources-plugin:1.5:process (process-resource-bundles) @ qpid-broker-j-developer-guide
---
[INFO] 
[INFO] --- maven-resources-plugin:3.1.0:resources (default-resources) @ qpid-broker-j-developer-guide
---
[INFO] Using 'UTF-8' encoding to copy filtered resources.
[INFO] skip non existing resourceDirectory <https://ci-builds.apache.org/job/Qpid/job/Qpid-Broker-J-TestMatrix/jdk=JDK%201.8%20(latest),profile=java-bdb.0-10/ws/doc/developer-guide/src/docbkx>
[INFO] 
[INFO] --- maven-compiler-plugin:3.7.0:compile (default-compile) @ qpid-broker-j-developer-guide
---
[INFO] No sources to compile
[INFO] 
[INFO] --- maven-resources-plugin:3.1.0:testResources (default-testResources) @ qpid-broker-j-developer-guide
---
[INFO] Using 'UTF-8' encoding to copy filtered resources.
[INFO] skip non existing resourceDirectory <https://ci-builds.apache.org/job/Qpid/job/Qpid-Broker-J-TestMatrix/jdk=JDK%201.8%20(latest),profile=java-bdb.0-10/ws/doc/developer-guide/src/docbkx>
[INFO] 
[INFO] --- maven-compiler-plugin:3.7.0:testCompile (default-testCompile) @ qpid-broker-j-developer-guide
---
[INFO] No sources to compile
[INFO] 
[INFO] --- maven-surefire-plugin:2.22.0:test (default-test) @ qpid-broker-j-developer-guide
---
[INFO] Tests are skipped.
[INFO] 
[INFO] --- maven-jar-plugin:3.1.0:jar (default-jar) @ qpid-broker-j-developer-guide ---
[WARNING] JAR will be empty - no content was marked for inclusion!
[INFO] Building jar: <https://ci-builds.apache.org/job/Qpid/job/Qpid-Broker-J-TestMatrix/jdk=JDK%201.8%20(latest),profile=java-bdb.0-10/ws/doc/developer-guide/target/qpid-broker-j-developer-guide-9.0.0-SNAPSHOT.jar>
[INFO] 
[INFO] --- maven-site-plugin:3.7.1:attach-descriptor (attach-descriptor) @ qpid-broker-j-developer-guide
---
[INFO] Skipping because packaging 'jar' is not pom.
[INFO] 
[INFO] --- maven-assembly-plugin:3.0.0:single (default) @ qpid-broker-j-developer-guide ---
[INFO] Assemblies have been skipped per configuration of the skipAssembly parameter.
[INFO] ------------------------------------------------------------------------
[INFO] Reactor Summary for Apache Qpid Broker-J Parent 9.0.0-SNAPSHOT:
[INFO] 
[INFO] Apache Qpid Broker-J Parent ........................ SUCCESS [  4.049 s]
[INFO] Apache Qpid Broker-J Code Generation ............... SUCCESS [  2.970 s]
[INFO] Apache Qpid Broker-J Test Utilities ................ SUCCESS [  0.989 s]
[INFO] Apache Qpid Broker-J Core .......................... SUCCESS [ 21.716 s]
[INFO] Apache Qpid Broker-J LogBack Logging Plug-in ....... SUCCESS [  1.570 s]
[INFO] Apache Qpid Broker-J Access Control Plug-in ........ SUCCESS [  1.258 s]
[INFO] Apache Qpid Broker-J AMQP 0-10 Protocol Plug-in .... SUCCESS [  1.783 s]
[INFO] Apache Qpid Broker-J AMQP 0-8 Protocol Plug-in ..... SUCCESS [  1.747 s]
[INFO] Apache Qpid Broker-J AMQP 1-0 Protocol Plug-in ..... SUCCESS [  3.096 s]
[INFO] Apache Qpid Broker-J AMQP 0-8 to 0-10 Message Conversion Plug-in SUCCESS [  0.378 s]
[INFO] Apache Qpid Broker-J AMQP 0-8 to 1-0 Message Conversion Plug-in SUCCESS [  0.519 s]
[INFO] Apache Qpid Broker-J AMQP 0-10 to 1-0 Message Conversion Plug-in SUCCESS [  0.544 s]
[INFO] Apache Qpid Broker-J JDBC Message Store Plug-in .... SUCCESS [  1.121 s]
[INFO] Apache Qpid Broker-J Derby Message Store Plug-in ... SUCCESS [  0.830 s]
[INFO] Apache Qpid Broker-J JDBC Message Store Connection Pooling Plug-in SUCCESS [  0.328
s]
[INFO] Apache Qpid Broker-J LogBack JDBC Logging Plug-in .. SUCCESS [  0.560 s]
[INFO] Apache Qpid AMQP 1.0 JDBC Link Store Plug-in ....... SUCCESS [  0.396 s]
[INFO] qpid-broker-plugins-prometheus-exporter ............ SUCCESS [  0.483 s]
[INFO] Apache Qpid Broker-J HTTP Management Plug-in ....... SUCCESS [  3.799 s]
[INFO] Apache Qpid Broker-J AMQP Management Protocol Plug-in SUCCESS [  0.371 s]
[INFO] Apache Qpid Broker-J Memory Message Store Plug-in .. SUCCESS [  0.408 s]
[INFO] Apache Qpid Broker-J WebSocket Plug-in ............. SUCCESS [  0.344 s]
[INFO] Apache Qpid Broker-J BDB Message Store Plug-in ..... SUCCESS [  2.054 s]
[INFO] Apache Qpid AMQP 1.0 BDB Link Store Plug-in ........ SUCCESS [  0.434 s]
[INFO] Apache Qpid Broker-J ............................... SUCCESS [  0.659 s]
[INFO] Apache Qpid Broker-J Bundles ....................... SUCCESS [  8.340 s]
[INFO] Apache Qpid Broker-J Tools ......................... SUCCESS [  0.343 s]
[INFO] Apache Qpid Broker-J System Test Parent ............ SUCCESS [  0.107 s]
[INFO] Apache Qpid Broker-J System Test Utils ............. SUCCESS [  3.665 s]
[INFO] Apache Qpid Broker-J JMS System Tests Core ......... SUCCESS [  0.615 s]
[INFO] Apache Qpid Broker-J JMS 1.1 System Tests .......... SUCCESS [17:36 min]
[INFO] Apache Qpid Broker-J JMS 2.0 System Tests .......... SUCCESS [  0.889 s]
[INFO] Apache Qpid Broker-J HTTP system tests ............. FAILURE [04:08 min]
[INFO] Apache Qpid Broker-J Protocol Tests Core ........... SUCCESS [  0.291 s]
[INFO] Apache Qpid Protocol Tests for AMQP 0-8,0-9,0-9-1 .. SUCCESS [  1.423 s]
[INFO] Apache Qpid Protocol Tests for AMQP 0-10 ........... SUCCESS [  1.234 s]
[INFO] Apache Qpid Protocol Tests for AMQP 1.0 ............ SUCCESS [  2.659 s]
[INFO] Apache Qpid Broker-J System Tests Spawn Broker Admin SUCCESS [ 55.084 s]
[INFO] Apache Qpid Broker-J End to End Conversion Tests ... SUCCESS [07:42 min]
[INFO] Apache Qpid Broker-J Performance Tests ............. SUCCESS [  1.905 s]
[INFO] Apache Qpid Broker-J Performance Test System Tests . SKIPPED
[INFO] Apache Qpid Broker-J Performance Tests Visualisation JFC SUCCESS [  1.541 s]
[INFO] Apache Qpid Broker-J BDB Store System Tests ........ SUCCESS [04:39 min]
[INFO] Apache Qpid Joram JMS Tests ........................ SUCCESS [  0.237 s]
[INFO] Apache Qpid Broker-J JMS TCK Configuration ......... SUCCESS [  0.266 s]
[INFO] Apache Qpid Broker-J Docbook ....................... SUCCESS [  0.077 s]
[INFO] Apache Qpid Broker-J Docbook ....................... SUCCESS [  0.962 s]
[INFO] Apache Qpid Broker-J Performance Test Docbook ...... SUCCESS [  0.108 s]
[INFO] Apache Qpid Broker-J Developer Guide ............... SUCCESS [  0.121 s]
[INFO] ------------------------------------------------------------------------
[INFO] BUILD FAILURE
[INFO] ------------------------------------------------------------------------
[INFO] Total time:  36:20 min
[INFO] Finished at: 2020-10-07T19:37:13Z
[INFO] ------------------------------------------------------------------------
[ERROR] Failed to execute goal org.apache.maven.plugins:maven-surefire-plugin:2.22.0:test
(integration-test) on project qpid-systests-http: There are test failures.
[ERROR] 
[ERROR] Please refer to <https://ci-builds.apache.org/job/Qpid/job/Qpid-Broker-J-TestMatrix/jdk=JDK%201.8%20(latest),profile=java-bdb.0-10/20/artifact/systests/qpid-systests-http-management/target/surefire-reports/java-bdb.0-10>
for the individual test results.
[ERROR] Please refer to dump files (if any exist) [date]-jvmRun[N].dump, [date].dumpstream
and [date]-jvmRun[N].dumpstream.
[ERROR] -> [Help 1]
[ERROR] 
[ERROR] To see the full stack trace of the errors, re-run Maven with the -e switch.
[ERROR] Re-run Maven using the -X switch to enable full debug logging.
[ERROR] 
[ERROR] For more information about the errors and possible solutions, please read the following
articles:
[ERROR] [Help 1] http://cwiki.apache.org/confluence/display/MAVEN/MojoFailureException
[ERROR] 
[ERROR] After correcting the problems, you can resume the build with the command
[ERROR]   mvn <args> -rf :qpid-systests-http
Build step 'Invoke top-level Maven targets' marked build as failure
Archiving artifacts
Recording test results

Mime
View raw message