qpid-notifications mailing list archives

Site index · List index
Message view « Date » · « Thread »
Top « Date » · « Thread »
From Apache Jenkins Server <jenk...@builds.apache.org>
Subject Build failed in Jenkins: Qpid » Qpid-Broker-J-Test-JDK14 #20
Date Thu, 08 Oct 2020 08:15:07 GMT
See <https://ci-builds.apache.org/job/Qpid/job/Qpid-Broker-J-Test-JDK14/20/display/redirect?page=changes>

Changes:

[Alex Rudyy] QPID-8472:[Broker-J]Improve operational logging for operations on queue

[Alex Rudyy] QPID-8469: [Broker-J][Message Store] The message is already cleaned when the
delete listener is called


------------------------------------------
[...truncated 298.36 KB...]
[INFO] --- maven-remote-resources-plugin:1.5:process (process-resource-bundles) @ qpid-java-doc-broker
---
[INFO] 
[INFO] --- maven-resources-plugin:3.1.0:resources (default-resources) @ qpid-java-doc-broker
---
[INFO] Using 'UTF-8' encoding to copy filtered resources.
[INFO] Copying 78 resources
[INFO] 
[INFO] --- maven-compiler-plugin:3.7.0:compile (default-compile) @ qpid-java-doc-broker ---
[INFO] No sources to compile
[INFO] 
[INFO] --- maven-resources-plugin:3.1.0:testResources (default-testResources) @ qpid-java-doc-broker
---
[INFO] Using 'UTF-8' encoding to copy filtered resources.
[INFO] Copying 78 resources
[INFO] 
[INFO] --- maven-compiler-plugin:3.7.0:testCompile (default-testCompile) @ qpid-java-doc-broker
---
[INFO] No sources to compile
[INFO] 
[INFO] --- maven-surefire-plugin:2.22.0:test (default-test) @ qpid-java-doc-broker ---
[INFO] No tests to run.
[INFO] 
[INFO] --- maven-jar-plugin:3.1.0:jar (default-jar) @ qpid-java-doc-broker ---
[WARNING] JAR will be empty - no content was marked for inclusion!
[INFO] Building jar: F:\jenkins\jenkins-slave\712657a4\workspace\Qpid\Qpid-Broker-J-Test-JDK14\doc\java-broker\target\qpid-java-doc-broker-9.0.0-SNAPSHOT.jar
[INFO] 
[INFO] --- maven-site-plugin:3.7.1:attach-descriptor (attach-descriptor) @ qpid-java-doc-broker
---
[INFO] Skipping because packaging 'jar' is not pom.
[INFO] 
[INFO] --- maven-assembly-plugin:3.0.0:single (default) @ qpid-java-doc-broker ---
[INFO] Assemblies have been skipped per configuration of the skipAssembly parameter.
[INFO] 
[INFO] --------------< org.apache.qpid:qpid-java-doc-perftests >---------------
[INFO] Building Apache Qpid Broker-J Performance Test Docbook 9.0.0-SNAPSHOT [13/49]
[INFO] --------------------------------[ jar ]---------------------------------
[INFO] 
[INFO] --- maven-clean-plugin:3.1.0:clean (default-clean) @ qpid-java-doc-perftests ---
[INFO] 
[INFO] --- buildnumber-maven-plugin:1.4:create (default) @ qpid-java-doc-perftests ---
[INFO] Executing: cmd.exe /X /C "git rev-parse --verify HEAD"
[INFO] Working directory: F:\jenkins\jenkins-slave\712657a4\workspace\Qpid\Qpid-Broker-J-Test-JDK14\doc\java-perftests
[INFO] Storing buildNumber: 4f861571ee0107b9f30945e5728492385c3510e3 at timestamp: 1602144854050
[WARNING] Cannot get the branch information from the git repository: 
Detecting the current branch failed: fatal: ref HEAD is not a symbolic ref

[INFO] Executing: cmd.exe /X /C "git rev-parse --verify HEAD"
[INFO] Working directory: F:\jenkins\jenkins-slave\712657a4\workspace\Qpid\Qpid-Broker-J-Test-JDK14\doc\java-perftests
[INFO] Storing buildScmBranch: UNKNOWN
[INFO] 
[INFO] --- maven-antrun-plugin:1.8:run (output-test-properties) @ qpid-java-doc-perftests
---
[INFO] Executing tasks

main:
     [echo] Qpid Test Profile Properties
     [echo] [profile] java-mms.1-0
     [echo] [profile.broker.version] 1.0
     [echo] [profile.virtualhostnode.type] Memory
     [echo] [profile.virtualhostnode.context.blueprint] {"type":"ProvidedStore","globalAddressDomains":"${qpid.globalAddressDomains}"}
     [echo] [profile.test_receive_timeout] 1000
[INFO] Executed tasks
[INFO] 
[INFO] --- maven-enforcer-plugin:3.0.0-M2:enforce (enforce-maven-version) @ qpid-java-doc-perftests
---
[INFO] 
[INFO] --- maven-enforcer-plugin:3.0.0-M2:enforce (enforce-minimum-versions) @ qpid-java-doc-perftests
---
[INFO] 
[INFO] --- maven-enforcer-plugin:3.0.0-M2:enforce (enforce-versions-standard-properties) @
qpid-java-doc-perftests ---
[INFO] 
[INFO] --- maven-enforcer-plugin:3.0.0-M2:enforce (enforce-enableAmqp0x) @ qpid-java-doc-perftests
---
[INFO] 
[INFO] --- jacoco-maven-plugin:0.8.5:prepare-agent (default-prepare-agent) @ qpid-java-doc-perftests
---
[INFO] argLine set to -javaagent:F:\\hudson\\m2_repository\\org\\jacoco\\org.jacoco.agent\\0.8.5\\org.jacoco.agent-0.8.5-runtime.jar=destfile=F:\\jenkins\\jenkins-slave\\712657a4\\workspace\\Qpid\\Qpid-Broker-J-Test-JDK14\\doc\\java-perftests\\target\\jacoco.exec
-Xmx512m
[INFO] 
[INFO] --- maven-resources-plugin:3.1.0:copy-resources (filter-docbook-sources) @ qpid-java-doc-perftests
---
[INFO] Using 'UTF-8' encoding to copy filtered resources.
[INFO] Copying 1 resource
[INFO] 
[INFO] --- maven-remote-resources-plugin:1.5:process (process-resource-bundles) @ qpid-java-doc-perftests
---
[INFO] 
[INFO] --- maven-resources-plugin:3.1.0:resources (default-resources) @ qpid-java-doc-perftests
---
[INFO] Using 'UTF-8' encoding to copy filtered resources.
[INFO] Copying 1 resource
[INFO] 
[INFO] --- maven-compiler-plugin:3.7.0:compile (default-compile) @ qpid-java-doc-perftests
---
[INFO] No sources to compile
[INFO] 
[INFO] --- maven-resources-plugin:3.1.0:testResources (default-testResources) @ qpid-java-doc-perftests
---
[INFO] Using 'UTF-8' encoding to copy filtered resources.
[INFO] Copying 1 resource
[INFO] 
[INFO] --- maven-compiler-plugin:3.7.0:testCompile (default-testCompile) @ qpid-java-doc-perftests
---
[INFO] No sources to compile
[INFO] 
[INFO] --- maven-surefire-plugin:2.22.0:test (default-test) @ qpid-java-doc-perftests ---
[INFO] No tests to run.
[INFO] 
[INFO] --- maven-jar-plugin:3.1.0:jar (default-jar) @ qpid-java-doc-perftests ---
[WARNING] JAR will be empty - no content was marked for inclusion!
[INFO] Building jar: F:\jenkins\jenkins-slave\712657a4\workspace\Qpid\Qpid-Broker-J-Test-JDK14\doc\java-perftests\target\qpid-java-doc-perftests-9.0.0-SNAPSHOT.jar
[INFO] 
[INFO] --- maven-site-plugin:3.7.1:attach-descriptor (attach-descriptor) @ qpid-java-doc-perftests
---
[INFO] Skipping because packaging 'jar' is not pom.
[INFO] 
[INFO] --- maven-assembly-plugin:3.0.0:single (default) @ qpid-java-doc-perftests ---
[INFO] Assemblies have been skipped per configuration of the skipAssembly parameter.
[INFO] 
[INFO] -----------< org.apache.qpid:qpid-broker-j-developer-guide >------------
[INFO] Building Apache Qpid Broker-J Developer Guide 9.0.0-SNAPSHOT     [14/49]
[INFO] --------------------------------[ jar ]---------------------------------
[INFO] 
[INFO] --- maven-clean-plugin:3.1.0:clean (default-clean) @ qpid-broker-j-developer-guide
---
[INFO] 
[INFO] --- buildnumber-maven-plugin:1.4:create (default) @ qpid-broker-j-developer-guide ---
[INFO] Executing: cmd.exe /X /C "git rev-parse --verify HEAD"
[INFO] Working directory: F:\jenkins\jenkins-slave\712657a4\workspace\Qpid\Qpid-Broker-J-Test-JDK14\doc\developer-guide
[INFO] Storing buildNumber: 4f861571ee0107b9f30945e5728492385c3510e3 at timestamp: 1602144854374
[WARNING] Cannot get the branch information from the git repository: 
Detecting the current branch failed: fatal: ref HEAD is not a symbolic ref

[INFO] Executing: cmd.exe /X /C "git rev-parse --verify HEAD"
[INFO] Working directory: F:\jenkins\jenkins-slave\712657a4\workspace\Qpid\Qpid-Broker-J-Test-JDK14\doc\developer-guide
[INFO] Storing buildScmBranch: UNKNOWN
[INFO] 
[INFO] --- maven-antrun-plugin:1.8:run (output-test-properties) @ qpid-broker-j-developer-guide
---
[INFO] Executing tasks

main:
     [echo] Qpid Test Profile Properties
     [echo] [profile] java-mms.1-0
     [echo] [profile.broker.version] 1.0
     [echo] [profile.virtualhostnode.type] Memory
     [echo] [profile.virtualhostnode.context.blueprint] {"type":"ProvidedStore","globalAddressDomains":"${qpid.globalAddressDomains}"}
     [echo] [profile.test_receive_timeout] 1000
[INFO] Executed tasks
[INFO] 
[INFO] --- maven-enforcer-plugin:3.0.0-M2:enforce (enforce-maven-version) @ qpid-broker-j-developer-guide
---
[INFO] 
[INFO] --- maven-enforcer-plugin:3.0.0-M2:enforce (enforce-minimum-versions) @ qpid-broker-j-developer-guide
---
[INFO] 
[INFO] --- maven-enforcer-plugin:3.0.0-M2:enforce (enforce-versions-standard-properties) @
qpid-broker-j-developer-guide ---
[INFO] 
[INFO] --- maven-enforcer-plugin:3.0.0-M2:enforce (enforce-enableAmqp0x) @ qpid-broker-j-developer-guide
---
[INFO] 
[INFO] --- jacoco-maven-plugin:0.8.5:prepare-agent (default-prepare-agent) @ qpid-broker-j-developer-guide
---
[INFO] argLine set to -javaagent:F:\\hudson\\m2_repository\\org\\jacoco\\org.jacoco.agent\\0.8.5\\org.jacoco.agent-0.8.5-runtime.jar=destfile=F:\\jenkins\\jenkins-slave\\712657a4\\workspace\\Qpid\\Qpid-Broker-J-Test-JDK14\\doc\\developer-guide\\target\\jacoco.exec
-Xmx512m
[INFO] 
[INFO] --- maven-resources-plugin:3.1.0:copy-resources (filter-docbook-sources) @ qpid-broker-j-developer-guide
---
[INFO] Using 'UTF-8' encoding to copy filtered resources.
[INFO] skip non existing resourceDirectory F:\jenkins\jenkins-slave\712657a4\workspace\Qpid\Qpid-Broker-J-Test-JDK14\doc\developer-guide\src\docbkx
[INFO] 
[INFO] --- maven-remote-resources-plugin:1.5:process (process-resource-bundles) @ qpid-broker-j-developer-guide
---
[INFO] 
[INFO] --- maven-resources-plugin:3.1.0:resources (default-resources) @ qpid-broker-j-developer-guide
---
[INFO] Using 'UTF-8' encoding to copy filtered resources.
[INFO] skip non existing resourceDirectory F:\jenkins\jenkins-slave\712657a4\workspace\Qpid\Qpid-Broker-J-Test-JDK14\doc\developer-guide\src\docbkx
[INFO] 
[INFO] --- maven-compiler-plugin:3.7.0:compile (default-compile) @ qpid-broker-j-developer-guide
---
[INFO] No sources to compile
[INFO] 
[INFO] --- maven-resources-plugin:3.1.0:testResources (default-testResources) @ qpid-broker-j-developer-guide
---
[INFO] Using 'UTF-8' encoding to copy filtered resources.
[INFO] skip non existing resourceDirectory F:\jenkins\jenkins-slave\712657a4\workspace\Qpid\Qpid-Broker-J-Test-JDK14\doc\developer-guide\src\docbkx
[INFO] 
[INFO] --- maven-compiler-plugin:3.7.0:testCompile (default-testCompile) @ qpid-broker-j-developer-guide
---
[INFO] No sources to compile
[INFO] 
[INFO] --- maven-surefire-plugin:2.22.0:test (default-test) @ qpid-broker-j-developer-guide
---
[INFO] No tests to run.
[INFO] 
[INFO] --- maven-jar-plugin:3.1.0:jar (default-jar) @ qpid-broker-j-developer-guide ---
[WARNING] JAR will be empty - no content was marked for inclusion!
[INFO] Building jar: F:\jenkins\jenkins-slave\712657a4\workspace\Qpid\Qpid-Broker-J-Test-JDK14\doc\developer-guide\target\qpid-broker-j-developer-guide-9.0.0-SNAPSHOT.jar
[INFO] 
[INFO] --- maven-site-plugin:3.7.1:attach-descriptor (attach-descriptor) @ qpid-broker-j-developer-guide
---
[INFO] Skipping because packaging 'jar' is not pom.
[INFO] 
[INFO] --- maven-assembly-plugin:3.0.0:single (default) @ qpid-broker-j-developer-guide ---
[INFO] Assemblies have been skipped per configuration of the skipAssembly parameter.
[INFO] ------------------------------------------------------------------------
[INFO] Reactor Summary for Apache Qpid Broker-J Parent 9.0.0-SNAPSHOT:
[INFO] 
[INFO] Apache Qpid Broker-J Parent ........................ SUCCESS [ 22.195 s]
[INFO] Apache Qpid Broker-J Code Generation ............... SUCCESS [  6.809 s]
[INFO] Apache Qpid Broker-J Test Utilities ................ SUCCESS [ 10.289 s]
[INFO] Apache Qpid Broker-J Core .......................... FAILURE [06:47 min]
[INFO] Apache Qpid Broker-J LogBack Logging Plug-in ....... SKIPPED
[INFO] Apache Qpid Broker-J Access Control Plug-in ........ SKIPPED
[INFO] Apache Qpid Broker-J AMQP 0-10 Protocol Plug-in .... SKIPPED
[INFO] Apache Qpid Broker-J AMQP 0-8 Protocol Plug-in ..... SKIPPED
[INFO] Apache Qpid Broker-J AMQP 1-0 Protocol Plug-in ..... SKIPPED
[INFO] Apache Qpid Broker-J AMQP 0-8 to 0-10 Message Conversion Plug-in SKIPPED
[INFO] Apache Qpid Broker-J AMQP 0-8 to 1-0 Message Conversion Plug-in SKIPPED
[INFO] Apache Qpid Broker-J AMQP 0-10 to 1-0 Message Conversion Plug-in SKIPPED
[INFO] Apache Qpid Broker-J JDBC Message Store Plug-in .... SKIPPED
[INFO] Apache Qpid Broker-J Derby Message Store Plug-in ... SKIPPED
[INFO] Apache Qpid Broker-J JDBC Message Store Connection Pooling Plug-in SKIPPED
[INFO] Apache Qpid Broker-J LogBack JDBC Logging Plug-in .. SKIPPED
[INFO] Apache Qpid AMQP 1.0 JDBC Link Store Plug-in ....... SKIPPED
[INFO] qpid-broker-plugins-prometheus-exporter ............ SKIPPED
[INFO] Apache Qpid Broker-J HTTP Management Plug-in ....... SKIPPED
[INFO] Apache Qpid Broker-J AMQP Management Protocol Plug-in SKIPPED
[INFO] Apache Qpid Broker-J Memory Message Store Plug-in .. SKIPPED
[INFO] Apache Qpid Broker-J WebSocket Plug-in ............. SKIPPED
[INFO] Apache Qpid Broker-J BDB Message Store Plug-in ..... SKIPPED
[INFO] Apache Qpid AMQP 1.0 BDB Link Store Plug-in ........ SKIPPED
[INFO] Apache Qpid Broker-J ............................... SKIPPED
[INFO] Apache Qpid Broker-J Bundles ....................... SKIPPED
[INFO] Apache Qpid Broker-J Tools ......................... SUCCESS [  0.793 s]
[INFO] Apache Qpid Broker-J System Test Parent ............ SUCCESS [  0.310 s]
[INFO] Apache Qpid Broker-J System Test Utils ............. SKIPPED
[INFO] Apache Qpid Broker-J JMS System Tests Core ......... SKIPPED
[INFO] Apache Qpid Broker-J JMS 1.1 System Tests .......... SKIPPED
[INFO] Apache Qpid Broker-J JMS 2.0 System Tests .......... SKIPPED
[INFO] Apache Qpid Broker-J HTTP system tests ............. SKIPPED
[INFO] Apache Qpid Broker-J Protocol Tests Core ........... SUCCESS [  1.738 s]
[INFO] Apache Qpid Protocol Tests for AMQP 0-8,0-9,0-9-1 .. SKIPPED
[INFO] Apache Qpid Protocol Tests for AMQP 0-10 ........... SKIPPED
[INFO] Apache Qpid Protocol Tests for AMQP 1.0 ............ SKIPPED
[INFO] Apache Qpid Broker-J System Tests Spawn Broker Admin SKIPPED
[INFO] Apache Qpid Broker-J End to End Conversion Tests ... SKIPPED
[INFO] Apache Qpid Broker-J Performance Tests ............. SUCCESS [ 44.872 s]
[INFO] Apache Qpid Broker-J Performance Test System Tests . SKIPPED
[INFO] Apache Qpid Broker-J Performance Tests Visualisation JFC SKIPPED
[INFO] Apache Qpid Broker-J BDB Store System Tests ........ SKIPPED
[INFO] Apache Qpid Joram JMS Tests ........................ SUCCESS [  1.182 s]
[INFO] Apache Qpid Broker-J JMS TCK Configuration ......... SUCCESS [  0.839 s]
[INFO] Apache Qpid Broker-J Docbook ....................... SUCCESS [  0.297 s]
[INFO] Apache Qpid Broker-J Docbook ....................... SUCCESS [  1.618 s]
[INFO] Apache Qpid Broker-J Performance Test Docbook ...... SUCCESS [  0.325 s]
[INFO] Apache Qpid Broker-J Developer Guide ............... SUCCESS [  0.375 s]
[INFO] ------------------------------------------------------------------------
[INFO] BUILD FAILURE
[INFO] ------------------------------------------------------------------------
[INFO] Total time:  08:20 min
[INFO] Finished at: 2020-10-08T01:14:14-07:00
[INFO] ------------------------------------------------------------------------
[ERROR] Failed to execute goal org.apache.maven.plugins:maven-surefire-plugin:2.22.0:test
(default-test) on project qpid-broker-core: There are test failures.
[ERROR] 
[ERROR] Please refer to F:\jenkins\jenkins-slave\712657a4\workspace\Qpid\Qpid-Broker-J-Test-JDK14\broker-core\target\surefire-reports\java-mms.1-0
for the individual test results.
[ERROR] Please refer to dump files (if any exist) [date]-jvmRun[N].dump, [date].dumpstream
and [date]-jvmRun[N].dumpstream.
[ERROR] -> [Help 1]
[ERROR] 
[ERROR] To see the full stack trace of the errors, re-run Maven with the -e switch.
[ERROR] Re-run Maven using the -X switch to enable full debug logging.
[ERROR] 
[ERROR] For more information about the errors and possible solutions, please read the following
articles:
[ERROR] [Help 1] http://cwiki.apache.org/confluence/display/MAVEN/MojoFailureException
[ERROR] 
[ERROR] After correcting the problems, you can resume the build with the command
[ERROR]   mvn <args> -rf :qpid-broker-core
Build step 'Invoke top-level Maven targets' marked build as failure
Archiving artifacts
Recording test results

Mime
View raw message