qpid-notifications mailing list archives

Site index · List index
Message view « Date » · « Thread »
Top « Date » · « Thread »
From Apache Jenkins Server <jenk...@builds.apache.org>
Subject Build failed in Jenkins: Qpid » Qpid-Broker-J-Artefact-Release-7.1.x #17
Date Sun, 18 Oct 2020 21:18:57 GMT
See <https://ci-builds.apache.org/job/Qpid/job/Qpid-Broker-J-Artefact-Release-7.1.x/17/display/redirect?page=changes>

Changes:

[Alex Rudyy] [maven-release-plugin] prepare release 7.1.10


------------------------------------------
[...truncated 556.14 KB...]
[INFO] Copying 1 resource
[INFO] 
[INFO] --- maven-compiler-plugin:3.7.0:compile (default-compile) @ qpid-java-doc-perftests
---
[INFO] No sources to compile
[INFO] 
[INFO] --- maven-resources-plugin:3.1.0:testResources (default-testResources) @ qpid-java-doc-perftests
---
[INFO] Using 'UTF-8' encoding to copy filtered resources.
[INFO] Copying 1 resource
[INFO] 
[INFO] --- maven-compiler-plugin:3.7.0:testCompile (default-testCompile) @ qpid-java-doc-perftests
---
[INFO] No sources to compile
[INFO] 
[INFO] --- maven-surefire-plugin:2.22.0:test (default-test) @ qpid-java-doc-perftests ---
[INFO] Tests are skipped.
[INFO] 
[INFO] --- maven-jar-plugin:3.1.0:jar (default-jar) @ qpid-java-doc-perftests ---
[WARNING] JAR will be empty - no content was marked for inclusion!
[INFO] Building jar: <https://ci-builds.apache.org/job/Qpid/job/Qpid-Broker-J-Artefact-Release-7.1.x/ws/doc/java-perftests/target/qpid-java-doc-perftests-7.1.10.jar>
[INFO] 
[INFO] --- maven-site-plugin:3.7.1:attach-descriptor (attach-descriptor) @ qpid-java-doc-perftests
---
[INFO] Skipping because packaging 'jar' is not pom.
[INFO] 
[INFO] --- maven-assembly-plugin:3.0.0:single (default) @ qpid-java-doc-perftests ---
[INFO] Assemblies have been skipped per configuration of the skipAssembly parameter.
[INFO] ------------------------------------------------------------------------
[INFO] Reactor Summary for Apache Qpid Broker-J Parent 7.1.10:
[INFO] 
[INFO] Apache Qpid Broker-J Parent ........................ SUCCESS [  2.608 s]
[INFO] Apache Qpid Broker-J Code Generation ............... SUCCESS [  2.194 s]
[INFO] Apache Qpid Broker-J Test Utilities ................ SUCCESS [  0.606 s]
[INFO] Apache Qpid Broker-J Core .......................... SUCCESS [ 14.954 s]
[INFO] Apache Qpid Broker-J LogBack Logging Plug-in ....... SUCCESS [  1.539 s]
[INFO] Apache Qpid Broker-J Access Control Plug-in ........ SUCCESS [  1.013 s]
[INFO] Apache Qpid Broker-J AMQP 0-10 Protocol Plug-in .... SUCCESS [  1.933 s]
[INFO] Apache Qpid Broker-J AMQP 0-8 Protocol Plug-in ..... SUCCESS [  1.763 s]
[INFO] Apache Qpid Broker-J AMQP 1-0 Protocol Plug-in ..... SUCCESS [  2.827 s]
[INFO] Apache Qpid Broker-J AMQP 0-8 to 0-10 Message Conversion Plug-in SUCCESS [  0.460 s]
[INFO] Apache Qpid Broker-J AMQP 0-8 to 1-0 Message Conversion Plug-in SUCCESS [  0.493 s]
[INFO] Apache Qpid Broker-J AMQP 0-10 to 1-0 Message Conversion Plug-in SUCCESS [  0.478 s]
[INFO] Apache Qpid Broker-J JDBC Message Store Plug-in .... SUCCESS [  1.138 s]
[INFO] Apache Qpid Broker-J Derby Message Store Plug-in ... SUCCESS [  0.762 s]
[INFO] Apache Qpid Broker-J JDBC Message Store Connection Pooling Plug-in SUCCESS [  0.357
s]
[INFO] Apache Qpid Broker-J LogBack JDBC Logging Plug-in .. SUCCESS [  0.639 s]
[INFO] Apache Qpid AMQP 1.0 JDBC Link Store Plug-in ....... SUCCESS [  0.393 s]
[INFO] qpid-broker-plugins-prometheus-exporter ............ SUCCESS [  0.634 s]
[INFO] Apache Qpid Broker-J HTTP Management Plug-in ....... SUCCESS [  2.830 s]
[INFO] Apache Qpid Broker-J AMQP Management Protocol Plug-in SUCCESS [  0.327 s]
[INFO] Apache Qpid Broker-J Memory Message Store Plug-in .. SUCCESS [  0.321 s]
[INFO] Apache Qpid Broker-J WebSocket Plug-in ............. SUCCESS [  0.374 s]
[INFO] Apache Qpid Broker-J BDB Message Store Plug-in ..... SUCCESS [  1.992 s]
[INFO] Apache Qpid AMQP 1.0 BDB Link Store Plug-in ........ SUCCESS [  0.334 s]
[INFO] Apache Qpid Broker-J ............................... SUCCESS [  0.576 s]
[INFO] Apache Qpid Broker-J Bundles ....................... SUCCESS [  6.137 s]
[INFO] Apache Qpid Broker-J Tools ......................... SUCCESS [  0.269 s]
[INFO] Apache Qpid Broker-J System Test Parent ............ SUCCESS [  0.087 s]
[INFO] Apache Qpid Broker-J System Test Utils ............. SUCCESS [  0.363 s]
[INFO] Apache Qpid Broker-J JMS System Tests Core ......... SUCCESS [  0.681 s]
[INFO] Apache Qpid Broker-J JMS 1.1 System Tests .......... SUCCESS [  1.971 s]
[INFO] Apache Qpid Broker-J JMS 2.0 System Tests .......... SUCCESS [  0.578 s]
[INFO] Apache Qpid Broker-J HTTP system tests ............. SUCCESS [  1.457 s]
[INFO] Apache Qpid Broker-J Protocol Tests Core ........... SUCCESS [  0.271 s]
[INFO] Apache Qpid Protocol Tests for AMQP 0-8,0-9,0-9-1 .. SUCCESS [  1.333 s]
[INFO] Apache Qpid Protocol Tests for AMQP 0-10 ........... SUCCESS [  0.920 s]
[INFO] Apache Qpid Protocol Tests for AMQP 1.0 ............ SUCCESS [  2.308 s]
[INFO] Apache Qpid Broker-J System Tests Spawn Broker Admin SUCCESS [  1.134 s]
[INFO] Apache Qpid Broker-J End to End Conversion Tests ... SUCCESS [  0.999 s]
[INFO] Apache Qpid Broker-J Performance Tests ............. SUCCESS [  1.492 s]
[INFO] Apache Qpid Broker-J Performance Test System Tests . SUCCESS [  0.401 s]
[INFO] Apache Qpid Broker-J Performance Tests Visualisation JFC SUCCESS [  1.334 s]
[INFO] Apache Qpid Broker-J BDB Store System Tests ........ SUCCESS [  0.772 s]
[INFO] Apache Qpid Joram JMS Tests ........................ SUCCESS [  0.231 s]
[INFO] Apache Qpid Broker-J JMS TCK Configuration ......... SUCCESS [  0.215 s]
[INFO] Apache Qpid Broker-J Docbook ....................... SUCCESS [  0.059 s]
[INFO] Apache Qpid Broker-J Docbook ....................... SUCCESS [  0.737 s]
[INFO] Apache Qpid Broker-J Performance Test Docbook ...... SUCCESS [  0.115 s]
[INFO] ------------------------------------------------------------------------
[INFO] BUILD SUCCESS
[INFO] ------------------------------------------------------------------------
[INFO] Total time:  01:05 min
[INFO] Finished at: 2020-10-18T21:18:35Z
[INFO] ------------------------------------------------------------------------
[Qpid-Broker-J-Artefact-Release-7.1.x] $ /home/jenkins/tools/maven/latest3/bin/mvn -f ./pom.xml
-Djava.io.tmpdir=<https://ci-builds.apache.org/job/Qpid/job/Qpid-Broker-J-Artefact-Release-7.1.x/ws/tmp>
-DskipTests=true deploy
[INFO] Scanning for projects...
[INFO] ------------------------------------------------------------------------
[INFO] Reactor Build Order:
[INFO] 
[INFO] Apache Qpid Broker-J Parent                                        [pom]
[INFO] Apache Qpid Broker-J Code Generation                               [jar]
[INFO] Apache Qpid Broker-J Test Utilities                                [jar]
[INFO] Apache Qpid Broker-J Core                                          [jar]
[INFO] Apache Qpid Broker-J LogBack Logging Plug-in                       [jar]
[INFO] Apache Qpid Broker-J Access Control Plug-in                        [jar]
[INFO] Apache Qpid Broker-J AMQP 0-10 Protocol Plug-in                    [jar]
[INFO] Apache Qpid Broker-J AMQP 0-8 Protocol Plug-in                     [jar]
[INFO] Apache Qpid Broker-J AMQP 1-0 Protocol Plug-in                     [jar]
[INFO] Apache Qpid Broker-J AMQP 0-8 to 0-10 Message Conversion Plug-in   [jar]
[INFO] Apache Qpid Broker-J AMQP 0-8 to 1-0 Message Conversion Plug-in    [jar]
[INFO] Apache Qpid Broker-J AMQP 0-10 to 1-0 Message Conversion Plug-in   [jar]
[INFO] Apache Qpid Broker-J JDBC Message Store Plug-in                    [jar]
[INFO] Apache Qpid Broker-J Derby Message Store Plug-in                   [jar]
[INFO] Apache Qpid Broker-J JDBC Message Store Connection Pooling Plug-in [jar]
[INFO] Apache Qpid Broker-J LogBack JDBC Logging Plug-in                  [jar]
[INFO] Apache Qpid AMQP 1.0 JDBC Link Store Plug-in                       [jar]
[INFO] qpid-broker-plugins-prometheus-exporter                            [jar]
[INFO] Apache Qpid Broker-J HTTP Management Plug-in                       [jar]
[INFO] Apache Qpid Broker-J AMQP Management Protocol Plug-in              [jar]
[INFO] Apache Qpid Broker-J Memory Message Store Plug-in                  [jar]
[INFO] Apache Qpid Broker-J WebSocket Plug-in                             [jar]
[INFO] Apache Qpid Broker-J BDB Message Store Plug-in                     [jar]
[INFO] Apache Qpid AMQP 1.0 BDB Link Store Plug-in                        [jar]
[INFO] Apache Qpid Broker-J                                               [jar]
[INFO] Apache Qpid Broker-J Bundles                                       [pom]
[INFO] Apache Qpid Broker-J Tools                                         [jar]
[INFO] Apache Qpid Broker-J System Test Parent                            [pom]
[INFO] Apache Qpid Broker-J System Test Utils                             [jar]
[INFO] Apache Qpid Broker-J JMS System Tests Core                         [jar]
[INFO] Apache Qpid Broker-J JMS 1.1 System Tests                          [jar]
[INFO] Apache Qpid Broker-J JMS 2.0 System Tests                          [jar]
[INFO] Apache Qpid Broker-J HTTP system tests                             [jar]
[INFO] Apache Qpid Broker-J Protocol Tests Core                           [jar]
[INFO] Apache Qpid Protocol Tests for AMQP 0-8,0-9,0-9-1                  [jar]
[INFO] Apache Qpid Protocol Tests for AMQP 0-10                           [jar]
[INFO] Apache Qpid Protocol Tests for AMQP 1.0                            [jar]
[INFO] Apache Qpid Broker-J System Tests Spawn Broker Admin               [jar]
[INFO] Apache Qpid Broker-J End to End Conversion Tests                   [jar]
[INFO] Apache Qpid Broker-J Performance Tests                             [jar]
[INFO] Apache Qpid Broker-J Performance Test System Tests                 [jar]
[INFO] Apache Qpid Broker-J Performance Tests Visualisation JFC           [jar]
[INFO] Apache Qpid Broker-J BDB Store System Tests                        [jar]
[INFO] Apache Qpid Joram JMS Tests                                        [jar]
[INFO] Apache Qpid Broker-J JMS TCK Configuration                         [jar]
[INFO] Apache Qpid Broker-J Docbook                                       [pom]
[INFO] Apache Qpid Broker-J Docbook                                       [jar]
[INFO] Apache Qpid Broker-J Performance Test Docbook                      [jar]
[INFO] 
[INFO] -----------------< org.apache.qpid:qpid-broker-parent >-----------------
[INFO] Building Apache Qpid Broker-J Parent 7.1.10                       [1/48]
[INFO] --------------------------------[ pom ]---------------------------------
[INFO] 
[INFO] --- buildnumber-maven-plugin:1.4:create (default) @ qpid-broker-parent ---
[INFO] Executing: /bin/sh -c cd '<https://ci-builds.apache.org/job/Qpid/job/Qpid-Broker-J-Artefact-Release-7.1.x/ws/.'>
&& 'git' 'rev-parse' '--verify' 'HEAD'
[INFO] Working directory: <https://ci-builds.apache.org/job/Qpid/job/Qpid-Broker-J-Artefact-Release-7.1.x/ws/.>
[INFO] Storing buildNumber: 132de5b8713fb174fc93091502ff31606b6626a3 at timestamp: 1603055918983
[WARNING] Cannot get the branch information from the git repository: 
Detecting the current branch failed: fatal: ref HEAD is not a symbolic ref

[INFO] Executing: /bin/sh -c cd '<https://ci-builds.apache.org/job/Qpid/job/Qpid-Broker-J-Artefact-Release-7.1.x/ws/.'>
&& 'git' 'rev-parse' '--verify' 'HEAD'
[INFO] Working directory: <https://ci-builds.apache.org/job/Qpid/job/Qpid-Broker-J-Artefact-Release-7.1.x/ws/.>
[INFO] Storing buildScmBranch: UNKNOWN
[INFO] 
[INFO] --- maven-antrun-plugin:1.8:run (output-test-properties) @ qpid-broker-parent ---
[INFO] Executing tasks

main:
     [echo] Qpid Test Profile Properties
     [echo] [profile] java-mms.1-0
     [echo] [profile.broker.version] 1.0
     [echo] [profile.virtualhostnode.type] Memory
     [echo] [profile.virtualhostnode.context.blueprint] {"type":"ProvidedStore","globalAddressDomains":"${qpid.globalAddressDomains}"}
     [echo] [profile.test_receive_timeout] 1000
[INFO] Executed tasks
[INFO] 
[INFO] --- maven-enforcer-plugin:3.0.0-M2:enforce (enforce-maven-version) @ qpid-broker-parent
---
[INFO] 
[INFO] --- maven-enforcer-plugin:3.0.0-M2:enforce (enforce-minimum-versions) @ qpid-broker-parent
---
[INFO] 
[INFO] --- maven-enforcer-plugin:3.0.0-M2:enforce (enforce-versions-standard-properties) @
qpid-broker-parent ---
[INFO] 
[INFO] --- maven-enforcer-plugin:3.0.0-M2:enforce (enforce-enableAmqp0x) @ qpid-broker-parent
---
[INFO] 
[INFO] --- jacoco-maven-plugin:0.8.2:prepare-agent (default-prepare-agent) @ qpid-broker-parent
---
[INFO] argLine set to -javaagent:/home/jenkins/.m2/repository/org/jacoco/org.jacoco.agent/0.8.2/org.jacoco.agent-0.8.2-runtime.jar=destfile=<https://ci-builds.apache.org/job/Qpid/job/Qpid-Broker-J-Artefact-Release-7.1.x/ws/./target/jacoco.exec>
-Xmx512m
[INFO] 
[INFO] --- maven-remote-resources-plugin:1.5:process (process-resource-bundles) @ qpid-broker-parent
---
[INFO] 
[INFO] --- maven-site-plugin:3.7.1:attach-descriptor (attach-descriptor) @ qpid-broker-parent
---
[INFO] No site descriptor found: nothing to attach.
[INFO] 
[INFO] --- maven-install-plugin:2.5.2:install (default-install) @ qpid-broker-parent ---
[INFO] Installing <https://ci-builds.apache.org/job/Qpid/job/Qpid-Broker-J-Artefact-Release-7.1.x/ws/./pom.xml>
to /home/jenkins/.m2/repository/org/apache/qpid/qpid-broker-parent/7.1.10/qpid-broker-parent-7.1.10.pom
[INFO] 
[INFO] --- maven-deploy-plugin:2.8.2:deploy (default-deploy) @ qpid-broker-parent ---
Uploading to apache.releases.https: https://repository.apache.org/service/local/staging/deploy/maven2/org/apache/qpid/qpid-broker-parent/7.1.10/qpid-broker-parent-7.1.10.pom
Progress (1): 4.1/62 kBProgress (1): 8.2/62 kBProgress (1): 12/62 kB Progress (1): 16/62 kBProgress
(1): 20/62 kBProgress (1): 25/62 kBProgress (1): 29/62 kBProgress (1): 33/62 kBProgress (1):
37/62 kBProgress (1): 41/62 kBProgress (1): 45/62 kBProgress (1): 49/62 kBProgress (1): 53/62
kBProgress (1): 57/62 kBProgress (1): 61/62 kBProgress (1): 62 kB                      [INFO]
------------------------------------------------------------------------
[INFO] Reactor Summary for Apache Qpid Broker-J Parent 7.1.10:
[INFO] 
[INFO] Apache Qpid Broker-J Parent ........................ FAILURE [  4.875 s]
[INFO] Apache Qpid Broker-J Code Generation ............... SKIPPED
[INFO] Apache Qpid Broker-J Test Utilities ................ SKIPPED
[INFO] Apache Qpid Broker-J Core .......................... SKIPPED
[INFO] Apache Qpid Broker-J LogBack Logging Plug-in ....... SKIPPED
[INFO] Apache Qpid Broker-J Access Control Plug-in ........ SKIPPED
[INFO] Apache Qpid Broker-J AMQP 0-10 Protocol Plug-in .... SKIPPED
[INFO] Apache Qpid Broker-J AMQP 0-8 Protocol Plug-in ..... SKIPPED
[INFO] Apache Qpid Broker-J AMQP 1-0 Protocol Plug-in ..... SKIPPED
[INFO] Apache Qpid Broker-J AMQP 0-8 to 0-10 Message Conversion Plug-in SKIPPED
[INFO] Apache Qpid Broker-J AMQP 0-8 to 1-0 Message Conversion Plug-in SKIPPED
[INFO] Apache Qpid Broker-J AMQP 0-10 to 1-0 Message Conversion Plug-in SKIPPED
[INFO] Apache Qpid Broker-J JDBC Message Store Plug-in .... SKIPPED
[INFO] Apache Qpid Broker-J Derby Message Store Plug-in ... SKIPPED
[INFO] Apache Qpid Broker-J JDBC Message Store Connection Pooling Plug-in SKIPPED
[INFO] Apache Qpid Broker-J LogBack JDBC Logging Plug-in .. SKIPPED
[INFO] Apache Qpid AMQP 1.0 JDBC Link Store Plug-in ....... SKIPPED
[INFO] qpid-broker-plugins-prometheus-exporter ............ SKIPPED
[INFO] Apache Qpid Broker-J HTTP Management Plug-in ....... SKIPPED
[INFO] Apache Qpid Broker-J AMQP Management Protocol Plug-in SKIPPED
[INFO] Apache Qpid Broker-J Memory Message Store Plug-in .. SKIPPED
[INFO] Apache Qpid Broker-J WebSocket Plug-in ............. SKIPPED
[INFO] Apache Qpid Broker-J BDB Message Store Plug-in ..... SKIPPED
[INFO] Apache Qpid AMQP 1.0 BDB Link Store Plug-in ........ SKIPPED
[INFO] Apache Qpid Broker-J ............................... SKIPPED
[INFO] Apache Qpid Broker-J Bundles ....................... SKIPPED
[INFO] Apache Qpid Broker-J Tools ......................... SKIPPED
[INFO] Apache Qpid Broker-J System Test Parent ............ SKIPPED
[INFO] Apache Qpid Broker-J System Test Utils ............. SKIPPED
[INFO] Apache Qpid Broker-J JMS System Tests Core ......... SKIPPED
[INFO] Apache Qpid Broker-J JMS 1.1 System Tests .......... SKIPPED
[INFO] Apache Qpid Broker-J JMS 2.0 System Tests .......... SKIPPED
[INFO] Apache Qpid Broker-J HTTP system tests ............. SKIPPED
[INFO] Apache Qpid Broker-J Protocol Tests Core ........... SKIPPED
[INFO] Apache Qpid Protocol Tests for AMQP 0-8,0-9,0-9-1 .. SKIPPED
[INFO] Apache Qpid Protocol Tests for AMQP 0-10 ........... SKIPPED
[INFO] Apache Qpid Protocol Tests for AMQP 1.0 ............ SKIPPED
[INFO] Apache Qpid Broker-J System Tests Spawn Broker Admin SKIPPED
[INFO] Apache Qpid Broker-J End to End Conversion Tests ... SKIPPED
[INFO] Apache Qpid Broker-J Performance Tests ............. SKIPPED
[INFO] Apache Qpid Broker-J Performance Test System Tests . SKIPPED
[INFO] Apache Qpid Broker-J Performance Tests Visualisation JFC SKIPPED
[INFO] Apache Qpid Broker-J BDB Store System Tests ........ SKIPPED
[INFO] Apache Qpid Joram JMS Tests ........................ SKIPPED
[INFO] Apache Qpid Broker-J JMS TCK Configuration ......... SKIPPED
[INFO] Apache Qpid Broker-J Docbook ....................... SKIPPED
[INFO] Apache Qpid Broker-J Docbook ....................... SKIPPED
[INFO] Apache Qpid Broker-J Performance Test Docbook ...... SKIPPED
[INFO] ------------------------------------------------------------------------
[INFO] BUILD FAILURE
[INFO] ------------------------------------------------------------------------
[INFO] Total time:  5.542 s
[INFO] Finished at: 2020-10-18T21:18:43Z
[INFO] ------------------------------------------------------------------------
[ERROR] Failed to execute goal org.apache.maven.plugins:maven-deploy-plugin:2.8.2:deploy (default-deploy)
on project qpid-broker-parent: Failed to deploy artifacts: Could not transfer artifact org.apache.qpid:qpid-broker-parent:pom:7.1.10
from/to apache.releases.https (https://repository.apache.org/service/local/staging/deploy/maven2):
Transfer failed for https://repository.apache.org/service/local/staging/deploy/maven2/org/apache/qpid/qpid-broker-parent/7.1.10/qpid-broker-parent-7.1.10.pom
401 Unauthorized -> [Help 1]
[ERROR] 
[ERROR] To see the full stack trace of the errors, re-run Maven with the -e switch.
[ERROR] Re-run Maven using the -X switch to enable full debug logging.
[ERROR] 
[ERROR] For more information about the errors and possible solutions, please read the following
articles:
[ERROR] [Help 1] http://cwiki.apache.org/confluence/display/MAVEN/MojoExecutionException
Build step 'Invoke top-level Maven targets' marked build as failure
Archiving artifacts

Mime
View raw message