qpid-notifications mailing list archives

Site index · List index
Message view « Date » · « Thread »
Top « Date » · « Thread »
From Apache Jenkins Server <jenk...@builds.apache.org>
Subject Build failed in Jenkins: Qpid-proton-c #2038
Date Tue, 03 Dec 2019 21:57:59 GMT
See <https://builds.apache.org/job/Qpid-proton-c/2038/display/redirect?page=changes>

Changes:

[astitcher] PROTON-2140: Revert an internal ABI change that breaks the Ruby binding


------------------------------------------
[...truncated 18.15 KB...]
[ 41%] Built target fuzz-url
Scanning dependencies of target msgr-send
[ 41%] Building C object c/tools/CMakeFiles/msgr-send.dir/msgr-send.c.o
[ 42%] Building C object c/tools/CMakeFiles/msgr-send.dir/msgr-common.c.o
[ 42%] Linking C executable msgr-send
[ 42%] Built target msgr-send
Scanning dependencies of target msgr-recv
[ 42%] Building C object c/tools/CMakeFiles/msgr-recv.dir/msgr-recv.c.o
[ 42%] Building C object c/tools/CMakeFiles/msgr-recv.dir/msgr-common.c.o
[ 43%] Linking C executable msgr-recv
[ 43%] Built target msgr-recv
Scanning dependencies of target reactor-recv
[ 44%] Building C object c/tools/CMakeFiles/reactor-recv.dir/reactor-recv.c.o
[ 44%] Building C object c/tools/CMakeFiles/reactor-recv.dir/msgr-common.c.o
[ 45%] Linking C executable reactor-recv
[ 45%] Built target reactor-recv
Scanning dependencies of target reactor-send
[ 45%] Building C object c/tools/CMakeFiles/reactor-send.dir/reactor-send.c.o
[ 45%] Building C object c/tools/CMakeFiles/reactor-send.dir/msgr-common.c.o
[ 46%] Linking C executable reactor-send
[ 46%] Built target reactor-send
Scanning dependencies of target qpid-proton-cpp
[ 47%] Building CXX object cpp/CMakeFiles/qpid-proton-cpp.dir/src/binary.cpp.o
[ 47%] Building CXX object cpp/CMakeFiles/qpid-proton-cpp.dir/src/byte_array.cpp.o
[ 47%] Building CXX object cpp/CMakeFiles/qpid-proton-cpp.dir/src/map.cpp.o
[ 48%] Building CXX object cpp/CMakeFiles/qpid-proton-cpp.dir/src/connection.cpp.o
[ 48%] Building CXX object cpp/CMakeFiles/qpid-proton-cpp.dir/src/connection_driver.cpp.o
[ 49%] Building CXX object cpp/CMakeFiles/qpid-proton-cpp.dir/src/connection_options.cpp.o
[ 49%] Building CXX object cpp/CMakeFiles/qpid-proton-cpp.dir/src/container.cpp.o
[ 49%] Building CXX object cpp/CMakeFiles/qpid-proton-cpp.dir/src/proactor_container_impl.cpp.o
[ 50%] Building CXX object cpp/CMakeFiles/qpid-proton-cpp.dir/src/contexts.cpp.o
[ 50%] Building CXX object cpp/CMakeFiles/qpid-proton-cpp.dir/src/data.cpp.o
[ 51%] Building CXX object cpp/CMakeFiles/qpid-proton-cpp.dir/src/decimal.cpp.o
[ 51%] Building CXX object cpp/CMakeFiles/qpid-proton-cpp.dir/src/decoder.cpp.o
[ 51%] Building CXX object cpp/CMakeFiles/qpid-proton-cpp.dir/src/delivery.cpp.o
[ 52%] Building CXX object cpp/CMakeFiles/qpid-proton-cpp.dir/src/duration.cpp.o
[ 52%] Building CXX object cpp/CMakeFiles/qpid-proton-cpp.dir/src/encoder.cpp.o
[ 52%] Building CXX object cpp/CMakeFiles/qpid-proton-cpp.dir/src/endpoint.cpp.o
[ 53%] Building CXX object cpp/CMakeFiles/qpid-proton-cpp.dir/src/error.cpp.o
[ 53%] Building CXX object cpp/CMakeFiles/qpid-proton-cpp.dir/src/error_condition.cpp.o
[ 54%] Building CXX object cpp/CMakeFiles/qpid-proton-cpp.dir/src/handler.cpp.o
[ 54%] Building CXX object cpp/CMakeFiles/qpid-proton-cpp.dir/src/link.cpp.o
[ 54%] Building CXX object cpp/CMakeFiles/qpid-proton-cpp.dir/src/link_namer.cpp.o
[ 55%] Building CXX object cpp/CMakeFiles/qpid-proton-cpp.dir/src/listener.cpp.o
[ 55%] Building CXX object cpp/CMakeFiles/qpid-proton-cpp.dir/src/message.cpp.o
[ 56%] Building CXX object cpp/CMakeFiles/qpid-proton-cpp.dir/src/messaging_adapter.cpp.o
[ 56%] Building CXX object cpp/CMakeFiles/qpid-proton-cpp.dir/src/node_options.cpp.o
[ 56%] Building CXX object cpp/CMakeFiles/qpid-proton-cpp.dir/src/null.cpp.o
[ 57%] Building CXX object cpp/CMakeFiles/qpid-proton-cpp.dir/src/object.cpp.o
[ 57%] Building CXX object cpp/CMakeFiles/qpid-proton-cpp.dir/src/proton_bits.cpp.o
[ 58%] Building CXX object cpp/CMakeFiles/qpid-proton-cpp.dir/src/receiver.cpp.o
[ 58%] Building CXX object cpp/CMakeFiles/qpid-proton-cpp.dir/src/receiver_options.cpp.o
[ 58%] Building CXX object cpp/CMakeFiles/qpid-proton-cpp.dir/src/reconnect_options.cpp.o
[ 59%] Building CXX object cpp/CMakeFiles/qpid-proton-cpp.dir/src/returned.cpp.o
[ 59%] Building CXX object cpp/CMakeFiles/qpid-proton-cpp.dir/src/sasl.cpp.o
[ 60%] Building CXX object cpp/CMakeFiles/qpid-proton-cpp.dir/src/scalar_base.cpp.o
[ 60%] Building CXX object cpp/CMakeFiles/qpid-proton-cpp.dir/src/sender.cpp.o
[ 60%] Building CXX object cpp/CMakeFiles/qpid-proton-cpp.dir/src/sender_options.cpp.o
[ 61%] Building CXX object cpp/CMakeFiles/qpid-proton-cpp.dir/src/session.cpp.o
[ 61%] Building CXX object cpp/CMakeFiles/qpid-proton-cpp.dir/src/session_options.cpp.o
[ 62%] Building CXX object cpp/CMakeFiles/qpid-proton-cpp.dir/src/source.cpp.o
[ 62%] Building CXX object cpp/CMakeFiles/qpid-proton-cpp.dir/src/ssl.cpp.o
[ 62%] Building CXX object cpp/CMakeFiles/qpid-proton-cpp.dir/src/ssl_options.cpp.o
[ 63%] Building CXX object cpp/CMakeFiles/qpid-proton-cpp.dir/src/target.cpp.o
[ 63%] Building CXX object cpp/CMakeFiles/qpid-proton-cpp.dir/src/terminus.cpp.o
[ 64%] Building CXX object cpp/CMakeFiles/qpid-proton-cpp.dir/src/timestamp.cpp.o
[ 64%] Building CXX object cpp/CMakeFiles/qpid-proton-cpp.dir/src/tracker.cpp.o
[ 64%] Building CXX object cpp/CMakeFiles/qpid-proton-cpp.dir/src/transfer.cpp.o
[ 65%] Building CXX object cpp/CMakeFiles/qpid-proton-cpp.dir/src/transport.cpp.o
[ 65%] Building CXX object cpp/CMakeFiles/qpid-proton-cpp.dir/src/type_id.cpp.o
[ 66%] Building CXX object cpp/CMakeFiles/qpid-proton-cpp.dir/src/url.cpp.o
[ 66%] Building CXX object cpp/CMakeFiles/qpid-proton-cpp.dir/src/uuid.cpp.o
[ 66%] Building CXX object cpp/CMakeFiles/qpid-proton-cpp.dir/src/value.cpp.o
[ 67%] Building CXX object cpp/CMakeFiles/qpid-proton-cpp.dir/src/work_queue.cpp.o
[ 67%] Building CXX object cpp/CMakeFiles/qpid-proton-cpp.dir/src/connect_config_dummy.cpp.o
[ 68%] Linking CXX shared library libqpid-proton-cpp.so
[ 68%] Built target qpid-proton-cpp
Scanning dependencies of target credit_test
[ 68%] Building CXX object cpp/CMakeFiles/credit_test.dir/src/credit_test.cpp.o
[ 69%] Linking CXX executable credit_test
[ 69%] Built target credit_test
Scanning dependencies of target connection_driver_test
[ 69%] Building CXX object cpp/CMakeFiles/connection_driver_test.dir/src/connection_driver_test.cpp.o
[ 70%] Linking CXX executable connection_driver_test
[ 70%] Built target connection_driver_test
Scanning dependencies of target reconnect_test
[ 70%] Building CXX object cpp/CMakeFiles/reconnect_test.dir/src/reconnect_test.cpp.o
[ 70%] Linking CXX executable reconnect_test
[ 70%] Built target reconnect_test
Scanning dependencies of target codec_test
[ 71%] Building CXX object cpp/CMakeFiles/codec_test.dir/src/codec_test.cpp.o
[ 71%] Linking CXX executable codec_test
[ 71%] Built target codec_test
Scanning dependencies of target value_test
[ 71%] Building CXX object cpp/CMakeFiles/value_test.dir/src/value_test.cpp.o
[ 72%] Linking CXX executable value_test
[ 72%] Built target value_test
Scanning dependencies of target scalar_test
[ 72%] Building CXX object cpp/CMakeFiles/scalar_test.dir/src/scalar_test.cpp.o
[ 73%] Linking CXX executable scalar_test
[ 73%] Built target scalar_test
Scanning dependencies of target interop_test
[ 73%] Building CXX object cpp/CMakeFiles/interop_test.dir/src/interop_test.cpp.o
[ 73%] Linking CXX executable interop_test
[ 73%] Built target interop_test
Scanning dependencies of target message_test
[ 73%] Building CXX object cpp/CMakeFiles/message_test.dir/src/message_test.cpp.o
[ 74%] Linking CXX executable message_test
[ 74%] Built target message_test
Scanning dependencies of target link_test
[ 75%] Building CXX object cpp/CMakeFiles/link_test.dir/src/link_test.cpp.o
[ 75%] Linking CXX executable link_test
[ 75%] Built target link_test
Scanning dependencies of target container_test
[ 75%] Building CXX object cpp/CMakeFiles/container_test.dir/src/container_test.cpp.o
[ 75%] Linking CXX executable container_test
[ 75%] Built target container_test
Scanning dependencies of target cpp-test
[ 76%] Building CXX object cpp/CMakeFiles/cpp-test.dir/src/cpp-test.cpp.o
[ 76%] Building CXX object cpp/CMakeFiles/cpp-test.dir/src/url_test.cpp.o
[ 77%] Linking CXX executable cpp-test
[ 77%] Built target cpp-test
Scanning dependencies of target map_test
[ 78%] Building CXX object cpp/CMakeFiles/map_test.dir/src/map_test.cpp.o
[ 78%] Linking CXX executable map_test
[ 78%] Built target map_test
Scanning dependencies of target multithreaded_client
[ 78%] Building CXX object cpp/examples/CMakeFiles/multithreaded_client.dir/multithreaded_client.cpp.o
[ 79%] Linking CXX executable multithreaded_client
[ 79%] Built target multithreaded_client
Scanning dependencies of target service_bus
[ 79%] Building CXX object cpp/examples/CMakeFiles/service_bus.dir/service_bus.cpp.o
[ 79%] Linking CXX executable service_bus
[ 79%] Built target service_bus
Scanning dependencies of target scheduled_send
[ 79%] Building CXX object cpp/examples/CMakeFiles/scheduled_send.dir/scheduled_send.cpp.o
[ 79%] Linking CXX executable scheduled_send
[ 79%] Built target scheduled_send
Scanning dependencies of target encode_decode
[ 80%] Building CXX object cpp/examples/CMakeFiles/encode_decode.dir/encode_decode.cpp.o
[ 80%] Linking CXX executable encode_decode
[ 80%] Built target encode_decode
Scanning dependencies of target ssl_client_cert
[ 80%] Building CXX object cpp/examples/CMakeFiles/ssl_client_cert.dir/ssl_client_cert.cpp.o
[ 80%] Linking CXX executable ssl_client_cert
[ 80%] Built target ssl_client_cert
Scanning dependencies of target multithreaded_client_flow_control
[ 80%] Building CXX object cpp/examples/CMakeFiles/multithreaded_client_flow_control.dir/multithreaded_client_flow_control.cpp.o
[ 81%] Linking CXX executable multithreaded_client_flow_control
[ 81%] Built target multithreaded_client_flow_control
Scanning dependencies of target selected_recv
[ 82%] Building CXX object cpp/examples/CMakeFiles/selected_recv.dir/selected_recv.cpp.o
[ 82%] Linking CXX executable selected_recv
[ 82%] Built target selected_recv
Scanning dependencies of target simple_send
[ 82%] Building CXX object cpp/examples/CMakeFiles/simple_send.dir/simple_send.cpp.o
[ 83%] Linking CXX executable simple_send
[ 83%] Built target simple_send
Scanning dependencies of target scheduled_send_03
[ 84%] Building CXX object cpp/examples/CMakeFiles/scheduled_send_03.dir/scheduled_send_03.cpp.o
[ 84%] Linking CXX executable scheduled_send_03
[ 84%] Built target scheduled_send_03
Scanning dependencies of target connection_options
[ 84%] Building CXX object cpp/examples/CMakeFiles/connection_options.dir/connection_options.cpp.o
[ 85%] Linking CXX executable connection_options
[ 85%] Built target connection_options
Scanning dependencies of target reconnect_client
[ 85%] Building CXX object cpp/examples/CMakeFiles/reconnect_client.dir/reconnect_client.cpp.o
[ 86%] Linking CXX executable reconnect_client
[ 86%] Built target reconnect_client
Scanning dependencies of target simple_connect
[ 87%] Building CXX object cpp/examples/CMakeFiles/simple_connect.dir/simple_connect.cpp.o
[ 87%] Linking CXX executable simple_connect
[ 87%] Built target simple_connect
Scanning dependencies of target simple_recv
[ 88%] Building CXX object cpp/examples/CMakeFiles/simple_recv.dir/simple_recv.cpp.o
[ 88%] Linking CXX executable simple_recv
[ 88%] Built target simple_recv
Scanning dependencies of target client
[ 88%] Building CXX object cpp/examples/CMakeFiles/client.dir/client.cpp.o
[ 88%] Linking CXX executable client
[ 88%] Built target client
Scanning dependencies of target server_direct
[ 88%] Building CXX object cpp/examples/CMakeFiles/server_direct.dir/server_direct.cpp.o
[ 89%] Linking CXX executable server_direct
[ 89%] Built target server_direct
Scanning dependencies of target flow_control
[ 89%] Building CXX object cpp/examples/CMakeFiles/flow_control.dir/flow_control.cpp.o
[ 90%] Linking CXX executable flow_control
[ 90%] Built target flow_control
Scanning dependencies of target broker
[ 90%] Building CXX object cpp/examples/CMakeFiles/broker.dir/broker.cpp.o
[ 91%] Linking CXX executable broker
[ 91%] Built target broker
Scanning dependencies of target helloworld
[ 91%] Building CXX object cpp/examples/CMakeFiles/helloworld.dir/helloworld.cpp.o
[ 92%] Linking CXX executable helloworld
[ 92%] Built target helloworld
Scanning dependencies of target colour_send
[ 93%] Building CXX object cpp/examples/CMakeFiles/colour_send.dir/colour_send.cpp.o
[ 93%] Linking CXX executable colour_send
[ 93%] Built target colour_send
Scanning dependencies of target message_properties
[ 93%] Building CXX object cpp/examples/CMakeFiles/message_properties.dir/message_properties.cpp.o
[ 94%] Linking CXX executable message_properties
[ 94%] Built target message_properties
Scanning dependencies of target direct_recv
[ 94%] Building CXX object cpp/examples/CMakeFiles/direct_recv.dir/direct_recv.cpp.o
[ 94%] Linking CXX executable direct_recv
[ 94%] Built target direct_recv
Scanning dependencies of target direct_send
[ 95%] Building CXX object cpp/examples/CMakeFiles/direct_send.dir/direct_send.cpp.o
[ 95%] Linking CXX executable direct_send
[ 95%] Built target direct_send
Scanning dependencies of target ssl
[ 95%] Building CXX object cpp/examples/CMakeFiles/ssl.dir/ssl.cpp.o
[ 96%] Linking CXX executable ssl
[ 96%] Built target ssl
Scanning dependencies of target server
[ 96%] Building CXX object cpp/examples/CMakeFiles/server.dir/server.cpp.o
[ 97%] Linking CXX executable server
[ 97%] Built target server
Scanning dependencies of target queue_browser
[ 97%] Building CXX object cpp/examples/CMakeFiles/queue_browser.dir/queue_browser.cpp.o
[ 97%] Linking CXX executable queue_browser
[ 97%] Built target queue_browser
Scanning dependencies of target go-mod-link
[ 97%] Built target go-mod-link
Scanning dependencies of target go-pkg-link
[ 97%] Built target go-pkg-link
Scanning dependencies of target go-build
warning: "<https://builds.apache.org/job/Qpid-proton-c/ws/build/go/pkg/..."> matched
no packages
[ 97%] Built target go-build
Scanning dependencies of target go_example_electron_broker
../go/examples/electron/broker.go:35:2: cannot find package "github.com/apache/qpid-proton/go/pkg/amqp"
in any of:
	/usr/lib/go-1.10/src/github.com/apache/qpid-proton/go/pkg/amqp (from $GOROOT)
	<https://builds.apache.org/job/Qpid-proton-c/ws/build/go/src/github.com/apache/qpid-proton/go/pkg/amqp>
(from $GOPATH)
../go/examples/electron/broker.go:36:2: cannot find package "github.com/apache/qpid-proton/go/pkg/electron"
in any of:
	/usr/lib/go-1.10/src/github.com/apache/qpid-proton/go/pkg/electron (from $GOROOT)
	<https://builds.apache.org/job/Qpid-proton-c/ws/build/go/src/github.com/apache/qpid-proton/go/pkg/electron>
(from $GOPATH)
go/examples/CMakeFiles/go_example_electron_broker.dir/build.make:57: recipe for target 'go/examples/CMakeFiles/go_example_electron_broker'
failed
make[2]: *** [go/examples/CMakeFiles/go_example_electron_broker] Error 1
CMakeFiles/Makefile2:3824: recipe for target 'go/examples/CMakeFiles/go_example_electron_broker.dir/all'
failed
make[1]: *** [go/examples/CMakeFiles/go_example_electron_broker.dir/all] Error 2
Makefile:140: recipe for target 'all' failed
make: *** [all] Error 2
Build step 'Execute shell' marked build as failure
Recording test results
ERROR: Step ?Publish JUnit test result report? failed: No test report files were found. Configuration
error?

Mime
View raw message