qpid-notifications mailing list archives

Site index · List index
Message view « Date » · « Thread »
Top « Date » · « Thread »
From Apache Jenkins Server <jenk...@builds.apache.org>
Subject Build failed in Jenkins: Qpid-Broker-J-Test-IBMJDK1.8 #2873
Date Tue, 24 Dec 2019 10:26:57 GMT
See <https://builds.apache.org/job/Qpid-Broker-J-Test-IBMJDK1.8/2873/display/redirect>

Changes:


------------------------------------------
[...truncated 601.47 KB...]
[INFO] 
[INFO] --- maven-resources-plugin:3.1.0:resources (default-resources) @ qpid-java-doc-broker
---
[INFO] Using 'UTF-8' encoding to copy filtered resources.
[INFO] Copying 76 resources
[INFO] 
[INFO] --- maven-compiler-plugin:3.7.0:compile (default-compile) @ qpid-java-doc-broker ---
[INFO] No sources to compile
[INFO] 
[INFO] --- maven-resources-plugin:3.1.0:testResources (default-testResources) @ qpid-java-doc-broker
---
[INFO] Using 'UTF-8' encoding to copy filtered resources.
[INFO] Copying 76 resources
[INFO] 
[INFO] --- maven-compiler-plugin:3.7.0:testCompile (default-testCompile) @ qpid-java-doc-broker
---
[INFO] No sources to compile
[INFO] 
[INFO] --- maven-surefire-plugin:2.22.0:test (default-test) @ qpid-java-doc-broker ---
[INFO] No tests to run.
[INFO] 
[INFO] --- maven-jar-plugin:3.1.0:jar (default-jar) @ qpid-java-doc-broker ---
[WARNING] JAR will be empty - no content was marked for inclusion!
[INFO] Building jar: <https://builds.apache.org/job/Qpid-Broker-J-Test-IBMJDK1.8/ws/doc/java-broker/target/qpid-java-doc-broker-8.0.0-SNAPSHOT.jar>
[INFO] 
[INFO] --- maven-site-plugin:3.7.1:attach-descriptor (attach-descriptor) @ qpid-java-doc-broker
---
[INFO] Skipping because packaging 'jar' is not pom.
[INFO] 
[INFO] --- maven-assembly-plugin:3.0.0:single (default) @ qpid-java-doc-broker ---
[INFO] Assemblies have been skipped per configuration of the skipAssembly parameter.
[INFO] 
[INFO] --------------< org.apache.qpid:qpid-java-doc-perftests >---------------
[INFO] Building Apache Qpid Broker-J Performance Test Docbook 8.0.0-SNAPSHOT [47/48]
[INFO] --------------------------------[ jar ]---------------------------------
[INFO] 
[INFO] --- maven-clean-plugin:3.1.0:clean (default-clean) @ qpid-java-doc-perftests ---
[INFO] 
[INFO] --- buildnumber-maven-plugin:1.4:create (default) @ qpid-java-doc-perftests ---
[INFO] Executing: /bin/sh -c cd '<https://builds.apache.org/job/Qpid-Broker-J-Test-IBMJDK1.8/ws/doc/java-perftests'>
&& 'git' 'rev-parse' '--verify' 'HEAD'
[INFO] Working directory: <https://builds.apache.org/job/Qpid-Broker-J-Test-IBMJDK1.8/ws/doc/java-perftests>
[INFO] Storing buildNumber: 016079c70a73644128acdf5afeccd67bd5937754 at timestamp: 1577183185149
[WARNING] Cannot get the branch information from the git repository: 
Detecting the current branch failed: fatal: ref HEAD is not a symbolic ref

[INFO] Executing: /bin/sh -c cd '<https://builds.apache.org/job/Qpid-Broker-J-Test-IBMJDK1.8/ws/doc/java-perftests'>
&& 'git' 'rev-parse' '--verify' 'HEAD'
[INFO] Working directory: <https://builds.apache.org/job/Qpid-Broker-J-Test-IBMJDK1.8/ws/doc/java-perftests>
[INFO] Storing buildScmBranch: UNKNOWN
[INFO] 
[INFO] --- maven-antrun-plugin:1.8:run (output-test-properties) @ qpid-java-doc-perftests
---
[INFO] Executing tasks

main:
     [echo] Qpid Test Profile Properties
     [echo] [profile] java-mms.1-0
     [echo] [profile.broker.version] 1.0
     [echo] [profile.virtualhostnode.type] Memory
     [echo] [profile.virtualhostnode.context.blueprint] {"type":"ProvidedStore","globalAddressDomains":"${qpid.globalAddressDomains}"}
     [echo] [profile.test_receive_timeout] 1000
[INFO] Executed tasks
[INFO] 
[INFO] --- maven-enforcer-plugin:3.0.0-M2:enforce (enforce-maven-version) @ qpid-java-doc-perftests
---
[INFO] 
[INFO] --- maven-enforcer-plugin:3.0.0-M2:enforce (enforce-minimum-versions) @ qpid-java-doc-perftests
---
[INFO] 
[INFO] --- maven-enforcer-plugin:3.0.0-M2:enforce (enforce-versions-standard-properties) @
qpid-java-doc-perftests ---
[INFO] 
[INFO] --- maven-enforcer-plugin:3.0.0-M2:enforce (enforce-enableAmqp0x) @ qpid-java-doc-perftests
---
[INFO] 
[INFO] --- jacoco-maven-plugin:0.8.2:prepare-agent (default-prepare-agent) @ qpid-java-doc-perftests
---
[INFO] argLine set to -javaagent:/home/jenkins/.m2/repository/org/jacoco/org.jacoco.agent/0.8.2/org.jacoco.agent-0.8.2-runtime.jar=destfile=<https://builds.apache.org/job/Qpid-Broker-J-Test-IBMJDK1.8/ws/doc/java-perftests/target/jacoco.exec>
-Xmx512m
[INFO] 
[INFO] --- maven-resources-plugin:3.1.0:copy-resources (filter-docbook-sources) @ qpid-java-doc-perftests
---
[INFO] Using 'UTF-8' encoding to copy filtered resources.
[INFO] Copying 1 resource
[INFO] 
[INFO] --- maven-remote-resources-plugin:1.5:process (process-resource-bundles) @ qpid-java-doc-perftests
---
[INFO] 
[INFO] --- maven-resources-plugin:3.1.0:resources (default-resources) @ qpid-java-doc-perftests
---
[INFO] Using 'UTF-8' encoding to copy filtered resources.
[INFO] Copying 1 resource
[INFO] 
[INFO] --- maven-compiler-plugin:3.7.0:compile (default-compile) @ qpid-java-doc-perftests
---
[INFO] No sources to compile
[INFO] 
[INFO] --- maven-resources-plugin:3.1.0:testResources (default-testResources) @ qpid-java-doc-perftests
---
[INFO] Using 'UTF-8' encoding to copy filtered resources.
[INFO] Copying 1 resource
[INFO] 
[INFO] --- maven-compiler-plugin:3.7.0:testCompile (default-testCompile) @ qpid-java-doc-perftests
---
[INFO] No sources to compile
[INFO] 
[INFO] --- maven-surefire-plugin:2.22.0:test (default-test) @ qpid-java-doc-perftests ---
[INFO] No tests to run.
[INFO] 
[INFO] --- maven-jar-plugin:3.1.0:jar (default-jar) @ qpid-java-doc-perftests ---
[WARNING] JAR will be empty - no content was marked for inclusion!
[INFO] Building jar: <https://builds.apache.org/job/Qpid-Broker-J-Test-IBMJDK1.8/ws/doc/java-perftests/target/qpid-java-doc-perftests-8.0.0-SNAPSHOT.jar>
[INFO] 
[INFO] --- maven-site-plugin:3.7.1:attach-descriptor (attach-descriptor) @ qpid-java-doc-perftests
---
[INFO] Skipping because packaging 'jar' is not pom.
[INFO] 
[INFO] --- maven-assembly-plugin:3.0.0:single (default) @ qpid-java-doc-perftests ---
[INFO] Assemblies have been skipped per configuration of the skipAssembly parameter.
[INFO] 
[INFO] -----------< org.apache.qpid:qpid-broker-j-developer-guide >------------
[INFO] Building Apache Qpid Broker-J Developer Guide 8.0.0-SNAPSHOT     [48/48]
[INFO] --------------------------------[ jar ]---------------------------------
[INFO] 
[INFO] --- maven-clean-plugin:3.1.0:clean (default-clean) @ qpid-broker-j-developer-guide
---
[INFO] 
[INFO] --- buildnumber-maven-plugin:1.4:create (default) @ qpid-broker-j-developer-guide ---
[INFO] Executing: /bin/sh -c cd '<https://builds.apache.org/job/Qpid-Broker-J-Test-IBMJDK1.8/ws/doc/developer-guide'>
&& 'git' 'rev-parse' '--verify' 'HEAD'
[INFO] Working directory: <https://builds.apache.org/job/Qpid-Broker-J-Test-IBMJDK1.8/ws/doc/developer-guide>
[INFO] Storing buildNumber: 016079c70a73644128acdf5afeccd67bd5937754 at timestamp: 1577183185249
[WARNING] Cannot get the branch information from the git repository: 
Detecting the current branch failed: fatal: ref HEAD is not a symbolic ref

[INFO] Executing: /bin/sh -c cd '<https://builds.apache.org/job/Qpid-Broker-J-Test-IBMJDK1.8/ws/doc/developer-guide'>
&& 'git' 'rev-parse' '--verify' 'HEAD'
[INFO] Working directory: <https://builds.apache.org/job/Qpid-Broker-J-Test-IBMJDK1.8/ws/doc/developer-guide>
[INFO] Storing buildScmBranch: UNKNOWN
[INFO] 
[INFO] --- maven-antrun-plugin:1.8:run (output-test-properties) @ qpid-broker-j-developer-guide
---
[INFO] Executing tasks

main:
     [echo] Qpid Test Profile Properties
     [echo] [profile] java-mms.1-0
     [echo] [profile.broker.version] 1.0
     [echo] [profile.virtualhostnode.type] Memory
     [echo] [profile.virtualhostnode.context.blueprint] {"type":"ProvidedStore","globalAddressDomains":"${qpid.globalAddressDomains}"}
     [echo] [profile.test_receive_timeout] 1000
[INFO] Executed tasks
[INFO] 
[INFO] --- maven-enforcer-plugin:3.0.0-M2:enforce (enforce-maven-version) @ qpid-broker-j-developer-guide
---
[INFO] 
[INFO] --- maven-enforcer-plugin:3.0.0-M2:enforce (enforce-minimum-versions) @ qpid-broker-j-developer-guide
---
[INFO] 
[INFO] --- maven-enforcer-plugin:3.0.0-M2:enforce (enforce-versions-standard-properties) @
qpid-broker-j-developer-guide ---
[INFO] 
[INFO] --- maven-enforcer-plugin:3.0.0-M2:enforce (enforce-enableAmqp0x) @ qpid-broker-j-developer-guide
---
[INFO] 
[INFO] --- jacoco-maven-plugin:0.8.2:prepare-agent (default-prepare-agent) @ qpid-broker-j-developer-guide
---
[INFO] argLine set to -javaagent:/home/jenkins/.m2/repository/org/jacoco/org.jacoco.agent/0.8.2/org.jacoco.agent-0.8.2-runtime.jar=destfile=<https://builds.apache.org/job/Qpid-Broker-J-Test-IBMJDK1.8/ws/doc/developer-guide/target/jacoco.exec>
-Xmx512m
[INFO] 
[INFO] --- maven-resources-plugin:3.1.0:copy-resources (filter-docbook-sources) @ qpid-broker-j-developer-guide
---
[INFO] Using 'UTF-8' encoding to copy filtered resources.
[INFO] skip non existing resourceDirectory <https://builds.apache.org/job/Qpid-Broker-J-Test-IBMJDK1.8/ws/doc/developer-guide/src/docbkx>
[INFO] 
[INFO] --- maven-remote-resources-plugin:1.5:process (process-resource-bundles) @ qpid-broker-j-developer-guide
---
[INFO] 
[INFO] --- maven-resources-plugin:3.1.0:resources (default-resources) @ qpid-broker-j-developer-guide
---
[INFO] Using 'UTF-8' encoding to copy filtered resources.
[INFO] skip non existing resourceDirectory <https://builds.apache.org/job/Qpid-Broker-J-Test-IBMJDK1.8/ws/doc/developer-guide/src/docbkx>
[INFO] 
[INFO] --- maven-compiler-plugin:3.7.0:compile (default-compile) @ qpid-broker-j-developer-guide
---
[INFO] No sources to compile
[INFO] 
[INFO] --- maven-resources-plugin:3.1.0:testResources (default-testResources) @ qpid-broker-j-developer-guide
---
[INFO] Using 'UTF-8' encoding to copy filtered resources.
[INFO] skip non existing resourceDirectory <https://builds.apache.org/job/Qpid-Broker-J-Test-IBMJDK1.8/ws/doc/developer-guide/src/docbkx>
[INFO] 
[INFO] --- maven-compiler-plugin:3.7.0:testCompile (default-testCompile) @ qpid-broker-j-developer-guide
---
[INFO] No sources to compile
[INFO] 
[INFO] --- maven-surefire-plugin:2.22.0:test (default-test) @ qpid-broker-j-developer-guide
---
[INFO] No tests to run.
[INFO] 
[INFO] --- maven-jar-plugin:3.1.0:jar (default-jar) @ qpid-broker-j-developer-guide ---
[WARNING] JAR will be empty - no content was marked for inclusion!
[INFO] Building jar: <https://builds.apache.org/job/Qpid-Broker-J-Test-IBMJDK1.8/ws/doc/developer-guide/target/qpid-broker-j-developer-guide-8.0.0-SNAPSHOT.jar>
[INFO] 
[INFO] --- maven-site-plugin:3.7.1:attach-descriptor (attach-descriptor) @ qpid-broker-j-developer-guide
---
[INFO] Skipping because packaging 'jar' is not pom.
[INFO] 
[INFO] --- maven-assembly-plugin:3.0.0:single (default) @ qpid-broker-j-developer-guide ---
[INFO] Assemblies have been skipped per configuration of the skipAssembly parameter.
[INFO] ------------------------------------------------------------------------
[INFO] Reactor Summary for Apache Qpid Broker-J Parent 8.0.0-SNAPSHOT:
[INFO] 
[INFO] Apache Qpid Broker-J Parent ........................ SUCCESS [  4.346 s]
[INFO] Apache Qpid Broker-J Code Generation ............... SUCCESS [  2.794 s]
[INFO] Apache Qpid Broker-J Test Utilities ................ SUCCESS [  0.908 s]
[INFO] Apache Qpid Broker-J Core .......................... SUCCESS [08:50 min]
[INFO] Apache Qpid Broker-J LogBack Logging Plug-in ....... SUCCESS [ 12.712 s]
[INFO] Apache Qpid Broker-J Access Control Plug-in ........ SUCCESS [ 10.782 s]
[INFO] Apache Qpid Broker-J AMQP 0-10 Protocol Plug-in .... SUCCESS [ 11.907 s]
[INFO] Apache Qpid Broker-J AMQP 0-8 Protocol Plug-in ..... SUCCESS [ 11.298 s]
[INFO] Apache Qpid Broker-J AMQP 1-0 Protocol Plug-in ..... SUCCESS [ 40.493 s]
[INFO] Apache Qpid Broker-J AMQP 0-8 to 0-10 Message Conversion Plug-in SUCCESS [  4.201 s]
[INFO] Apache Qpid Broker-J AMQP 0-8 to 1-0 Message Conversion Plug-in SUCCESS [  7.601 s]
[INFO] Apache Qpid Broker-J AMQP 0-10 to 1-0 Message Conversion Plug-in SUCCESS [  7.046 s]
[INFO] Apache Qpid Broker-J JDBC Message Store Plug-in .... SUCCESS [ 58.504 s]
[INFO] Apache Qpid Broker-J Derby Message Store Plug-in ... SUCCESS [  3.324 s]
[INFO] Apache Qpid Broker-J JDBC Message Store Connection Pooling Plug-in SUCCESS [  1.960
s]
[INFO] Apache Qpid Broker-J LogBack JDBC Logging Plug-in .. SUCCESS [ 13.251 s]
[INFO] Apache Qpid AMQP 1.0 JDBC Link Store Plug-in ....... SUCCESS [  7.824 s]
[INFO] Apache Qpid Broker-J HTTP Management Plug-in ....... SUCCESS [ 55.513 s]
[INFO] Apache Qpid Broker-J AMQP Management Protocol Plug-in SUCCESS [  0.454 s]
[INFO] Apache Qpid Broker-J Memory Message Store Plug-in .. SUCCESS [  0.448 s]
[INFO] Apache Qpid Broker-J WebSocket Plug-in ............. SUCCESS [  0.591 s]
[INFO] Apache Qpid Broker-J BDB Message Store Plug-in ..... SUCCESS [  7.502 s]
[INFO] Apache Qpid AMQP 1.0 BDB Link Store Plug-in ........ SUCCESS [  2.323 s]
[INFO] Apache Qpid Broker-J ............................... SUCCESS [  2.611 s]
[INFO] Apache Qpid Broker-J Bundles ....................... SUCCESS [  9.398 s]
[INFO] Apache Qpid Broker-J Tools ......................... SUCCESS [  0.263 s]
[INFO] Apache Qpid Broker-J System Test Parent ............ SUCCESS [  0.095 s]
[INFO] Apache Qpid Broker-J System Test Utils ............. SUCCESS [  0.477 s]
[INFO] Apache Qpid Broker-J JMS System Tests Core ......... SUCCESS [  0.649 s]
[INFO] Apache Qpid Broker-J JMS 1.1 System Tests .......... SUCCESS [  1.984 s]
[INFO] Apache Qpid Broker-J JMS 2.0 System Tests .......... SUCCESS [  0.590 s]
[INFO] Apache Qpid Broker-J HTTP system tests ............. SUCCESS [  1.465 s]
[INFO] Apache Qpid Broker-J Protocol Tests Core ........... SUCCESS [  0.324 s]
[INFO] Apache Qpid Protocol Tests for AMQP 0-8,0-9,0-9-1 .. FAILURE [ 43.991 s]
[INFO] Apache Qpid Protocol Tests for AMQP 0-10 ........... SUCCESS [ 28.390 s]
[INFO] Apache Qpid Protocol Tests for AMQP 1.0 ............ SUCCESS [01:30 min]
[INFO] Apache Qpid Broker-J System Tests Spawn Broker Admin SUCCESS [  1.351 s]
[INFO] Apache Qpid Broker-J End to End Conversion Tests ... SUCCESS [  1.639 s]
[INFO] Apache Qpid Broker-J Performance Tests ............. SUCCESS [ 24.828 s]
[INFO] Apache Qpid Broker-J Performance Test System Tests . SUCCESS [  0.417 s]
[INFO] Apache Qpid Broker-J Performance Tests Visualisation JFC SUCCESS [  6.788 s]
[INFO] Apache Qpid Broker-J BDB Store System Tests ........ SUCCESS [  0.747 s]
[INFO] Apache Qpid Joram JMS Tests ........................ SUCCESS [  0.330 s]
[INFO] Apache Qpid Broker-J JMS TCK Configuration ......... SUCCESS [  0.196 s]
[INFO] Apache Qpid Broker-J Docbook ....................... SUCCESS [  0.067 s]
[INFO] Apache Qpid Broker-J Docbook ....................... SUCCESS [  0.583 s]
[INFO] Apache Qpid Broker-J Performance Test Docbook ...... SUCCESS [  0.099 s]
[INFO] Apache Qpid Broker-J Developer Guide ............... SUCCESS [  0.087 s]
[INFO] ------------------------------------------------------------------------
[INFO] BUILD FAILURE
[INFO] ------------------------------------------------------------------------
[INFO] Total time:  16:54 min
[INFO] Finished at: 2019-12-24T10:26:25Z
[INFO] ------------------------------------------------------------------------
[ERROR] Failed to execute goal org.apache.maven.plugins:maven-surefire-plugin:2.22.0:test
(integration-test) on project protocol-tests-amqp-0-8: There are test failures.
[ERROR] 
[ERROR] Please refer to <https://builds.apache.org/job/Qpid-Broker-J-Test-IBMJDK1.8/2873/artifact/systests/protocol-tests-amqp-0-8/target/surefire-reports/java-mms.1-0>
for the individual test results.
[ERROR] Please refer to dump files (if any exist) [date]-jvmRun[N].dump, [date].dumpstream
and [date]-jvmRun[N].dumpstream.
[ERROR] -> [Help 1]
[ERROR] 
[ERROR] To see the full stack trace of the errors, re-run Maven with the -e switch.
[ERROR] Re-run Maven using the -X switch to enable full debug logging.
[ERROR] 
[ERROR] For more information about the errors and possible solutions, please read the following
articles:
[ERROR] [Help 1] http://cwiki.apache.org/confluence/display/MAVEN/MojoFailureException
[ERROR] 
[ERROR] After correcting the problems, you can resume the build with the command
[ERROR]   mvn <args> -rf :protocol-tests-amqp-0-8
Build step 'Invoke top-level Maven targets' marked build as failure
[locks-and-latches] Releasing all the locks
[locks-and-latches] All the locks released
Archiving artifacts
Recording test results

Mime
View raw message