qpid-notifications mailing list archives

Site index · List index
Message view « Date » · « Thread »
Top « Date » · « Thread »
From Apache Jenkins Server <jenk...@builds.apache.org>
Subject Build failed in Jenkins: Qpid-Broker-J-Checks #1016
Date Tue, 02 Jul 2019 17:36:17 GMT
See <https://builds.apache.org/job/Qpid-Broker-J-Checks/1016/display/redirect?page=changes>

Changes:

[orudyy] QPID-8314: [Broker-J][WMC] Allow selection of all messages displayed in

------------------------------------------
[...truncated 1.52 MB...]
[INFO] --- maven-enforcer-plugin:3.0.0-M2:enforce (enforce-minimum-versions) @ qpid-java-doc-perftests
---
[INFO] Skipping Rule Enforcement.
[INFO] 
[INFO] --- maven-enforcer-plugin:3.0.0-M2:enforce (enforce-versions-standard-properties) @
qpid-java-doc-perftests ---
[INFO] Skipping Rule Enforcement.
[INFO] 
[INFO] --- maven-enforcer-plugin:3.0.0-M2:enforce (enforce-enableAmqp0x) @ qpid-java-doc-perftests
---
[INFO] Skipping Rule Enforcement.
[INFO] 
[INFO] --- jacoco-maven-plugin:0.8.2:prepare-agent (default-prepare-agent) @ qpid-java-doc-perftests
---
[INFO] argLine set to -javaagent:/home/jenkins/jenkins-slave/maven-repositories/1/org/jacoco/org.jacoco.agent/0.8.2/org.jacoco.agent-0.8.2-runtime.jar=destfile=<https://builds.apache.org/job/Qpid-Broker-J-Checks/ws/doc/java-perftests/target/jacoco.exec>
-Xmx512m
[INFO] 
[INFO] --- maven-resources-plugin:3.1.0:copy-resources (filter-docbook-sources) @ qpid-java-doc-perftests
---
[INFO] Using 'UTF-8' encoding to copy filtered resources.
[INFO] Copying 1 resource
[INFO] 
[INFO] --- maven-remote-resources-plugin:1.5:process (process-resource-bundles) @ qpid-java-doc-perftests
---
[INFO] 
[INFO] --- maven-resources-plugin:3.1.0:resources (default-resources) @ qpid-java-doc-perftests
---
[INFO] Using 'UTF-8' encoding to copy filtered resources.
[INFO] Copying 1 resource
[INFO] 
[INFO] --- maven-compiler-plugin:3.7.0:compile (default-compile) @ qpid-java-doc-perftests
---
[INFO] No sources to compile
[INFO] 
[INFO] --- maven-resources-plugin:3.1.0:testResources (default-testResources) @ qpid-java-doc-perftests
---
[INFO] Using 'UTF-8' encoding to copy filtered resources.
[INFO] Copying 1 resource
[INFO] 
[INFO] --- maven-compiler-plugin:3.7.0:testCompile (default-testCompile) @ qpid-java-doc-perftests
---
[INFO] No sources to compile
[INFO] 
[INFO] --- maven-surefire-plugin:2.22.0:test (default-test) @ qpid-java-doc-perftests ---
[INFO] Tests are skipped.
[INFO] 
[INFO] --- license-maven-plugin:1.8:add-third-party (check-third-party-licensing) @ qpid-java-doc-perftests
---
[INFO] Included licenses (whitelist): [Apache Software License, Version 2.0, The MIT License,
BSD License, Eclipse Public License - Version 1.0, Common Public License Version 1.0, Academic
Free License v2.1, COMMON DEVELOPMENT AND DISTRIBUTION LICENSE (CDDL) Version 1.0, Public
Domain]
[INFO] Writing third-party file to <https://builds.apache.org/job/Qpid-Broker-J-Checks/ws/doc/java-perftests/target/license-maven-plugin/THIRD-PARTY.txt>
[INFO] 
[INFO] --- maven-antrun-plugin:1.8:run (dependency-change-verification) @ qpid-java-doc-perftests
---
[INFO] Executing tasks

main:
[INFO] Executed tasks
[INFO] 
[INFO] --- maven-jar-plugin:3.1.0:jar (default-jar) @ qpid-java-doc-perftests ---
[WARNING] JAR will be empty - no content was marked for inclusion!
[INFO] Building jar: <https://builds.apache.org/job/Qpid-Broker-J-Checks/ws/doc/java-perftests/target/qpid-java-doc-perftests-8.0.0-SNAPSHOT.jar>
[INFO] 
[INFO] --- maven-site-plugin:3.7.1:attach-descriptor (attach-descriptor) @ qpid-java-doc-perftests
---
[INFO] Skipping because packaging 'jar' is not pom.
[INFO] 
[INFO] --- maven-assembly-plugin:3.0.0:single (default) @ qpid-java-doc-perftests ---
[INFO] Assemblies have been skipped per configuration of the skipAssembly parameter.
[INFO] 
[INFO] --- maven-assembly-plugin:3.0.0:single (source-release-assembly) @ qpid-java-doc-perftests
---
[INFO] Assemblies have been skipped per configuration of the skipAssembly parameter.
[INFO] 
[INFO] --- maven-source-plugin:3.0.1:jar-no-fork (attach-sources) @ qpid-java-doc-perftests
---
[INFO] Building jar: <https://builds.apache.org/job/Qpid-Broker-J-Checks/ws/doc/java-perftests/target/qpid-java-doc-perftests-8.0.0-SNAPSHOT-sources.jar>
[INFO] 
[INFO] --- maven-javadoc-plugin:3.0.1:jar (attach-javadocs) @ qpid-java-doc-perftests ---
[INFO] 
[INFO] --- maven-gpg-plugin:1.6:sign (sign-release-artifacts) @ qpid-java-doc-perftests ---
[INFO] 
[INFO] --- checksum-maven-plugin:1.7:files (source-release-checksum) @ qpid-java-doc-perftests
---
[JENKINS] Archiving disabled
[JENKINS] Archiving disabled
[JENKINS] Archiving disabled
[JENKINS] Archiving disabled
[JENKINS] Archiving disabled
[JENKINS] Archiving disabled
[JENKINS] Archiving disabled
[JENKINS] Archiving disabled
[JENKINS] Archiving disabled
[JENKINS] Archiving disabled
[JENKINS] Archiving disabled
[JENKINS] Archiving disabled
[JENKINS] Archiving disabled
[JENKINS] Archiving disabled
[JENKINS] Archiving disabled
[JENKINS] Archiving disabled
[JENKINS] Archiving disabled
[JENKINS] Archiving disabled
[JENKINS] Archiving disabled
[JENKINS] Archiving disabled
[JENKINS] Archiving disabled
[JENKINS] Archiving disabled
[JENKINS] Archiving disabled
[JENKINS] Archiving disabled
[JENKINS] Archiving disabled
[JENKINS] Archiving disabled
[JENKINS] Archiving disabled
[JENKINS] Archiving disabled
[JENKINS] Archiving disabled
[JENKINS] Archiving disabled
[JENKINS] Archiving disabled
[JENKINS] Archiving disabled
[JENKINS] Archiving disabled
[JENKINS] Archiving disabled
[JENKINS] Archiving disabled
[JENKINS] Archiving disabled
[JENKINS] Archiving disabled
[JENKINS] Archiving disabled
[JENKINS] Archiving disabled
[JENKINS] Archiving disabled
[JENKINS] Archiving disabled
[JENKINS] Archiving disabled
[JENKINS] Archiving disabled
[JENKINS] Archiving disabled
[JENKINS] Archiving disabled
[JENKINS] Archiving disabled
[JENKINS] Archiving disabled
[INFO] ------------------------------------------------------------------------
[INFO] Reactor Summary for Apache Qpid Broker-J Parent 8.0.0-SNAPSHOT:
[INFO] 
[INFO] Apache Qpid Broker-J Parent ........................ SUCCESS [ 16.829 s]
[INFO] Apache Qpid Broker-J Code Generation ............... SUCCESS [  9.225 s]
[INFO] Apache Qpid Broker-J Test Utilities ................ SUCCESS [  7.492 s]
[INFO] Apache Qpid Broker-J Core .......................... SUCCESS [ 38.755 s]
[INFO] Apache Qpid Broker-J LogBack Logging Plug-in ....... SUCCESS [ 15.457 s]
[INFO] Apache Qpid Broker-J Access Control Plug-in ........ SUCCESS [  8.761 s]
[INFO] Apache Qpid Broker-J AMQP 0-10 Protocol Plug-in .... SUCCESS [ 11.742 s]
[INFO] Apache Qpid Broker-J AMQP 0-8 Protocol Plug-in ..... SUCCESS [ 12.601 s]
[INFO] Apache Qpid Broker-J AMQP 1-0 Protocol Plug-in ..... SUCCESS [ 13.948 s]
[INFO] Apache Qpid Broker-J AMQP 0-8 to 0-10 Message Conversion Plug-in SUCCESS [  6.420 s]
[INFO] Apache Qpid Broker-J AMQP 0-8 to 1-0 Message Conversion Plug-in SUCCESS [  6.386 s]
[INFO] Apache Qpid Broker-J AMQP 0-10 to 1-0 Message Conversion Plug-in SUCCESS [  6.399 s]
[INFO] Apache Qpid Broker-J JDBC Message Store Plug-in .... SUCCESS [  9.041 s]
[INFO] Apache Qpid Broker-J Derby Message Store Plug-in ... SUCCESS [  7.997 s]
[INFO] Apache Qpid Broker-J JDBC Message Store Connection Pooling Plug-in SUCCESS [  6.394
s]
[INFO] Apache Qpid AMQP 1.0 JDBC Link Store Plug-in ....... SUCCESS [  6.483 s]
[INFO] Apache Qpid Broker-J HTTP Management Plug-in ....... FAILURE [  1.019 s]
[INFO] Apache Qpid Broker-J AMQP Management Protocol Plug-in SUCCESS [  6.867 s]
[INFO] Apache Qpid Broker-J Memory Message Store Plug-in .. SUCCESS [  7.233 s]
[INFO] Apache Qpid Broker-J WebSocket Plug-in ............. SUCCESS [  6.457 s]
[INFO] Apache Qpid Broker-J BDB Message Store Plug-in ..... SUCCESS [ 11.035 s]
[INFO] Apache Qpid AMQP 1.0 BDB Link Store Plug-in ........ SUCCESS [  6.525 s]
[INFO] Apache Qpid Broker-J ............................... SKIPPED
[INFO] Apache Qpid Broker-J Bundles ....................... SKIPPED
[INFO] Apache Qpid Broker-J Tools ......................... SUCCESS [  6.366 s]
[INFO] Apache Qpid Broker-J System Test Parent ............ SUCCESS [  3.617 s]
[INFO] Apache Qpid Broker-J System Test Utils ............. SUCCESS [  5.621 s]
[INFO] Apache Qpid Broker-J JMS System Tests Core ......... SUCCESS [  5.761 s]
[INFO] Apache Qpid Broker-J JMS 1.1 System Tests .......... SUCCESS [  8.086 s]
[INFO] Apache Qpid Broker-J JMS 2.0 System Tests .......... SUCCESS [  5.986 s]
[INFO] Apache Qpid Broker-J HTTP system tests ............. SKIPPED
[INFO] Apache Qpid Broker-J Protocol Tests Core ........... SUCCESS [  5.215 s]
[INFO] Apache Qpid Protocol Tests for AMQP 0-8,0-9,0-9-1 .. SUCCESS [  6.567 s]
[INFO] Apache Qpid Protocol Tests for AMQP 0-10 ........... SUCCESS [  5.643 s]
[INFO] Apache Qpid Protocol Tests for AMQP 1.0 ............ SUCCESS [  7.782 s]
[INFO] Apache Qpid Broker-J System Tests Spawn Broker Admin SKIPPED
[INFO] Apache Qpid Broker-J End to End Conversion Tests ... SKIPPED
[INFO] Apache Qpid Broker-J Performance Tests ............. SUCCESS [ 13.372 s]
[INFO] Apache Qpid Broker-J Performance Test System Tests . SKIPPED
[INFO] Apache Qpid Broker-J Performance Tests Visualisation JFC SUCCESS [ 12.526 s]
[INFO] Apache Qpid Broker-J BDB Store System Tests ........ SKIPPED
[INFO] Apache Qpid Joram JMS Tests ........................ SUCCESS [  6.449 s]
[INFO] Apache Qpid Broker-J JMS TCK Configuration ......... SUCCESS [  6.363 s]
[INFO] Apache Qpid Broker-J Docbook ....................... SUCCESS [  3.589 s]
[INFO] Apache Qpid Broker-J Docbook ....................... SUCCESS [  5.457 s]
[INFO] Apache Qpid Broker-J Performance Test Docbook ...... SUCCESS [  4.936 s]
[INFO] ------------------------------------------------------------------------
[INFO] BUILD FAILURE
[INFO] ------------------------------------------------------------------------
[INFO] Total time:  08:16 min
[INFO] Finished at: 2019-07-02T17:35:54Z
[INFO] ------------------------------------------------------------------------
Waiting for Jenkins to finish collecting data[ERROR] Failed to execute goal org.apache.rat:apache-rat-plugin:0.12:check
(default-cli) on project qpid-broker-plugins-management-http: Too many files with unapproved
license: 1 See RAT report in: <https://builds.apache.org/job/Qpid-Broker-J-Checks/ws/broker-plugins/management-http/target/rat.txt>
-> [Help 1]
org.apache.maven.lifecycle.LifecycleExecutionException: Failed to execute goal org.apache.rat:apache-rat-plugin:0.12:check
(default-cli) on project qpid-broker-plugins-management-http: Too many files with unapproved
license: 1 See RAT report in: <https://builds.apache.org/job/Qpid-Broker-J-Checks/ws/broker-plugins/management-http/target/rat.txt>
    at org.apache.maven.lifecycle.internal.MojoExecutor.execute (MojoExecutor.java:215)
    at org.apache.maven.lifecycle.internal.MojoExecutor.execute (MojoExecutor.java:156)
    at org.apache.maven.lifecycle.internal.MojoExecutor.execute (MojoExecutor.java:148)
    at org.apache.maven.lifecycle.internal.LifecycleModuleBuilder.buildProject (LifecycleModuleBuilder.java:117)
    at org.apache.maven.lifecycle.internal.LifecycleModuleBuilder.buildProject (LifecycleModuleBuilder.java:81)
    at org.apache.maven.lifecycle.internal.builder.singlethreaded.SingleThreadedBuilder.build
(SingleThreadedBuilder.java:56)
    at org.apache.maven.lifecycle.internal.LifecycleStarter.execute (LifecycleStarter.java:128)
    at org.apache.maven.DefaultMaven.doExecute (DefaultMaven.java:305)
    at org.apache.maven.DefaultMaven.doExecute (DefaultMaven.java:192)
    at org.apache.maven.DefaultMaven.execute (DefaultMaven.java:105)
    at org.jvnet.hudson.maven3.launcher.Maven35Launcher.main (Maven35Launcher.java:130)
    at sun.reflect.NativeMethodAccessorImpl.invoke0 (Native Method)
    at sun.reflect.NativeMethodAccessorImpl.invoke (NativeMethodAccessorImpl.java:62)
    at sun.reflect.DelegatingMethodAccessorImpl.invoke (DelegatingMethodAccessorImpl.java:43)
    at java.lang.reflect.Method.invoke (Method.java:498)
    at org.codehaus.plexus.classworlds.launcher.Launcher.launchEnhanced (Launcher.java:289)
    at org.codehaus.plexus.classworlds.launcher.Launcher.launch (Launcher.java:229)
    at jenkins.maven3.agent.Maven35Main.launch (Maven35Main.java:176)
    at sun.reflect.NativeMethodAccessorImpl.invoke0 (Native Method)
    at sun.reflect.NativeMethodAccessorImpl.invoke (NativeMethodAccessorImpl.java:62)
    at sun.reflect.DelegatingMethodAccessorImpl.invoke (DelegatingMethodAccessorImpl.java:43)
    at java.lang.reflect.Method.invoke (Method.java:498)
    at hudson.maven.Maven3Builder.call (Maven3Builder.java:139)
    at hudson.maven.Maven3Builder.call (Maven3Builder.java:70)
    at hudson.remoting.UserRequest.perform (UserRequest.java:212)
    at hudson.remoting.UserRequest.perform (UserRequest.java:54)
    at hudson.remoting.Request$2.run (Request.java:369)
    at hudson.remoting.InterceptingExecutorService$1.call (InterceptingExecutorService.java:72)
    at java.util.concurrent.FutureTask.run (FutureTask.java:266)
    at java.util.concurrent.ThreadPoolExecutor.runWorker (ThreadPoolExecutor.java:1149)
    at java.util.concurrent.ThreadPoolExecutor$Worker.run (ThreadPoolExecutor.java:624)
    at java.lang.Thread.run (Thread.java:748)
Caused by: org.apache.rat.mp.RatCheckException: Too many files with unapproved license: 1
See RAT report in: <https://builds.apache.org/job/Qpid-Broker-J-Checks/ws/broker-plugins/management-http/target/rat.txt>
    at org.apache.rat.mp.RatCheckMojo.check (RatCheckMojo.java:183)
    at org.apache.rat.mp.RatCheckMojo.execute (RatCheckMojo.java:156)
    at org.apache.maven.plugin.DefaultBuildPluginManager.executeMojo (DefaultBuildPluginManager.java:137)
    at org.apache.maven.lifecycle.internal.MojoExecutor.execute (MojoExecutor.java:210)
    at org.apache.maven.lifecycle.internal.MojoExecutor.execute (MojoExecutor.java:156)
    at org.apache.maven.lifecycle.internal.MojoExecutor.execute (MojoExecutor.java:148)
    at org.apache.maven.lifecycle.internal.LifecycleModuleBuilder.buildProject (LifecycleModuleBuilder.java:117)
    at org.apache.maven.lifecycle.internal.LifecycleModuleBuilder.buildProject (LifecycleModuleBuilder.java:81)
    at org.apache.maven.lifecycle.internal.builder.singlethreaded.SingleThreadedBuilder.build
(SingleThreadedBuilder.java:56)
    at org.apache.maven.lifecycle.internal.LifecycleStarter.execute (LifecycleStarter.java:128)
    at org.apache.maven.DefaultMaven.doExecute (DefaultMaven.java:305)
    at org.apache.maven.DefaultMaven.doExecute (DefaultMaven.java:192)
    at org.apache.maven.DefaultMaven.execute (DefaultMaven.java:105)
    at org.jvnet.hudson.maven3.launcher.Maven35Launcher.main (Maven35Launcher.java:130)
    at sun.reflect.NativeMethodAccessorImpl.invoke0 (Native Method)
    at sun.reflect.NativeMethodAccessorImpl.invoke (NativeMethodAccessorImpl.java:62)
    at sun.reflect.DelegatingMethodAccessorImpl.invoke (DelegatingMethodAccessorImpl.java:43)
    at java.lang.reflect.Method.invoke (Method.java:498)
    at org.codehaus.plexus.classworlds.launcher.Launcher.launchEnhanced (Launcher.java:289)
    at org.codehaus.plexus.classworlds.launcher.Launcher.launch (Launcher.java:229)
    at jenkins.maven3.agent.Maven35Main.launch (Maven35Main.java:176)
    at sun.reflect.NativeMethodAccessorImpl.invoke0 (Native Method)
    at sun.reflect.NativeMethodAccessorImpl.invoke (NativeMethodAccessorImpl.java:62)
    at sun.reflect.DelegatingMethodAccessorImpl.invoke (DelegatingMethodAccessorImpl.java:43)
    at java.lang.reflect.Method.invoke (Method.java:498)
    at hudson.maven.Maven3Builder.call (Maven3Builder.java:139)
    at hudson.maven.Maven3Builder.call (Maven3Builder.java:70)
    at hudson.remoting.UserRequest.perform (UserRequest.java:212)
    at hudson.remoting.UserRequest.perform (UserRequest.java:54)
    at hudson.remoting.Request$2.run (Request.java:369)
    at hudson.remoting.InterceptingExecutorService$1.call (InterceptingExecutorService.java:72)
    at java.util.concurrent.FutureTask.run (FutureTask.java:266)
    at java.util.concurrent.ThreadPoolExecutor.runWorker (ThreadPoolExecutor.java:1149)
    at java.util.concurrent.ThreadPoolExecutor$Worker.run (ThreadPoolExecutor.java:624)
    at java.lang.Thread.run (Thread.java:748)
[ERROR] 
[ERROR] Re-run Maven using the -X switch to enable full debug logging.
[ERROR] 
[ERROR] For more information about the errors and possible solutions, please read the following
articles:
[ERROR] [Help 1] http://cwiki.apache.org/confluence/display/MAVEN/MojoFailureException
[ERROR] 
[ERROR] After correcting the problems, you can resume the build with the command
[ERROR]   mvn <goals> -rf :qpid-broker-plugins-management-http

channel stopped
Archiving artifacts

Mime
View raw message