qpid-notifications mailing list archives

Site index · List index
Message view « Date » · « Thread »
Top « Date » · « Thread »
From Apache Jenkins Server <jenk...@builds.apache.org>
Subject Build failed in Jenkins: Qpid-Broker-J-7.1.x-TestMatrix » ubuntu&&!H25,JDK 1.8 (latest),java-bdb.1-0 #3
Date Mon, 24 Dec 2018 14:20:30 GMT
See <https://builds.apache.org/job/Qpid-Broker-J-7.1.x-TestMatrix/Ubuntu%20Slaves=ubuntu&&!H25,jdk=JDK%201.8%20(latest),profile=java-bdb.1-0/3/display/redirect?page=changes>

Changes:

[orudyy] [maven-release-plugin] prepare release 7.1.0

[orudyy] [maven-release-plugin] prepare for next development iteration

------------------------------------------
[...truncated 540.19 KB...]
[INFO] 
[INFO] --- maven-enforcer-plugin:3.0.0-M2:enforce (enforce-maven-version) @ qpid-java-doc
---
[INFO] 
[INFO] --- maven-enforcer-plugin:3.0.0-M2:enforce (enforce-minimum-versions) @ qpid-java-doc
---
[INFO] 
[INFO] --- maven-enforcer-plugin:3.0.0-M2:enforce (enforce-versions-standard-properties) @
qpid-java-doc ---
[INFO] 
[INFO] --- maven-enforcer-plugin:3.0.0-M2:enforce (enforce-enableAmqp0x) @ qpid-java-doc ---
[INFO] 
[INFO] --- jacoco-maven-plugin:0.8.2:prepare-agent (default-prepare-agent) @ qpid-java-doc
---
[INFO] argLine set to "-javaagent:/home/jenkins/.m2/repository/org/jacoco/org.jacoco.agent/0.8.2/org.jacoco.agent-0.8.2-runtime.jar=destfile=<https://builds.apache.org/job/Qpid-Broker-J-7.1.x-TestMatrix/Ubuntu%20Slaves=ubuntu&&!H25,jdk=JDK%201.8%20(latest),profile=java-bdb.1-0/ws/doc/target/jacoco.exec">
-Xmx512m
[INFO] 
[INFO] --- maven-remote-resources-plugin:1.5:process (process-resource-bundles) @ qpid-java-doc
---
[INFO] 
[INFO] --- maven-site-plugin:3.7.1:attach-descriptor (attach-descriptor) @ qpid-java-doc ---
[INFO] No site descriptor found: nothing to attach.
[INFO] 
[INFO] --- maven-assembly-plugin:3.0.0:single (default) @ qpid-java-doc ---
[INFO] Assemblies have been skipped per configuration of the skipAssembly parameter.
[INFO] 
[INFO] ----------------< org.apache.qpid:qpid-java-doc-broker >----------------
[INFO] Building Apache Qpid Broker-J Docbook 7.1.1-SNAPSHOT             [45/46]
[INFO] --------------------------------[ jar ]---------------------------------
[INFO] 
[INFO] --- maven-clean-plugin:3.1.0:clean (default-clean) @ qpid-java-doc-broker ---
[INFO] 
[INFO] --- buildnumber-maven-plugin:1.4:create (default) @ qpid-java-doc-broker ---
[INFO] Executing: /bin/sh -c cd '<https://builds.apache.org/job/Qpid-Broker-J-7.1.x-TestMatrix/Ubuntu%20Slaves=ubuntu&&!H25,jdk=JDK%201.8%20(latest),profile=java-bdb.1-0/ws/doc/java-broker'>
&& 'git' 'rev-parse' '--verify' 'HEAD'
[INFO] Working directory: <https://builds.apache.org/job/Qpid-Broker-J-7.1.x-TestMatrix/Ubuntu%20Slaves=ubuntu&&!H25,jdk=JDK%201.8%20(latest),profile=java-bdb.1-0/ws/doc/java-broker>
[INFO] Storing buildNumber: 3cb16f88c878bc592df0824a2702127a8419dfa5 at timestamp: 1545660956148
[WARNING] Cannot get the branch information from the git repository: 
Detecting the current branch failed: fatal: ref HEAD is not a symbolic ref

[INFO] Executing: /bin/sh -c cd '<https://builds.apache.org/job/Qpid-Broker-J-7.1.x-TestMatrix/Ubuntu%20Slaves=ubuntu&&!H25,jdk=JDK%201.8%20(latest),profile=java-bdb.1-0/ws/doc/java-broker'>
&& 'git' 'rev-parse' '--verify' 'HEAD'
[INFO] Working directory: <https://builds.apache.org/job/Qpid-Broker-J-7.1.x-TestMatrix/Ubuntu%20Slaves=ubuntu&&!H25,jdk=JDK%201.8%20(latest),profile=java-bdb.1-0/ws/doc/java-broker>
[INFO] Storing buildScmBranch: UNKNOWN
[INFO] 
[INFO] --- maven-antrun-plugin:1.8:run (output-test-properties) @ qpid-java-doc-broker ---
[INFO] Executing tasks

main:
     [echo] Qpid Test Profile Properties
     [echo] [profile] java-bdb.1-0
     [echo] [profile.broker.version] 1.0
     [echo] [profile.virtualhostnode.type] BDB
     [echo] [profile.virtualhostnode.context.blueprint] {"type":"ProvidedStore","globalAddressDomains":"${qpid.globalAddressDomains}"}
     [echo] [profile.test_receive_timeout] 3000
[INFO] Executed tasks
[INFO] 
[INFO] --- maven-enforcer-plugin:3.0.0-M2:enforce (enforce-maven-version) @ qpid-java-doc-broker
---
[INFO] 
[INFO] --- maven-enforcer-plugin:3.0.0-M2:enforce (enforce-minimum-versions) @ qpid-java-doc-broker
---
[INFO] 
[INFO] --- maven-enforcer-plugin:3.0.0-M2:enforce (enforce-versions-standard-properties) @
qpid-java-doc-broker ---
[INFO] 
[INFO] --- maven-enforcer-plugin:3.0.0-M2:enforce (enforce-enableAmqp0x) @ qpid-java-doc-broker
---
[INFO] 
[INFO] --- jacoco-maven-plugin:0.8.2:prepare-agent (default-prepare-agent) @ qpid-java-doc-broker
---
[INFO] argLine set to "-javaagent:/home/jenkins/.m2/repository/org/jacoco/org.jacoco.agent/0.8.2/org.jacoco.agent-0.8.2-runtime.jar=destfile=<https://builds.apache.org/job/Qpid-Broker-J-7.1.x-TestMatrix/Ubuntu%20Slaves=ubuntu&&!H25,jdk=JDK%201.8%20(latest),profile=java-bdb.1-0/ws/doc/java-broker/target/jacoco.exec">
-Xmx512m
[INFO] 
[INFO] --- maven-resources-plugin:3.1.0:copy-resources (filter-docbook-sources) @ qpid-java-doc-broker
---
[INFO] Using 'UTF-8' encoding to copy filtered resources.
[INFO] Copying 76 resources
[INFO] 
[INFO] --- maven-remote-resources-plugin:1.5:process (process-resource-bundles) @ qpid-java-doc-broker
---
[INFO] 
[INFO] --- maven-resources-plugin:3.1.0:resources (default-resources) @ qpid-java-doc-broker
---
[INFO] Using 'UTF-8' encoding to copy filtered resources.
[INFO] Copying 76 resources
[INFO] 
[INFO] --- maven-compiler-plugin:3.7.0:compile (default-compile) @ qpid-java-doc-broker ---
[INFO] No sources to compile
[INFO] 
[INFO] --- maven-resources-plugin:3.1.0:testResources (default-testResources) @ qpid-java-doc-broker
---
[INFO] Using 'UTF-8' encoding to copy filtered resources.
[INFO] Copying 76 resources
[INFO] 
[INFO] --- maven-compiler-plugin:3.7.0:testCompile (default-testCompile) @ qpid-java-doc-broker
---
[INFO] No sources to compile
[INFO] 
[INFO] --- maven-surefire-plugin:2.22.0:test (default-test) @ qpid-java-doc-broker ---
[INFO] Tests are skipped.
[INFO] 
[INFO] --- maven-jar-plugin:3.1.0:jar (default-jar) @ qpid-java-doc-broker ---
[WARNING] JAR will be empty - no content was marked for inclusion!
[INFO] Building jar: <https://builds.apache.org/job/Qpid-Broker-J-7.1.x-TestMatrix/Ubuntu%20Slaves=ubuntu&&!H25,jdk=JDK%201.8%20(latest),profile=java-bdb.1-0/ws/doc/java-broker/target/qpid-java-doc-broker-7.1.1-SNAPSHOT.jar>
[INFO] 
[INFO] --- maven-site-plugin:3.7.1:attach-descriptor (attach-descriptor) @ qpid-java-doc-broker
---
[INFO] Skipping because packaging 'jar' is not pom.
[INFO] 
[INFO] --- maven-assembly-plugin:3.0.0:single (default) @ qpid-java-doc-broker ---
[INFO] Assemblies have been skipped per configuration of the skipAssembly parameter.
[INFO] 
[INFO] --------------< org.apache.qpid:qpid-java-doc-perftests >---------------
[INFO] Building Apache Qpid Broker-J Performance Test Docbook 7.1.1-SNAPSHOT [46/46]
[INFO] --------------------------------[ jar ]---------------------------------
[INFO] 
[INFO] --- maven-clean-plugin:3.1.0:clean (default-clean) @ qpid-java-doc-perftests ---
[INFO] 
[INFO] --- buildnumber-maven-plugin:1.4:create (default) @ qpid-java-doc-perftests ---
[INFO] Executing: /bin/sh -c cd '<https://builds.apache.org/job/Qpid-Broker-J-7.1.x-TestMatrix/Ubuntu%20Slaves=ubuntu&&!H25,jdk=JDK%201.8%20(latest),profile=java-bdb.1-0/ws/doc/java-perftests'>
&& 'git' 'rev-parse' '--verify' 'HEAD'
[INFO] Working directory: <https://builds.apache.org/job/Qpid-Broker-J-7.1.x-TestMatrix/Ubuntu%20Slaves=ubuntu&&!H25,jdk=JDK%201.8%20(latest),profile=java-bdb.1-0/ws/doc/java-perftests>
[INFO] Storing buildNumber: 3cb16f88c878bc592df0824a2702127a8419dfa5 at timestamp: 1545660957143
[WARNING] Cannot get the branch information from the git repository: 
Detecting the current branch failed: fatal: ref HEAD is not a symbolic ref

[INFO] Executing: /bin/sh -c cd '<https://builds.apache.org/job/Qpid-Broker-J-7.1.x-TestMatrix/Ubuntu%20Slaves=ubuntu&&!H25,jdk=JDK%201.8%20(latest),profile=java-bdb.1-0/ws/doc/java-perftests'>
&& 'git' 'rev-parse' '--verify' 'HEAD'
[INFO] Working directory: <https://builds.apache.org/job/Qpid-Broker-J-7.1.x-TestMatrix/Ubuntu%20Slaves=ubuntu&&!H25,jdk=JDK%201.8%20(latest),profile=java-bdb.1-0/ws/doc/java-perftests>
[INFO] Storing buildScmBranch: UNKNOWN
[INFO] 
[INFO] --- maven-antrun-plugin:1.8:run (output-test-properties) @ qpid-java-doc-perftests
---
[INFO] Executing tasks

main:
     [echo] Qpid Test Profile Properties
     [echo] [profile] java-bdb.1-0
     [echo] [profile.broker.version] 1.0
     [echo] [profile.virtualhostnode.type] BDB
     [echo] [profile.virtualhostnode.context.blueprint] {"type":"ProvidedStore","globalAddressDomains":"${qpid.globalAddressDomains}"}
     [echo] [profile.test_receive_timeout] 3000
[INFO] Executed tasks
[INFO] 
[INFO] --- maven-enforcer-plugin:3.0.0-M2:enforce (enforce-maven-version) @ qpid-java-doc-perftests
---
[INFO] 
[INFO] --- maven-enforcer-plugin:3.0.0-M2:enforce (enforce-minimum-versions) @ qpid-java-doc-perftests
---
[INFO] 
[INFO] --- maven-enforcer-plugin:3.0.0-M2:enforce (enforce-versions-standard-properties) @
qpid-java-doc-perftests ---
[INFO] 
[INFO] --- maven-enforcer-plugin:3.0.0-M2:enforce (enforce-enableAmqp0x) @ qpid-java-doc-perftests
---
[INFO] 
[INFO] --- jacoco-maven-plugin:0.8.2:prepare-agent (default-prepare-agent) @ qpid-java-doc-perftests
---
[INFO] argLine set to "-javaagent:/home/jenkins/.m2/repository/org/jacoco/org.jacoco.agent/0.8.2/org.jacoco.agent-0.8.2-runtime.jar=destfile=<https://builds.apache.org/job/Qpid-Broker-J-7.1.x-TestMatrix/Ubuntu%20Slaves=ubuntu&&!H25,jdk=JDK%201.8%20(latest),profile=java-bdb.1-0/ws/doc/java-perftests/target/jacoco.exec">
-Xmx512m
[INFO] 
[INFO] --- maven-resources-plugin:3.1.0:copy-resources (filter-docbook-sources) @ qpid-java-doc-perftests
---
[INFO] Using 'UTF-8' encoding to copy filtered resources.
[INFO] Copying 1 resource
[INFO] 
[INFO] --- maven-remote-resources-plugin:1.5:process (process-resource-bundles) @ qpid-java-doc-perftests
---
[INFO] 
[INFO] --- maven-resources-plugin:3.1.0:resources (default-resources) @ qpid-java-doc-perftests
---
[INFO] Using 'UTF-8' encoding to copy filtered resources.
[INFO] Copying 1 resource
[INFO] 
[INFO] --- maven-compiler-plugin:3.7.0:compile (default-compile) @ qpid-java-doc-perftests
---
[INFO] No sources to compile
[INFO] 
[INFO] --- maven-resources-plugin:3.1.0:testResources (default-testResources) @ qpid-java-doc-perftests
---
[INFO] Using 'UTF-8' encoding to copy filtered resources.
[INFO] Copying 1 resource
[INFO] 
[INFO] --- maven-compiler-plugin:3.7.0:testCompile (default-testCompile) @ qpid-java-doc-perftests
---
[INFO] No sources to compile
[INFO] 
[INFO] --- maven-surefire-plugin:2.22.0:test (default-test) @ qpid-java-doc-perftests ---
[INFO] Tests are skipped.
[INFO] 
[INFO] --- maven-jar-plugin:3.1.0:jar (default-jar) @ qpid-java-doc-perftests ---
[WARNING] JAR will be empty - no content was marked for inclusion!
[INFO] Building jar: <https://builds.apache.org/job/Qpid-Broker-J-7.1.x-TestMatrix/Ubuntu%20Slaves=ubuntu&&!H25,jdk=JDK%201.8%20(latest),profile=java-bdb.1-0/ws/doc/java-perftests/target/qpid-java-doc-perftests-7.1.1-SNAPSHOT.jar>
[INFO] 
[INFO] --- maven-site-plugin:3.7.1:attach-descriptor (attach-descriptor) @ qpid-java-doc-perftests
---
[INFO] Skipping because packaging 'jar' is not pom.
[INFO] 
[INFO] --- maven-assembly-plugin:3.0.0:single (default) @ qpid-java-doc-perftests ---
[INFO] Assemblies have been skipped per configuration of the skipAssembly parameter.
[INFO] ------------------------------------------------------------------------
[INFO] Reactor Summary:
[INFO] 
[INFO] Apache Qpid Broker-J Parent 7.1.1-SNAPSHOT ......... SUCCESS [  6.496 s]
[INFO] Apache Qpid Broker-J Code Generation ............... SUCCESS [  3.643 s]
[INFO] Apache Qpid Broker-J Test Utilities ................ SUCCESS [  0.966 s]
[INFO] Apache Qpid Broker-J Core .......................... SUCCESS [ 19.714 s]
[INFO] Apache Qpid Broker-J LogBack Logging Plug-in ....... SUCCESS [  2.170 s]
[INFO] Apache Qpid Broker-J Access Control Plug-in ........ SUCCESS [  1.260 s]
[INFO] Apache Qpid Broker-J AMQP 0-10 Protocol Plug-in .... SUCCESS [  1.759 s]
[INFO] Apache Qpid Broker-J AMQP 0-8 Protocol Plug-in ..... SUCCESS [  1.910 s]
[INFO] Apache Qpid Broker-J AMQP 1-0 Protocol Plug-in ..... SUCCESS [  3.471 s]
[INFO] Apache Qpid Broker-J AMQP 0-8 to 0-10 Message Conversion Plug-in SUCCESS [  0.679 s]
[INFO] Apache Qpid Broker-J AMQP 0-8 to 1-0 Message Conversion Plug-in SUCCESS [  0.632 s]
[INFO] Apache Qpid Broker-J AMQP 0-10 to 1-0 Message Conversion Plug-in SUCCESS [  0.587 s]
[INFO] Apache Qpid Broker-J JDBC Message Store Plug-in .... SUCCESS [  1.242 s]
[INFO] Apache Qpid Broker-J Derby Message Store Plug-in ... SUCCESS [  0.866 s]
[INFO] Apache Qpid Broker-J JDBC Message Store Connection Pooling Plug-in SUCCESS [  0.446
s]
[INFO] Apache Qpid AMQP 1.0 JDBC Link Store Plug-in ....... SUCCESS [  0.657 s]
[INFO] Apache Qpid Broker-J HTTP Management Plug-in ....... SUCCESS [  4.700 s]
[INFO] Apache Qpid Broker-J AMQP Management Protocol Plug-in SUCCESS [  0.442 s]
[INFO] Apache Qpid Broker-J Memory Message Store Plug-in .. SUCCESS [  0.441 s]
[INFO] Apache Qpid Broker-J WebSocket Plug-in ............. SUCCESS [  0.483 s]
[INFO] Apache Qpid Broker-J BDB Message Store Plug-in ..... SUCCESS [  2.816 s]
[INFO] Apache Qpid AMQP 1.0 BDB Link Store Plug-in ........ SUCCESS [  0.801 s]
[INFO] Apache Qpid Broker-J ............................... SUCCESS [  1.305 s]
[INFO] Apache Qpid Broker-J Bundles ....................... SUCCESS [  8.885 s]
[INFO] Apache Qpid Broker-J Tools ......................... SUCCESS [  0.371 s]
[INFO] Apache Qpid Broker-J System Test Parent ............ SUCCESS [  0.245 s]
[INFO] Apache Qpid Broker-J System Test Utils ............. SUCCESS [  0.619 s]
[INFO] Apache Qpid Broker-J JMS System Tests Core ......... SUCCESS [  1.138 s]
[INFO] Apache Qpid Broker-J JMS 1.1 System Tests .......... SUCCESS [06:15 min]
[INFO] Apache Qpid Broker-J JMS 2.0 System Tests .......... SUCCESS [ 48.218 s]
[INFO] Apache Qpid Broker-J HTTP system tests ............. SUCCESS [01:10 min]
[INFO] Apache Qpid Broker-J Protocol Tests Core ........... SUCCESS [  0.587 s]
[INFO] Apache Qpid Protocol Tests for AMQP 0-8,0-9,0-9-1 .. SUCCESS [  1.236 s]
[INFO] Apache Qpid Protocol Tests for AMQP 0-10 ........... SUCCESS [  1.056 s]
[INFO] Apache Qpid Protocol Tests for AMQP 1.0 ............ SUCCESS [  2.241 s]
[INFO] Apache Qpid Broker-J System Tests Spawn Broker Admin SUCCESS [ 54.379 s]
[INFO] Apache Qpid Broker-J End to End Conversion Tests ... SUCCESS [04:57 min]
[INFO] Apache Qpid Broker-J Performance Tests ............. SUCCESS [  2.965 s]
[INFO] Apache Qpid Broker-J Performance Test System Tests . SUCCESS [ 29.731 s]
[INFO] Apache Qpid Broker-J Performance Tests Visualisation JFC SUCCESS [  2.175 s]
[INFO] Apache Qpid Broker-J BDB Store System Tests ........ FAILURE [03:26 min]
[INFO] Apache Qpid Joram JMS Tests ........................ SUCCESS [  1.428 s]
[INFO] Apache Qpid Broker-J JMS TCK Configuration ......... SUCCESS [  0.376 s]
[INFO] Apache Qpid Broker-J Docbook ....................... SUCCESS [  0.106 s]
[INFO] Apache Qpid Broker-J Docbook ....................... SUCCESS [  0.999 s]
[INFO] Apache Qpid Broker-J Performance Test Docbook 7.1.1-SNAPSHOT SUCCESS [  0.121 s]
[INFO] ------------------------------------------------------------------------
[INFO] BUILD FAILURE
[INFO] ------------------------------------------------------------------------
[INFO] Total time: 19:25 min
[INFO] Finished at: 2018-12-24T14:15:57Z
[INFO] ------------------------------------------------------------------------
[ERROR] Failed to execute goal org.apache.maven.plugins:maven-surefire-plugin:2.22.0:test
(integration-test) on project qpid-bdbstore-systests: There are test failures.
[ERROR] 
[ERROR] Please refer to <https://builds.apache.org/job/Qpid-Broker-J-7.1.x-TestMatrix/Ubuntu%20Slaves=ubuntu&&!H25,jdk=JDK%201.8%20(latest),profile=java-bdb.1-0/3/artifact/bdbstore/systests/target/surefire-reports/java-bdb.1-0>
for the individual test results.
[ERROR] Please refer to dump files (if any exist) [date]-jvmRun[N].dump, [date].dumpstream
and [date]-jvmRun[N].dumpstream.
[ERROR] -> [Help 1]
[ERROR] 
[ERROR] To see the full stack trace of the errors, re-run Maven with the -e switch.
[ERROR] Re-run Maven using the -X switch to enable full debug logging.
[ERROR] 
[ERROR] For more information about the errors and possible solutions, please read the following
articles:
[ERROR] [Help 1] http://cwiki.apache.org/confluence/display/MAVEN/MojoFailureException
[ERROR] 
[ERROR] After correcting the problems, you can resume the build with the command
[ERROR]   mvn <goals> -rf :qpid-bdbstore-systests
Build step 'Invoke top-level Maven targets' marked build as failure
Archiving artifacts
Performing Post build task...
Match found for : : True
Logical operation result is TRUE
Running script  : echo Finishing build
date
[java-bdb.1-0] $ /bin/bash -xe /tmp/jenkins8929464910689085414.sh
+ echo Finishing build
Finishing build
+ date
Mon Dec 24 14:20:29 UTC 2018
POST BUILD TASK : SUCCESS
END OF POST BUILD TASK : 0
Recording test results

Mime
View raw message