qpid-notifications mailing list archives

Site index · List index
Message view « Date » · « Thread »
Top « Date » · « Thread »
From Apache Jenkins Server <jenk...@builds.apache.org>
Subject Build failed in Jenkins: Qpid-Broker-J-TestMatrix » ubuntu&&!H25,JDK 1.8 (latest),java-bdb.0-9-1 #4486
Date Wed, 19 Dec 2018 06:52:11 GMT
See <https://builds.apache.org/job/Qpid-Broker-J-TestMatrix/Ubuntu%20Slaves=ubuntu&&!H25,jdk=JDK%201.8%20(latest),profile=java-bdb.0-9-1/4486/display/redirect?page=changes>

Changes:

[orudyy] QPID-6948: [Broker-J] Introduce interfaces for handling REST management

[orudyy] QPID-6948: [Broker-J] Introduce base classes for implementation of

[orudyy] QPID-6948: [Broker-J] Add compatibility layer for REST API v6.1

------------------------------------------
[...truncated 531.59 KB...]
[INFO] 
[INFO] --- maven-enforcer-plugin:3.0.0-M2:enforce (enforce-maven-version) @ qpid-java-doc
---
[INFO] 
[INFO] --- maven-enforcer-plugin:3.0.0-M2:enforce (enforce-minimum-versions) @ qpid-java-doc
---
[INFO] 
[INFO] --- maven-enforcer-plugin:3.0.0-M2:enforce (enforce-versions-standard-properties) @
qpid-java-doc ---
[INFO] 
[INFO] --- maven-enforcer-plugin:3.0.0-M2:enforce (enforce-enableAmqp0x) @ qpid-java-doc ---
[INFO] 
[INFO] --- jacoco-maven-plugin:0.8.2:prepare-agent (default-prepare-agent) @ qpid-java-doc
---
[INFO] argLine set to "-javaagent:/home/jenkins/.m2/repository/org/jacoco/org.jacoco.agent/0.8.2/org.jacoco.agent-0.8.2-runtime.jar=destfile=<https://builds.apache.org/job/Qpid-Broker-J-TestMatrix/Ubuntu%20Slaves=ubuntu&&!H25,jdk=JDK%201.8%20(latest),profile=java-bdb.0-9-1/ws/doc/target/jacoco.exec">
-Xmx512m
[INFO] 
[INFO] --- maven-remote-resources-plugin:1.5:process (process-resource-bundles) @ qpid-java-doc
---
[INFO] 
[INFO] --- maven-site-plugin:3.7.1:attach-descriptor (attach-descriptor) @ qpid-java-doc ---
[INFO] No site descriptor found: nothing to attach.
[INFO] 
[INFO] --- maven-assembly-plugin:3.0.0:single (default) @ qpid-java-doc ---
[INFO] Assemblies have been skipped per configuration of the skipAssembly parameter.
[INFO] 
[INFO] ----------------< org.apache.qpid:qpid-java-doc-broker >----------------
[INFO] Building Apache Qpid Broker-J Docbook 7.1.0-SNAPSHOT             [44/46]
[INFO] --------------------------------[ jar ]---------------------------------
[INFO] 
[INFO] --- maven-clean-plugin:3.1.0:clean (default-clean) @ qpid-java-doc-broker ---
[INFO] 
[INFO] --- buildnumber-maven-plugin:1.4:create (default) @ qpid-java-doc-broker ---
[INFO] Executing: /bin/sh -c cd '<https://builds.apache.org/job/Qpid-Broker-J-TestMatrix/Ubuntu%20Slaves=ubuntu&&!H25,jdk=JDK%201.8%20(latest),profile=java-bdb.0-9-1/ws/doc/java-broker'>
&& 'git' 'rev-parse' '--verify' 'HEAD'
[INFO] Working directory: <https://builds.apache.org/job/Qpid-Broker-J-TestMatrix/Ubuntu%20Slaves=ubuntu&&!H25,jdk=JDK%201.8%20(latest),profile=java-bdb.0-9-1/ws/doc/java-broker>
[INFO] Storing buildNumber: f4807cbd0297203c322deb54ce02b2c54e19cf44 at timestamp: 1545202208824
[WARNING] Cannot get the branch information from the git repository: 
Detecting the current branch failed: fatal: ref HEAD is not a symbolic ref

[INFO] Executing: /bin/sh -c cd '<https://builds.apache.org/job/Qpid-Broker-J-TestMatrix/Ubuntu%20Slaves=ubuntu&&!H25,jdk=JDK%201.8%20(latest),profile=java-bdb.0-9-1/ws/doc/java-broker'>
&& 'git' 'rev-parse' '--verify' 'HEAD'
[INFO] Working directory: <https://builds.apache.org/job/Qpid-Broker-J-TestMatrix/Ubuntu%20Slaves=ubuntu&&!H25,jdk=JDK%201.8%20(latest),profile=java-bdb.0-9-1/ws/doc/java-broker>
[INFO] Storing buildScmBranch: UNKNOWN
[INFO] 
[INFO] --- maven-antrun-plugin:1.8:run (output-test-properties) @ qpid-java-doc-broker ---
[INFO] Executing tasks

main:
     [echo] Qpid Test Profile Properties
     [echo] [profile] java-bdb.0-9-1
     [echo] [profile.broker.version] 0-9-1
     [echo] [profile.virtualhostnode.type] BDB
     [echo] [profile.virtualhostnode.context.blueprint] {"type":"ProvidedStore","globalAddressDomains":"${qpid.globalAddressDomains}"}
     [echo] [profile.test_receive_timeout] 3000
[INFO] Executed tasks
[INFO] 
[INFO] --- maven-enforcer-plugin:3.0.0-M2:enforce (enforce-maven-version) @ qpid-java-doc-broker
---
[INFO] 
[INFO] --- maven-enforcer-plugin:3.0.0-M2:enforce (enforce-minimum-versions) @ qpid-java-doc-broker
---
[INFO] 
[INFO] --- maven-enforcer-plugin:3.0.0-M2:enforce (enforce-versions-standard-properties) @
qpid-java-doc-broker ---
[INFO] 
[INFO] --- maven-enforcer-plugin:3.0.0-M2:enforce (enforce-enableAmqp0x) @ qpid-java-doc-broker
---
[INFO] 
[INFO] --- jacoco-maven-plugin:0.8.2:prepare-agent (default-prepare-agent) @ qpid-java-doc-broker
---
[INFO] argLine set to "-javaagent:/home/jenkins/.m2/repository/org/jacoco/org.jacoco.agent/0.8.2/org.jacoco.agent-0.8.2-runtime.jar=destfile=<https://builds.apache.org/job/Qpid-Broker-J-TestMatrix/Ubuntu%20Slaves=ubuntu&&!H25,jdk=JDK%201.8%20(latest),profile=java-bdb.0-9-1/ws/doc/java-broker/target/jacoco.exec">
-Xmx512m
[INFO] 
[INFO] --- maven-resources-plugin:3.1.0:copy-resources (filter-docbook-sources) @ qpid-java-doc-broker
---
[INFO] Using 'UTF-8' encoding to copy filtered resources.
[INFO] Copying 76 resources
[INFO] 
[INFO] --- maven-remote-resources-plugin:1.5:process (process-resource-bundles) @ qpid-java-doc-broker
---
[INFO] 
[INFO] --- maven-resources-plugin:3.1.0:resources (default-resources) @ qpid-java-doc-broker
---
[INFO] Using 'UTF-8' encoding to copy filtered resources.
[INFO] Copying 76 resources
[INFO] 
[INFO] --- maven-compiler-plugin:3.7.0:compile (default-compile) @ qpid-java-doc-broker ---
[INFO] No sources to compile
[INFO] 
[INFO] --- maven-resources-plugin:3.1.0:testResources (default-testResources) @ qpid-java-doc-broker
---
[INFO] Using 'UTF-8' encoding to copy filtered resources.
[INFO] Copying 76 resources
[INFO] 
[INFO] --- maven-compiler-plugin:3.7.0:testCompile (default-testCompile) @ qpid-java-doc-broker
---
[INFO] No sources to compile
[INFO] 
[INFO] --- maven-surefire-plugin:2.22.0:test (default-test) @ qpid-java-doc-broker ---
[INFO] Tests are skipped.
[INFO] 
[INFO] --- maven-jar-plugin:3.1.0:jar (default-jar) @ qpid-java-doc-broker ---
[WARNING] JAR will be empty - no content was marked for inclusion!
[INFO] Building jar: <https://builds.apache.org/job/Qpid-Broker-J-TestMatrix/Ubuntu%20Slaves=ubuntu&&!H25,jdk=JDK%201.8%20(latest),profile=java-bdb.0-9-1/ws/doc/java-broker/target/qpid-java-doc-broker-7.1.0-SNAPSHOT.jar>
[INFO] 
[INFO] --- maven-site-plugin:3.7.1:attach-descriptor (attach-descriptor) @ qpid-java-doc-broker
---
[INFO] Skipping because packaging 'jar' is not pom.
[INFO] 
[INFO] --- maven-assembly-plugin:3.0.0:single (default) @ qpid-java-doc-broker ---
[INFO] Assemblies have been skipped per configuration of the skipAssembly parameter.
[INFO] 
[INFO] --------------< org.apache.qpid:qpid-java-doc-perftests >---------------
[INFO] Building Apache Qpid Broker-J Performance Test Docbook 7.1.0-SNAPSHOT [45/46]
[INFO] --------------------------------[ jar ]---------------------------------
[INFO] 
[INFO] --- maven-clean-plugin:3.1.0:clean (default-clean) @ qpid-java-doc-perftests ---
[INFO] 
[INFO] --- buildnumber-maven-plugin:1.4:create (default) @ qpid-java-doc-perftests ---
[INFO] Executing: /bin/sh -c cd '<https://builds.apache.org/job/Qpid-Broker-J-TestMatrix/Ubuntu%20Slaves=ubuntu&&!H25,jdk=JDK%201.8%20(latest),profile=java-bdb.0-9-1/ws/doc/java-perftests'>
&& 'git' 'rev-parse' '--verify' 'HEAD'
[INFO] Working directory: <https://builds.apache.org/job/Qpid-Broker-J-TestMatrix/Ubuntu%20Slaves=ubuntu&&!H25,jdk=JDK%201.8%20(latest),profile=java-bdb.0-9-1/ws/doc/java-perftests>
[INFO] Storing buildNumber: f4807cbd0297203c322deb54ce02b2c54e19cf44 at timestamp: 1545202209572
[WARNING] Cannot get the branch information from the git repository: 
Detecting the current branch failed: fatal: ref HEAD is not a symbolic ref

[INFO] Executing: /bin/sh -c cd '<https://builds.apache.org/job/Qpid-Broker-J-TestMatrix/Ubuntu%20Slaves=ubuntu&&!H25,jdk=JDK%201.8%20(latest),profile=java-bdb.0-9-1/ws/doc/java-perftests'>
&& 'git' 'rev-parse' '--verify' 'HEAD'
[INFO] Working directory: <https://builds.apache.org/job/Qpid-Broker-J-TestMatrix/Ubuntu%20Slaves=ubuntu&&!H25,jdk=JDK%201.8%20(latest),profile=java-bdb.0-9-1/ws/doc/java-perftests>
[INFO] Storing buildScmBranch: UNKNOWN
[INFO] 
[INFO] --- maven-antrun-plugin:1.8:run (output-test-properties) @ qpid-java-doc-perftests
---
[INFO] Executing tasks

main:
     [echo] Qpid Test Profile Properties
     [echo] [profile] java-bdb.0-9-1
     [echo] [profile.broker.version] 0-9-1
     [echo] [profile.virtualhostnode.type] BDB
     [echo] [profile.virtualhostnode.context.blueprint] {"type":"ProvidedStore","globalAddressDomains":"${qpid.globalAddressDomains}"}
     [echo] [profile.test_receive_timeout] 3000
[INFO] Executed tasks
[INFO] 
[INFO] --- maven-enforcer-plugin:3.0.0-M2:enforce (enforce-maven-version) @ qpid-java-doc-perftests
---
[INFO] 
[INFO] --- maven-enforcer-plugin:3.0.0-M2:enforce (enforce-minimum-versions) @ qpid-java-doc-perftests
---
[INFO] 
[INFO] --- maven-enforcer-plugin:3.0.0-M2:enforce (enforce-versions-standard-properties) @
qpid-java-doc-perftests ---
[INFO] 
[INFO] --- maven-enforcer-plugin:3.0.0-M2:enforce (enforce-enableAmqp0x) @ qpid-java-doc-perftests
---
[INFO] 
[INFO] --- jacoco-maven-plugin:0.8.2:prepare-agent (default-prepare-agent) @ qpid-java-doc-perftests
---
[INFO] argLine set to "-javaagent:/home/jenkins/.m2/repository/org/jacoco/org.jacoco.agent/0.8.2/org.jacoco.agent-0.8.2-runtime.jar=destfile=<https://builds.apache.org/job/Qpid-Broker-J-TestMatrix/Ubuntu%20Slaves=ubuntu&&!H25,jdk=JDK%201.8%20(latest),profile=java-bdb.0-9-1/ws/doc/java-perftests/target/jacoco.exec">
-Xmx512m
[INFO] 
[INFO] --- maven-resources-plugin:3.1.0:copy-resources (filter-docbook-sources) @ qpid-java-doc-perftests
---
[INFO] Using 'UTF-8' encoding to copy filtered resources.
[INFO] Copying 1 resource
[INFO] 
[INFO] --- maven-remote-resources-plugin:1.5:process (process-resource-bundles) @ qpid-java-doc-perftests
---
[INFO] 
[INFO] --- maven-resources-plugin:3.1.0:resources (default-resources) @ qpid-java-doc-perftests
---
[INFO] Using 'UTF-8' encoding to copy filtered resources.
[INFO] Copying 1 resource
[INFO] 
[INFO] --- maven-compiler-plugin:3.7.0:compile (default-compile) @ qpid-java-doc-perftests
---
[INFO] No sources to compile
[INFO] 
[INFO] --- maven-resources-plugin:3.1.0:testResources (default-testResources) @ qpid-java-doc-perftests
---
[INFO] Using 'UTF-8' encoding to copy filtered resources.
[INFO] Copying 1 resource
[INFO] 
[INFO] --- maven-compiler-plugin:3.7.0:testCompile (default-testCompile) @ qpid-java-doc-perftests
---
[INFO] No sources to compile
[INFO] 
[INFO] --- maven-surefire-plugin:2.22.0:test (default-test) @ qpid-java-doc-perftests ---
[INFO] Tests are skipped.
[INFO] 
[INFO] --- maven-jar-plugin:3.1.0:jar (default-jar) @ qpid-java-doc-perftests ---
[WARNING] JAR will be empty - no content was marked for inclusion!
[INFO] Building jar: <https://builds.apache.org/job/Qpid-Broker-J-TestMatrix/Ubuntu%20Slaves=ubuntu&&!H25,jdk=JDK%201.8%20(latest),profile=java-bdb.0-9-1/ws/doc/java-perftests/target/qpid-java-doc-perftests-7.1.0-SNAPSHOT.jar>
[INFO] 
[INFO] --- maven-site-plugin:3.7.1:attach-descriptor (attach-descriptor) @ qpid-java-doc-perftests
---
[INFO] Skipping because packaging 'jar' is not pom.
[INFO] 
[INFO] --- maven-assembly-plugin:3.0.0:single (default) @ qpid-java-doc-perftests ---
[INFO] Assemblies have been skipped per configuration of the skipAssembly parameter.
[INFO] ------------------------------------------------------------------------
[INFO] Reactor Summary:
[INFO] 
[INFO] Apache Qpid Broker-J Parent 7.1.0-SNAPSHOT ......... SUCCESS [  2.733 s]
[INFO] Apache Qpid Broker-J Code Generation ............... SUCCESS [  2.222 s]
[INFO] Apache Qpid Broker-J Test Utilities ................ SUCCESS [  0.638 s]
[INFO] Apache Qpid Broker-J Core .......................... SUCCESS [ 15.591 s]
[INFO] Apache Qpid Broker-J LogBack Logging Plug-in ....... SUCCESS [  1.459 s]
[INFO] Apache Qpid Broker-J Access Control Plug-in ........ SUCCESS [  0.816 s]
[INFO] Apache Qpid Broker-J AMQP 0-10 Protocol Plug-in .... SUCCESS [  1.568 s]
[INFO] Apache Qpid Broker-J AMQP 0-8 Protocol Plug-in ..... SUCCESS [  1.478 s]
[INFO] Apache Qpid Broker-J AMQP 1-0 Protocol Plug-in ..... SUCCESS [  2.442 s]
[INFO] Apache Qpid Broker-J AMQP 0-8 to 0-10 Message Conversion Plug-in SUCCESS [  0.390 s]
[INFO] Apache Qpid Broker-J AMQP 0-8 to 1-0 Message Conversion Plug-in SUCCESS [  0.524 s]
[INFO] Apache Qpid Broker-J AMQP 0-10 to 1-0 Message Conversion Plug-in SUCCESS [  0.502 s]
[INFO] Apache Qpid Broker-J JDBC Message Store Plug-in .... SUCCESS [  0.782 s]
[INFO] Apache Qpid Broker-J Derby Message Store Plug-in ... SUCCESS [  0.640 s]
[INFO] Apache Qpid Broker-J JDBC Message Store Connection Pooling Plug-in SUCCESS [  0.370
s]
[INFO] Apache Qpid AMQP 1.0 JDBC Link Store Plug-in ....... SUCCESS [  0.365 s]
[INFO] Apache Qpid Broker-J HTTP Management Plug-in ....... SUCCESS [  3.290 s]
[INFO] Apache Qpid Broker-J AMQP Management Protocol Plug-in SUCCESS [  0.450 s]
[INFO] Apache Qpid Broker-J Memory Message Store Plug-in .. SUCCESS [  0.390 s]
[INFO] Apache Qpid Broker-J WebSocket Plug-in ............. SUCCESS [  0.612 s]
[INFO] Apache Qpid Broker-J BDB Message Store Plug-in ..... SUCCESS [  2.123 s]
[INFO] Apache Qpid AMQP 1.0 BDB Link Store Plug-in ........ SUCCESS [  0.541 s]
[INFO] Apache Qpid Broker-J ............................... SUCCESS [  1.115 s]
[INFO] Apache Qpid Broker-J Bundles ....................... SUCCESS [  6.442 s]
[INFO] Apache Qpid Broker-J Tools ......................... SUCCESS [  0.308 s]
[INFO] Apache Qpid Broker-J System Test Parent ............ SUCCESS [  0.109 s]
[INFO] Apache Qpid Broker-J System Test Utils ............. SUCCESS [  0.421 s]
[INFO] Apache Qpid Broker-J JMS System Tests Core ......... SUCCESS [  0.688 s]
[INFO] Apache Qpid Broker-J JMS 1.1 System Tests .......... SUCCESS [14:30 min]
[INFO] Apache Qpid Broker-J JMS 2.0 System Tests .......... SUCCESS [  1.450 s]
[INFO] Apache Qpid Broker-J HTTP system tests ............. FAILURE [02:46 min]
[INFO] Apache Qpid Broker-J Protocol Tests Core ........... SUCCESS [  0.509 s]
[INFO] Apache Qpid Protocol Tests for AMQP 0-8,0-9,0-9-1 .. SUCCESS [  1.711 s]
[INFO] Apache Qpid Protocol Tests for AMQP 0-10 ........... SUCCESS [  1.295 s]
[INFO] Apache Qpid Protocol Tests for AMQP 1.0 ............ SUCCESS [  2.915 s]
[INFO] Apache Qpid Broker-J System Tests Spawn Broker Admin SUCCESS [ 50.376 s]
[INFO] Apache Qpid Broker-J End to End Conversion Tests ... SUCCESS [07:13 min]
[INFO] Apache Qpid Broker-J Performance Tests ............. SUCCESS [  2.248 s]
[INFO] Apache Qpid Broker-J Performance Test System Tests . SKIPPED
[INFO] Apache Qpid Broker-J Performance Tests Visualisation JFC SUCCESS [  1.863 s]
[INFO] Apache Qpid Broker-J BDB Store System Tests ........ SUCCESS [03:58 min]
[INFO] Apache Qpid Joram JMS Tests ........................ SUCCESS [  0.387 s]
[INFO] Apache Qpid Broker-J JMS TCK Configuration ......... SUCCESS [  0.252 s]
[INFO] Apache Qpid Broker-J Docbook ....................... SUCCESS [  0.061 s]
[INFO] Apache Qpid Broker-J Docbook ....................... SUCCESS [  0.745 s]
[INFO] Apache Qpid Broker-J Performance Test Docbook 7.1.0-SNAPSHOT SUCCESS [  0.102 s]
[INFO] ------------------------------------------------------------------------
[INFO] BUILD FAILURE
[INFO] ------------------------------------------------------------------------
[INFO] Total time: 30:22 min
[INFO] Finished at: 2018-12-19T06:50:09Z
[INFO] ------------------------------------------------------------------------
[ERROR] Failed to execute goal org.apache.maven.plugins:maven-surefire-plugin:2.22.0:test
(integration-test) on project qpid-systests-http: There are test failures.
[ERROR] 
[ERROR] Please refer to <https://builds.apache.org/job/Qpid-Broker-J-TestMatrix/Ubuntu%20Slaves=ubuntu&&!H25,jdk=JDK%201.8%20(latest),profile=java-bdb.0-9-1/4486/artifact/systests/qpid-systests-http-management/target/surefire-reports/java-bdb.0-9-1>
for the individual test results.
[ERROR] Please refer to dump files (if any exist) [date]-jvmRun[N].dump, [date].dumpstream
and [date]-jvmRun[N].dumpstream.
[ERROR] -> [Help 1]
[ERROR] 
[ERROR] To see the full stack trace of the errors, re-run Maven with the -e switch.
[ERROR] Re-run Maven using the -X switch to enable full debug logging.
[ERROR] 
[ERROR] For more information about the errors and possible solutions, please read the following
articles:
[ERROR] [Help 1] http://cwiki.apache.org/confluence/display/MAVEN/MojoFailureException
[ERROR] 
[ERROR] After correcting the problems, you can resume the build with the command
[ERROR]   mvn <goals> -rf :qpid-systests-http
Build step 'Invoke top-level Maven targets' marked build as failure
Archiving artifacts
Performing Post build task...
Match found for : : True
Logical operation result is TRUE
Running script  : echo Finishing build
date
[java-bdb.0-9-1] $ /bin/bash -xe /tmp/jenkins7572329915323203023.sh
+ echo Finishing build
Finishing build
+ date
Wed Dec 19 06:52:05 UTC 2018
POST BUILD TASK : SUCCESS
END OF POST BUILD TASK : 0
Recording test results

Mime
View raw message