qpid-notifications mailing list archives

Site index · List index
Message view « Date » · « Thread »
Top « Date » · « Thread »
From Apache Jenkins Server <jenk...@builds.apache.org>
Subject Build failed in Jenkins: Qpid-Broker-J-Checks #954
Date Thu, 08 Nov 2018 13:55:35 GMT
See <https://builds.apache.org/job/Qpid-Broker-J-Checks/954/display/redirect?page=changes>

Changes:

[orudyy] QPID-8191: [Broker-J] Change log viewer UI to use dgrid and query UI for

[orudyy] QPID-8191: [Broker-J] Delete old unused log viewer widgets and UI

[orudyy] QPID-8191: [Broker-J] Make sure that log file browser UI is created

------------------------------------------
[...truncated 1.65 MB...]
[ERROR] around Ant part ...<fail message="Generated dependency info does not match the
reference. Ensure LICENCE and NOTICE files are correct and then update the reference by running
again with -Dupdate-dependency-reference. Generated file: &apos;${dependency-verification-output-file}&apos;.
Reference file: &apos;<https://builds.apache.org/job/Qpid-Broker-J-Checks/ws/apache-qpid-broker-j/src/main/assembly/dependency-verification/DEPENDENCIES_REFERENCE&apos;.">...>
@ 48:444 in <https://builds.apache.org/job/Qpid-Broker-J-Checks/ws/apache-qpid-broker-j/target/antrun/build-main.xml>
[ERROR] -> [Help 1]
org.apache.maven.lifecycle.LifecycleExecutionException: Failed to execute goal org.apache.maven.plugins:maven-antrun-plugin:1.8:run
(dependency-change-verification) on project apache-qpid-broker-j: An Ant BuildException has
occured: Generated dependency info does not match the reference. Ensure LICENCE and NOTICE
files are correct and then update the reference by running again with -Dupdate-dependency-reference.
Generated file: '<https://builds.apache.org/job/Qpid-Broker-J-Checks/ws/apache-qpid-broker-j/target/dependency-change-verification/PROCESSED_DEPENDENCIES_INFO'.>
Reference file: '<https://builds.apache.org/job/Qpid-Broker-J-Checks/ws/apache-qpid-broker-j/src/main/assembly/dependency-verification/DEPENDENCIES_REFERENCE'.>
around Ant part ...<fail message="Generated dependency info does not match the reference.
Ensure LICENCE and NOTICE files are correct and then update the reference by running again
with -Dupdate-dependency-reference. Generated file: &apos;${dependency-verification-output-file}&apos;.
Reference file: &apos;<https://builds.apache.org/job/Qpid-Broker-J-Checks/ws/apache-qpid-broker-j/src/main/assembly/dependency-verification/DEPENDENCIES_REFERENCE&apos;.">...>
@ 48:444 in <https://builds.apache.org/job/Qpid-Broker-J-Checks/ws/apache-qpid-broker-j/target/antrun/build-main.xml>
    at org.apache.maven.lifecycle.internal.MojoExecutor.execute (MojoExecutor.java:213)
    at org.apache.maven.lifecycle.internal.MojoExecutor.execute (MojoExecutor.java:154)
    at org.apache.maven.lifecycle.internal.MojoExecutor.execute (MojoExecutor.java:146)
    at org.apache.maven.lifecycle.internal.LifecycleModuleBuilder.buildProject (LifecycleModuleBuilder.java:117)
    at org.apache.maven.lifecycle.internal.LifecycleModuleBuilder.buildProject (LifecycleModuleBuilder.java:81)
    at org.apache.maven.lifecycle.internal.builder.singlethreaded.SingleThreadedBuilder.build
(SingleThreadedBuilder.java:56)
    at org.apache.maven.lifecycle.internal.LifecycleStarter.execute (LifecycleStarter.java:128)
    at org.apache.maven.DefaultMaven.doExecute (DefaultMaven.java:305)
    at org.apache.maven.DefaultMaven.doExecute (DefaultMaven.java:192)
    at org.apache.maven.DefaultMaven.execute (DefaultMaven.java:105)
    at org.jvnet.hudson.maven3.launcher.Maven35Launcher.main (Maven35Launcher.java:130)
    at sun.reflect.NativeMethodAccessorImpl.invoke0 (Native Method)
    at sun.reflect.NativeMethodAccessorImpl.invoke (NativeMethodAccessorImpl.java:62)
    at sun.reflect.DelegatingMethodAccessorImpl.invoke (DelegatingMethodAccessorImpl.java:43)
    at java.lang.reflect.Method.invoke (Method.java:498)
    at org.codehaus.plexus.classworlds.launcher.Launcher.launchEnhanced (Launcher.java:289)
    at org.codehaus.plexus.classworlds.launcher.Launcher.launch (Launcher.java:229)
    at jenkins.maven3.agent.Maven35Main.launch (Maven35Main.java:176)
    at sun.reflect.NativeMethodAccessorImpl.invoke0 (Native Method)
    at sun.reflect.NativeMethodAccessorImpl.invoke (NativeMethodAccessorImpl.java:62)
    at sun.reflect.DelegatingMethodAccessorImpl.invoke (DelegatingMethodAccessorImpl.java:43)
    at java.lang.reflect.Method.invoke (Method.java:498)
    at hudson.maven.Maven3Builder.call (Maven3Builder.java:139)
    at hudson.maven.Maven3Builder.call (Maven3Builder.java:70)
    at hudson.remoting.UserRequest.perform (UserRequest.java:212)
    at hudson.remoting.UserRequest.perform (UserRequest.java:54)
    at hudson.remoting.Request$2.run (Request.java:369)
    at hudson.remoting.InterceptingExecutorService$1.call (InterceptingExecutorService.java:72)
    at java.util.concurrent.FutureTask.run (FutureTask.java:266)
    at java.util.concurrent.ThreadPoolExecutor.runWorker (ThreadPoolExecutor.java:1149)
    at java.util.concurrent.ThreadPoolExecutor$Worker.run (ThreadPoolExecutor.java:624)
    at java.lang.Thread.run (Thread.java:748)
Caused by: org.apache.maven.plugin.MojoExecutionException: An Ant BuildException has occured:
Generated dependency info does not match the reference. Ensure LICENCE and NOTICE files are
correct and then update the reference by running again with -Dupdate-dependency-reference.
Generated file: '<https://builds.apache.org/job/Qpid-Broker-J-Checks/ws/apache-qpid-broker-j/target/dependency-change-verification/PROCESSED_DEPENDENCIES_INFO'.>
Reference file: '<https://builds.apache.org/job/Qpid-Broker-J-Checks/ws/apache-qpid-broker-j/src/main/assembly/dependency-verification/DEPENDENCIES_REFERENCE'.>
around Ant part ...<fail message="Generated dependency info does not match the reference.
Ensure LICENCE and NOTICE files are correct and then update the reference by running again
with -Dupdate-dependency-reference. Generated file: &apos;${dependency-verification-output-file}&apos;.
Reference file: &apos;<https://builds.apache.org/job/Qpid-Broker-J-Checks/ws/apache-qpid-broker-j/src/main/assembly/dependency-verification/DEPENDENCIES_REFERENCE&apos;.">...>
@ 48:444 in <https://builds.apache.org/job/Qpid-Broker-J-Checks/ws/apache-qpid-broker-j/target/antrun/build-main.xml>
    at org.apache.maven.plugin.antrun.AntRunMojo.execute (AntRunMojo.java:342)
    at org.apache.maven.plugin.DefaultBuildPluginManager.executeMojo (DefaultBuildPluginManager.java:137)
    at org.apache.maven.lifecycle.internal.MojoExecutor.execute (MojoExecutor.java:208)
    at org.apache.maven.lifecycle.internal.MojoExecutor.execute (MojoExecutor.java:154)
    at org.apache.maven.lifecycle.internal.MojoExecutor.execute (MojoExecutor.java:146)
    at org.apache.maven.lifecycle.internal.LifecycleModuleBuilder.buildProject (LifecycleModuleBuilder.java:117)
    at org.apache.maven.lifecycle.internal.LifecycleModuleBuilder.buildProject (LifecycleModuleBuilder.java:81)
    at org.apache.maven.lifecycle.internal.builder.singlethreaded.SingleThreadedBuilder.build
(SingleThreadedBuilder.java:56)
    at org.apache.maven.lifecycle.internal.LifecycleStarter.execute (LifecycleStarter.java:128)
    at org.apache.maven.DefaultMaven.doExecute (DefaultMaven.java:305)
    at org.apache.maven.DefaultMaven.doExecute (DefaultMaven.java:192)
    at org.apache.maven.DefaultMaven.execute (DefaultMaven.java:105)
    at org.jvnet.hudson.maven3.launcher.Maven35Launcher.main (Maven35Launcher.java:130)
    at sun.reflect.NativeMethodAccessorImpl.invoke0 (Native Method)
    at sun.reflect.NativeMethodAccessorImpl.invoke (NativeMethodAccessorImpl.java:62)
    at sun.reflect.DelegatingMethodAccessorImpl.invoke (DelegatingMethodAccessorImpl.java:43)
    at java.lang.reflect.Method.invoke (Method.java:498)
    at org.codehaus.plexus.classworlds.launcher.Launcher.launchEnhanced (Launcher.java:289)
    at org.codehaus.plexus.classworlds.launcher.Launcher.launch (Launcher.java:229)
    at jenkins.maven3.agent.Maven35Main.launch (Maven35Main.java:176)
    at sun.reflect.NativeMethodAccessorImpl.invoke0 (Native Method)
    at sun.reflect.NativeMethodAccessorImpl.invoke (NativeMethodAccessorImpl.java:62)
    at sun.reflect.DelegatingMethodAccessorImpl.invoke (DelegatingMethodAccessorImpl.java:43)
    at java.lang.reflect.Method.invoke (Method.java:498)
    at hudson.maven.Maven3Builder.call (Maven3Builder.java:139)
    at hudson.maven.Maven3Builder.call (Maven3Builder.java:70)
    at hudson.remoting.UserRequest.perform (UserRequest.java:212)
    at hudson.remoting.UserRequest.perform (UserRequest.java:54)
    at hudson.remoting.Request$2.run (Request.java:369)
    at hudson.remoting.InterceptingExecutorService$1.call (InterceptingExecutorService.java:72)
    at java.util.concurrent.FutureTask.run (FutureTask.java:266)
    at java.util.concurrent.ThreadPoolExecutor.runWorker (ThreadPoolExecutor.java:1149)
    at java.util.concurrent.ThreadPoolExecutor$Worker.run (ThreadPoolExecutor.java:624)
    at java.lang.Thread.run (Thread.java:748)
Caused by: org.apache.tools.ant.BuildException: Generated dependency info does not match the
reference. Ensure LICENCE and NOTICE files are correct and then update the reference by running
again with -Dupdate-dependency-reference. Generated file: '<https://builds.apache.org/job/Qpid-Broker-J-Checks/ws/apache-qpid-broker-j/target/dependency-change-verification/PROCESSED_DEPENDENCIES_INFO'.>
Reference file: '<https://builds.apache.org/job/Qpid-Broker-J-Checks/ws/apache-qpid-broker-j/src/main/assembly/dependency-verification/DEPENDENCIES_REFERENCE'.>
    at org.apache.tools.ant.taskdefs.Exit.execute (Exit.java:164)
    at org.apache.tools.ant.UnknownElement.execute (UnknownElement.java:292)
    at sun.reflect.GeneratedMethodAccessor43.invoke (Unknown Source)
    at sun.reflect.DelegatingMethodAccessorImpl.invoke (DelegatingMethodAccessorImpl.java:43)
    at java.lang.reflect.Method.invoke (Method.java:498)
    at org.apache.tools.ant.dispatch.DispatchUtils.execute (DispatchUtils.java:106)
    at org.apache.tools.ant.Task.perform (Task.java:348)
    at org.apache.tools.ant.Target.execute (Target.java:435)
    at org.apache.tools.ant.Target.performTasks (Target.java:456)
    at org.apache.tools.ant.Project.executeSortedTargets (Project.java:1393)
    at org.apache.tools.ant.Project.executeTarget (Project.java:1364)
    at org.apache.maven.plugin.antrun.AntRunMojo.execute (AntRunMojo.java:313)
    at org.apache.maven.plugin.DefaultBuildPluginManager.executeMojo (DefaultBuildPluginManager.java:137)
    at org.apache.maven.lifecycle.internal.MojoExecutor.execute (MojoExecutor.java:208)
    at org.apache.maven.lifecycle.internal.MojoExecutor.execute (MojoExecutor.java:154)
    at org.apache.maven.lifecycle.internal.MojoExecutor.execute (MojoExecutor.java:146)
    at org.apache.maven.lifecycle.internal.LifecycleModuleBuilder.buildProject (LifecycleModuleBuilder.java:117)
    at org.apache.maven.lifecycle.internal.LifecycleModuleBuilder.buildProject (LifecycleModuleBuilder.java:81)
    at org.apache.maven.lifecycle.internal.builder.singlethreaded.SingleThreadedBuilder.build
(SingleThreadedBuilder.java:56)
    at org.apache.maven.lifecycle.internal.LifecycleStarter.execute (LifecycleStarter.java:128)
    at org.apache.maven.DefaultMaven.doExecute (DefaultMaven.java:305)
    at org.apache.maven.DefaultMaven.doExecute (DefaultMaven.java:192)
    at org.apache.maven.DefaultMaven.execute (DefaultMaven.java:105)
    at org.jvnet.hudson.maven3.launcher.Maven35Launcher.main (Maven35Launcher.java:130)
    at sun.reflect.NativeMethodAccessorImpl.invoke0 (Native Method)
    at sun.reflect.NativeMethodAccessorImpl.invoke (NativeMethodAccessorImpl.java:62)
    at sun.reflect.DelegatingMethodAccessorImpl.invoke (DelegatingMethodAccessorImpl.java:43)
    at java.lang.reflect.Method.invoke (Method.java:498)
    at org.codehaus.plexus.classworlds.launcher.Launcher.launchEnhanced (Launcher.java:289)
    at org.codehaus.plexus.classworlds.launcher.Launcher.launch (Launcher.java:229)
    at jenkins.maven3.agent.Maven35Main.launch (Maven35Main.java:176)
    at sun.reflect.NativeMethodAccessorImpl.invoke0 (Native Method)
    at sun.reflect.NativeMethodAccessorImpl.invoke (NativeMethodAccessorImpl.java:62)
    at sun.reflect.DelegatingMethodAccessorImpl.invoke (DelegatingMethodAccessorImpl.java:43)
    at java.lang.reflect.Method.invoke (Method.java:498)
    at hudson.maven.Maven3Builder.call (Maven3Builder.java:139)
    at hudson.maven.Maven3Builder.call (Maven3Builder.java:70)
    at hudson.remoting.UserRequest.perform (UserRequest.java:212)
    at hudson.remoting.UserRequest.perform (UserRequest.java:54)
    at hudson.remoting.Request$2.run (Request.java:369)
    at hudson.remoting.InterceptingExecutorService$1.call (InterceptingExecutorService.java:72)
    at java.util.concurrent.FutureTask.run (FutureTask.java:266)
    at java.util.concurrent.ThreadPoolExecutor.runWorker (ThreadPoolExecutor.java:1149)
    at java.util.concurrent.ThreadPoolExecutor$Worker.run (ThreadPoolExecutor.java:624)
    at java.lang.Thread.run (Thread.java:748)
[ERROR] Failed to execute goal org.apache.maven.plugins:maven-antrun-plugin:1.8:run (dependency-change-verification)
on project qpid-perftests: An Ant BuildException has occured: Generated dependency info does
not match the reference. Ensure LICENCE and NOTICE files are correct and then update the reference
by running again with -Dupdate-dependency-reference. Generated file: '<https://builds.apache.org/job/Qpid-Broker-J-Checks/ws/perftests/target/dependency-change-verification/PROCESSED_DEPENDENCIES_INFO'.>
Reference file: '<https://builds.apache.org/job/Qpid-Broker-J-Checks/ws/perftests/src/main/assembly/dependency-verification/DEPENDENCIES_REFERENCE'.>
[ERROR] around Ant part ...<fail message="Generated dependency info does not match the
reference. Ensure LICENCE and NOTICE files are correct and then update the reference by running
again with -Dupdate-dependency-reference. Generated file: &apos;${dependency-verification-output-file}&apos;.
Reference file: &apos;<https://builds.apache.org/job/Qpid-Broker-J-Checks/ws/perftests/src/main/assembly/dependency-verification/DEPENDENCIES_REFERENCE&apos;.">...>
@ 48:433 in <https://builds.apache.org/job/Qpid-Broker-J-Checks/ws/perftests/target/antrun/build-main.xml>
[ERROR] -> [Help 1]
org.apache.maven.lifecycle.LifecycleExecutionException: Failed to execute goal org.apache.maven.plugins:maven-antrun-plugin:1.8:run
(dependency-change-verification) on project qpid-perftests: An Ant BuildException has occured:
Generated dependency info does not match the reference. Ensure LICENCE and NOTICE files are
correct and then update the reference by running again with -Dupdate-dependency-reference.
Generated file: '<https://builds.apache.org/job/Qpid-Broker-J-Checks/ws/perftests/target/dependency-change-verification/PROCESSED_DEPENDENCIES_INFO'.>
Reference file: '<https://builds.apache.org/job/Qpid-Broker-J-Checks/ws/perftests/src/main/assembly/dependency-verification/DEPENDENCIES_REFERENCE'.>
around Ant part ...<fail message="Generated dependency info does not match the reference.
Ensure LICENCE and NOTICE files are correct and then update the reference by running again
with -Dupdate-dependency-reference. Generated file: &apos;${dependency-verification-output-file}&apos;.
Reference file: &apos;<https://builds.apache.org/job/Qpid-Broker-J-Checks/ws/perftests/src/main/assembly/dependency-verification/DEPENDENCIES_REFERENCE&apos;.">...>
@ 48:433 in <https://builds.apache.org/job/Qpid-Broker-J-Checks/ws/perftests/target/antrun/build-main.xml>
    at org.apache.maven.lifecycle.internal.MojoExecutor.execute (MojoExecutor.java:213)
    at org.apache.maven.lifecycle.internal.MojoExecutor.execute (MojoExecutor.java:154)
    at org.apache.maven.lifecycle.internal.MojoExecutor.execute (MojoExecutor.java:146)
    at org.apache.maven.lifecycle.internal.LifecycleModuleBuilder.buildProject (LifecycleModuleBuilder.java:117)
    at org.apache.maven.lifecycle.internal.LifecycleModuleBuilder.buildProject (LifecycleModuleBuilder.java:81)
    at org.apache.maven.lifecycle.internal.builder.singlethreaded.SingleThreadedBuilder.build
(SingleThreadedBuilder.java:56)
    at org.apache.maven.lifecycle.internal.LifecycleStarter.execute (LifecycleStarter.java:128)
    at org.apache.maven.DefaultMaven.doExecute (DefaultMaven.java:305)
    at org.apache.maven.DefaultMaven.doExecute (DefaultMaven.java:192)
    at org.apache.maven.DefaultMaven.execute (DefaultMaven.java:105)
    at org.jvnet.hudson.maven3.launcher.Maven35Launcher.main (Maven35Launcher.java:130)
    at sun.reflect.NativeMethodAccessorImpl.invoke0 (Native Method)
    at sun.reflect.NativeMethodAccessorImpl.invoke (NativeMethodAccessorImpl.java:62)
    at sun.reflect.DelegatingMethodAccessorImpl.invoke (DelegatingMethodAccessorImpl.java:43)
    at java.lang.reflect.Method.invoke (Method.java:498)
    at org.codehaus.plexus.classworlds.launcher.Launcher.launchEnhanced (Launcher.java:289)
    at org.codehaus.plexus.classworlds.launcher.Launcher.launch (Launcher.java:229)
    at jenkins.maven3.agent.Maven35Main.launch (Maven35Main.java:176)
    at sun.reflect.NativeMethodAccessorImpl.invoke0 (Native Method)
    at sun.reflect.NativeMethodAccessorImpl.invoke (NativeMethodAccessorImpl.java:62)
    at sun.reflect.DelegatingMethodAccessorImpl.invoke (DelegatingMethodAccessorImpl.java:43)
    at java.lang.reflect.Method.invoke (Method.java:498)
    at hudson.maven.Maven3Builder.call (Maven3Builder.java:139)
    at hudson.maven.Maven3Builder.call (Maven3Builder.java:70)
    at hudson.remoting.UserRequest.perform (UserRequest.java:212)
    at hudson.remoting.UserRequest.perform (UserRequest.java:54)
    at hudson.remoting.Request$2.run (Request.java:369)
    at hudson.remoting.InterceptingExecutorService$1.call (InterceptingExecutorService.java:72)
    at java.util.concurrent.FutureTask.run (FutureTask.java:266)
    at java.util.concurrent.ThreadPoolExecutor.runWorker (ThreadPoolExecutor.java:1149)
    at java.util.concurrent.ThreadPoolExecutor$Worker.run (ThreadPoolExecutor.java:624)
    at java.lang.Thread.run (Thread.java:748)
Caused by: org.apache.maven.plugin.MojoExecutionException: An Ant BuildException has occured:
Generated dependency info does not match the reference. Ensure LICENCE and NOTICE files are
correct and then update the reference by running again with -Dupdate-dependency-reference.
Generated file: '<https://builds.apache.org/job/Qpid-Broker-J-Checks/ws/perftests/target/dependency-change-verification/PROCESSED_DEPENDENCIES_INFO'.>
Reference file: '<https://builds.apache.org/job/Qpid-Broker-J-Checks/ws/perftests/src/main/assembly/dependency-verification/DEPENDENCIES_REFERENCE'.>
around Ant part ...<fail message="Generated dependency info does not match the reference.
Ensure LICENCE and NOTICE files are correct and then update the reference by running again
with -Dupdate-dependency-reference. Generated file: &apos;${dependency-verification-output-file}&apos;.
Reference file: &apos;<https://builds.apache.org/job/Qpid-Broker-J-Checks/ws/perftests/src/main/assembly/dependency-verification/DEPENDENCIES_REFERENCE&apos;.">...>
@ 48:433 in <https://builds.apache.org/job/Qpid-Broker-J-Checks/ws/perftests/target/antrun/build-main.xml>
    at org.apache.maven.plugin.antrun.AntRunMojo.execute (AntRunMojo.java:342)
    at org.apache.maven.plugin.DefaultBuildPluginManager.executeMojo (DefaultBuildPluginManager.java:137)
    at org.apache.maven.lifecycle.internal.MojoExecutor.execute (MojoExecutor.java:208)
    at org.apache.maven.lifecycle.internal.MojoExecutor.execute (MojoExecutor.java:154)
    at org.apache.maven.lifecycle.internal.MojoExecutor.execute (MojoExecutor.java:146)
    at org.apache.maven.lifecycle.internal.LifecycleModuleBuilder.buildProject (LifecycleModuleBuilder.java:117)
    at org.apache.maven.lifecycle.internal.LifecycleModuleBuilder.buildProject (LifecycleModuleBuilder.java:81)
    at org.apache.maven.lifecycle.internal.builder.singlethreaded.SingleThreadedBuilder.build
(SingleThreadedBuilder.java:56)
    at org.apache.maven.lifecycle.internal.LifecycleStarter.execute (LifecycleStarter.java:128)
    at org.apache.maven.DefaultMaven.doExecute (DefaultMaven.java:305)
    at org.apache.maven.DefaultMaven.doExecute (DefaultMaven.java:192)
    at org.apache.maven.DefaultMaven.execute (DefaultMaven.java:105)
    at org.jvnet.hudson.maven3.launcher.Maven35Launcher.main (Maven35Launcher.java:130)
    at sun.reflect.NativeMethodAccessorImpl.invoke0 (Native Method)
    at sun.reflect.NativeMethodAccessorImpl.invoke (NativeMethodAccessorImpl.java:62)
    at sun.reflect.DelegatingMethodAccessorImpl.invoke (DelegatingMethodAccessorImpl.java:43)
    at java.lang.reflect.Method.invoke (Method.java:498)
    at org.codehaus.plexus.classworlds.launcher.Launcher.launchEnhanced (Launcher.java:289)
    at org.codehaus.plexus.classworlds.launcher.Launcher.launch (Launcher.java:229)
    at jenkins.maven3.agent.Maven35Main.launch (Maven35Main.java:176)
    at sun.reflect.NativeMethodAccessorImpl.invoke0 (Native Method)
    at sun.reflect.NativeMethodAccessorImpl.invoke (NativeMethodAccessorImpl.java:62)
    at sun.reflect.DelegatingMethodAccessorImpl.invoke (DelegatingMethodAccessorImpl.java:43)
    at java.lang.reflect.Method.invoke (Method.java:498)
    at hudson.maven.Maven3Builder.call (Maven3Builder.java:139)
    at hudson.maven.Maven3Builder.call (Maven3Builder.java:70)
    at hudson.remoting.UserRequest.perform (UserRequest.java:212)
    at hudson.remoting.UserRequest.perform (UserRequest.java:54)
    at hudson.remoting.Request$2.run (Request.java:369)
    at hudson.remoting.InterceptingExecutorService$1.call (InterceptingExecutorService.java:72)
    at java.util.concurrent.FutureTask.run (FutureTask.java:266)
    at java.util.concurrent.ThreadPoolExecutor.runWorker (ThreadPoolExecutor.java:1149)
    at java.util.concurrent.ThreadPoolExecutor$Worker.run (ThreadPoolExecutor.java:624)
    at java.lang.Thread.run (Thread.java:748)
Caused by: org.apache.tools.ant.BuildException: Generated dependency info does not match the
reference. Ensure LICENCE and NOTICE files are correct and then update the reference by running
again with -Dupdate-dependency-reference. Generated file: '<https://builds.apache.org/job/Qpid-Broker-J-Checks/ws/perftests/target/dependency-change-verification/PROCESSED_DEPENDENCIES_INFO'.>
Reference file: '<https://builds.apache.org/job/Qpid-Broker-J-Checks/ws/perftests/src/main/assembly/dependency-verification/DEPENDENCIES_REFERENCE'.>
    at org.apache.tools.ant.taskdefs.Exit.execute (Exit.java:164)
    at org.apache.tools.ant.UnknownElement.execute (UnknownElement.java:292)
    at sun.reflect.GeneratedMethodAccessor43.invoke (Unknown Source)
    at sun.reflect.DelegatingMethodAccessorImpl.invoke (DelegatingMethodAccessorImpl.java:43)
    at java.lang.reflect.Method.invoke (Method.java:498)
    at org.apache.tools.ant.dispatch.DispatchUtils.execute (DispatchUtils.java:106)
    at org.apache.tools.ant.Task.perform (Task.java:348)
    at org.apache.tools.ant.Target.execute (Target.java:435)
    at org.apache.tools.ant.Target.performTasks (Target.java:456)
    at org.apache.tools.ant.Project.executeSortedTargets (Project.java:1393)
    at org.apache.tools.ant.Project.executeTarget (Project.java:1364)
    at org.apache.maven.plugin.antrun.AntRunMojo.execute (AntRunMojo.java:313)
    at org.apache.maven.plugin.DefaultBuildPluginManager.executeMojo (DefaultBuildPluginManager.java:137)
    at org.apache.maven.lifecycle.internal.MojoExecutor.execute (MojoExecutor.java:208)
    at org.apache.maven.lifecycle.internal.MojoExecutor.execute (MojoExecutor.java:154)
    at org.apache.maven.lifecycle.internal.MojoExecutor.execute (MojoExecutor.java:146)
    at org.apache.maven.lifecycle.internal.LifecycleModuleBuilder.buildProject (LifecycleModuleBuilder.java:117)
    at org.apache.maven.lifecycle.internal.LifecycleModuleBuilder.buildProject (LifecycleModuleBuilder.java:81)
    at org.apache.maven.lifecycle.internal.builder.singlethreaded.SingleThreadedBuilder.build
(SingleThreadedBuilder.java:56)
    at org.apache.maven.lifecycle.internal.LifecycleStarter.execute (LifecycleStarter.java:128)
    at org.apache.maven.DefaultMaven.doExecute (DefaultMaven.java:305)
    at org.apache.maven.DefaultMaven.doExecute (DefaultMaven.java:192)
    at org.apache.maven.DefaultMaven.execute (DefaultMaven.java:105)
    at org.jvnet.hudson.maven3.launcher.Maven35Launcher.main (Maven35Launcher.java:130)
    at sun.reflect.NativeMethodAccessorImpl.invoke0 (Native Method)
    at sun.reflect.NativeMethodAccessorImpl.invoke (NativeMethodAccessorImpl.java:62)
    at sun.reflect.DelegatingMethodAccessorImpl.invoke (DelegatingMethodAccessorImpl.java:43)
    at java.lang.reflect.Method.invoke (Method.java:498)
    at org.codehaus.plexus.classworlds.launcher.Launcher.launchEnhanced (Launcher.java:289)
    at org.codehaus.plexus.classworlds.launcher.Launcher.launch (Launcher.java:229)
    at jenkins.maven3.agent.Maven35Main.launch (Maven35Main.java:176)
    at sun.reflect.NativeMethodAccessorImpl.invoke0 (Native Method)
    at sun.reflect.NativeMethodAccessorImpl.invoke (NativeMethodAccessorImpl.java:62)
    at sun.reflect.DelegatingMethodAccessorImpl.invoke (DelegatingMethodAccessorImpl.java:43)
    at java.lang.reflect.Method.invoke (Method.java:498)
    at hudson.maven.Maven3Builder.call (Maven3Builder.java:139)
    at hudson.maven.Maven3Builder.call (Maven3Builder.java:70)
    at hudson.remoting.UserRequest.perform (UserRequest.java:212)
    at hudson.remoting.UserRequest.perform (UserRequest.java:54)
    at hudson.remoting.Request$2.run (Request.java:369)
    at hudson.remoting.InterceptingExecutorService$1.call (InterceptingExecutorService.java:72)
    at java.util.concurrent.FutureTask.run (FutureTask.java:266)
    at java.util.concurrent.ThreadPoolExecutor.runWorker (ThreadPoolExecutor.java:1149)
    at java.util.concurrent.ThreadPoolExecutor$Worker.run (ThreadPoolExecutor.java:624)
    at java.lang.Thread.run (Thread.java:748)
[ERROR] 
[ERROR] Re-run Maven using the -X switch to enable full debug logging.
[ERROR] 
[ERROR] For more information about the errors and possible solutions, please read the following
articles:
[ERROR] [Help 1] http://cwiki.apache.org/confluence/display/MAVEN/MojoExecutionException
[ERROR] 
[ERROR] After correcting the problems, you can resume the build with the command
[ERROR]   mvn <goals> -rf :apache-qpid-broker-j

channel stopped
Archiving artifacts
[Fast Archiver] Compressed 531.42 KB of artifacts by 24.1% relative to #951

Mime
View raw message