qpid-notifications mailing list archives

Site index · List index
Message view « Date » · « Thread »
Top « Date » · « Thread »
From Apache Jenkins Server <jenk...@builds.apache.org>
Subject Build failed in Jenkins: Qpid-Broker-J-Checks #943
Date Mon, 08 Oct 2018 16:41:42 GMT
See <https://builds.apache.org/job/Qpid-Broker-J-Checks/943/display/redirect?page=changes>

Changes:

[orudyy] QPID-8132: Upgrade Apache BCEL dependency to version 6.2

------------------------------------------
[...truncated 1.70 MB...]
[INFO] Executing: /bin/sh -c cd <https://builds.apache.org/job/Qpid-Broker-J-Checks/ws/doc/java-perftests>
&& git rev-parse --verify HEAD
[INFO] Working directory: <https://builds.apache.org/job/Qpid-Broker-J-Checks/ws/doc/java-perftests>
[INFO] Storing buildScmBranch: UNKNOWN
[INFO] 
[INFO] --- maven-antrun-plugin:1.8:run (output-test-properties) @ qpid-java-doc-perftests
---
[INFO] Executing tasks

main:
     [echo] Qpid Test Profile Properties
     [echo] [profile] java-mms.1-0
     [echo] [profile.broker.version] 1.0
     [echo] [profile.virtualhostnode.type] Memory
     [echo] [profile.virtualhostnode.context.blueprint] ${profile.virtualhostnode.context.blueprint}
     [echo] [profile.test_receive_timeout] 1000
[INFO] Executed tasks
[INFO] 
[INFO] --- maven-enforcer-plugin:1.4.1:enforce (enforce-minimum-versions) @ qpid-java-doc-perftests
---
[INFO] Skipping Rule Enforcement.
[INFO] 
[INFO] --- maven-enforcer-plugin:1.4.1:enforce (enforce-versions-standard-properties) @ qpid-java-doc-perftests
---
[INFO] Skipping Rule Enforcement.
[INFO] 
[INFO] --- maven-enforcer-plugin:1.4.1:enforce (enforce-enableAmqp0x) @ qpid-java-doc-perftests
---
[INFO] Skipping Rule Enforcement.
[INFO] 
[INFO] --- jacoco-maven-plugin:0.7.5.201505241946:prepare-agent (default-prepare-agent) @
qpid-java-doc-perftests ---
[INFO] argLine set to -javaagent:/home/jenkins/jenkins-slave/maven-repositories/1/org/jacoco/org.jacoco.agent/0.7.5.201505241946/org.jacoco.agent-0.7.5.201505241946-runtime.jar=destfile=<https://builds.apache.org/job/Qpid-Broker-J-Checks/ws/doc/java-perftests/target/jacoco.exec>
-Xmx512m
[INFO] 
[INFO] --- maven-resources-plugin:2.7:copy-resources (filter-docbook-sources) @ qpid-java-doc-perftests
---
[INFO] Using 'UTF-8' encoding to copy filtered resources.
[INFO] Copying 1 resource
[INFO] 
[INFO] --- maven-remote-resources-plugin:1.5:process (process-resource-bundles) @ qpid-java-doc-perftests
---
[INFO] 
[INFO] --- maven-resources-plugin:2.7:resources (default-resources) @ qpid-java-doc-perftests
---
[INFO] Using 'UTF-8' encoding to copy filtered resources.
[INFO] Copying 1 resource
[INFO] 
[INFO] --- maven-compiler-plugin:3.5.1:compile (default-compile) @ qpid-java-doc-perftests
---
[INFO] No sources to compile
[INFO] 
[INFO] --- maven-resources-plugin:2.7:testResources (default-testResources) @ qpid-java-doc-perftests
---
[INFO] Using 'UTF-8' encoding to copy filtered resources.
[INFO] Copying 1 resource
[INFO] 
[INFO] --- maven-compiler-plugin:3.5.1:testCompile (default-testCompile) @ qpid-java-doc-perftests
---
[INFO] No sources to compile
[INFO] 
[INFO] --- maven-surefire-plugin:2.19.1:test (default-test) @ qpid-java-doc-perftests ---
[INFO] Tests are skipped.
[INFO] 
[INFO] --- license-maven-plugin:1.6:add-third-party (check-third-party-licensing) @ qpid-java-doc-perftests
---
[INFO] Included licenses (whitelist): [Apache Software License, Version 2.0, The MIT License,
BSD License, Eclipse Public License - Version 1.0, Common Public License Version 1.0, Academic
Free License v2.1, COMMON DEVELOPMENT AND DISTRIBUTION LICENSE (CDDL) Version 1.0, Public
Domain]
[INFO] Writing third-party file to <https://builds.apache.org/job/Qpid-Broker-J-Checks/ws/doc/java-perftests/target/license-maven-plugin/THIRD-PARTY.txt>
[INFO] 
[INFO] --- maven-antrun-plugin:1.8:run (dependency-change-verification) @ qpid-java-doc-perftests
---
[INFO] Executing tasks

main:
[INFO] Executed tasks
[INFO] 
[INFO] --- maven-jar-plugin:3.0.0:jar (default-jar) @ qpid-java-doc-perftests ---
[WARNING] JAR will be empty - no content was marked for inclusion!
[INFO] Building jar: <https://builds.apache.org/job/Qpid-Broker-J-Checks/ws/doc/java-perftests/target/qpid-java-doc-perftests-7.1.0-SNAPSHOT.jar>
[INFO] 
[INFO] --- maven-site-plugin:3.5.1:attach-descriptor (attach-descriptor) @ qpid-java-doc-perftests
---
[INFO] 
[INFO] --- maven-assembly-plugin:2.6:single (default) @ qpid-java-doc-perftests ---
[INFO] Assemblies have been skipped per configuration of the skipAssembly parameter.
[INFO] 
[INFO] --- maven-assembly-plugin:2.6:single (source-release-assembly) @ qpid-java-doc-perftests
---
[INFO] Assemblies have been skipped per configuration of the skipAssembly parameter.
[INFO] 
[INFO] --- maven-source-plugin:3.0.0:jar-no-fork (attach-sources) @ qpid-java-doc-perftests
---
[INFO] Building jar: <https://builds.apache.org/job/Qpid-Broker-J-Checks/ws/doc/java-perftests/target/qpid-java-doc-perftests-7.1.0-SNAPSHOT-sources.jar>
[INFO] 
[INFO] --- maven-javadoc-plugin:2.10.3:jar (attach-javadocs) @ qpid-java-doc-perftests ---
[INFO] 
[INFO] --- maven-gpg-plugin:1.6:sign (sign-release-artifacts) @ qpid-java-doc-perftests ---
[JENKINS] Archiving disabled
[JENKINS] Archiving disabled
[JENKINS] Archiving disabled
[JENKINS] Archiving disabled
[JENKINS] Archiving disabled
[JENKINS] Archiving disabled
[JENKINS] Archiving disabled
[JENKINS] Archiving disabled
[JENKINS] Archiving disabled
[JENKINS] Archiving disabled
[JENKINS] Archiving disabled
[JENKINS] Archiving disabled
[JENKINS] Archiving disabled
[JENKINS] Archiving disabled
[JENKINS] Archiving disabled
[JENKINS] Archiving disabled
[JENKINS] Archiving disabled
[JENKINS] Archiving disabled
[JENKINS] Archiving disabled
[JENKINS] Archiving disabled
[JENKINS] Archiving disabled
[JENKINS] Archiving disabled
[JENKINS] Archiving disabled
[JENKINS] Archiving disabled
[JENKINS] Archiving disabled
[JENKINS] Archiving disabled
[JENKINS] Archiving disabled
[JENKINS] Archiving disabled
[JENKINS] Archiving disabled
[JENKINS] Archiving disabled
[JENKINS] Archiving disabled
[JENKINS] Archiving disabled
[JENKINS] Archiving disabled
[JENKINS] Archiving disabled
[JENKINS] Archiving disabled
[JENKINS] Archiving disabled
[JENKINS] Archiving disabled
[JENKINS] Archiving disabled
[JENKINS] Archiving disabled
[JENKINS] Archiving disabled
[JENKINS] Archiving disabled
[JENKINS] Archiving disabled
[JENKINS] Archiving disabled
[JENKINS] Archiving disabled
[JENKINS] Archiving disabled
[JENKINS] Archiving disabled
[JENKINS] Archiving disabled[INFO] ------------------------------------------------------------------------
[INFO] Reactor Summary:
[INFO] 
[INFO] Apache Qpid Broker-J Parent ........................ SUCCESS [ 15.158 s]
[INFO] Apache Qpid Broker-J Code Generation ............... SUCCESS [ 10.501 s]
[INFO] Apache Qpid Broker-J Test Utilities ................ SUCCESS [  8.091 s]
[INFO] Apache Qpid Broker-J Core .......................... SUCCESS [ 52.537 s]
[INFO] Apache Qpid Broker-J LogBack Logging Plug-in ....... SUCCESS [ 11.750 s]
[INFO] Apache Qpid Broker-J Access Control Plug-in ........ SUCCESS [ 10.185 s]
[INFO] Apache Qpid Broker-J AMQP 0-10 Protocol Plug-in .... SUCCESS [ 14.543 s]
[INFO] Apache Qpid Broker-J AMQP 0-8 Protocol Plug-in ..... SUCCESS [ 14.685 s]
[INFO] Apache Qpid Broker-J AMQP 1-0 Protocol Plug-in ..... SUCCESS [ 23.080 s]
[INFO] Apache Qpid Broker-J AMQP 0-8 to 0-10 Message Conversion Plug-in SUCCESS [  6.789 s]
[INFO] Apache Qpid Broker-J AMQP 0-8 to 1-0 Message Conversion Plug-in SUCCESS [  7.240 s]
[INFO] Apache Qpid Broker-J AMQP 0-10 to 1-0 Message Conversion Plug-in SUCCESS [  7.103 s]
[INFO] Apache Qpid Broker-J JDBC Message Store Plug-in .... SUCCESS [ 10.670 s]
[INFO] Apache Qpid Broker-J Derby Message Store Plug-in ... SUCCESS [  9.225 s]
[INFO] Apache Qpid Broker-J JDBC Message Store Connection Pooling Plug-in SUCCESS [  7.009
s]
[INFO] Apache Qpid AMQP 1.0 JDBC Link Store Plug-in ....... SUCCESS [  6.845 s]
[INFO] Apache Qpid Broker-J HTTP Management Plug-in ....... SUCCESS [ 16.019 s]
[INFO] Apache Qpid Broker-J AMQP Management Protocol Plug-in SUCCESS [  7.326 s]
[INFO] Apache Qpid Broker-J Memory Message Store Plug-in .. SUCCESS [  8.175 s]
[INFO] Apache Qpid Broker-J WebSocket Plug-in ............. SUCCESS [  7.576 s]
[INFO] Apache Qpid Broker-J BDB Message Store Plug-in ..... SUCCESS [ 13.888 s]
[INFO] Apache Qpid AMQP 1.0 BDB Link Store Plug-in ........ SUCCESS [  7.282 s]
[INFO] Apache Qpid Broker-J ............................... SUCCESS [  7.907 s]
[INFO] Apache Qpid Broker-J Bundles ....................... FAILURE [  3.797 s]
[INFO] Apache Qpid Broker-J Tools ......................... SUCCESS [  7.204 s]
[INFO] Apache Qpid Broker-J System Test Parent ............ SUCCESS [  3.358 s]
[INFO] Apache Qpid Broker-J System Test Utils ............. SUCCESS [  5.694 s]
[INFO] Apache Qpid Broker-J JMS System Tests Core ......... SUCCESS [  6.033 s]
[INFO] Apache Qpid Broker-J JMS 1.1 System Tests .......... SUCCESS [ 13.618 s]
[INFO] Apache Qpid Broker-J JMS 2.0 System Tests .......... SUCCESS [  6.227 s]
[INFO] Apache Qpid Broker-J HTTP system tests ............. SUCCESS [  8.232 s]
[INFO] Apache Qpid Broker-J Protocol Tests Core ........... SUCCESS [  5.350 s]
[INFO] Apache Qpid Protocol Tests for AMQP 0-8,0-9,0-9-1 .. SUCCESS [  7.505 s]
[INFO] Apache Qpid Protocol Tests for AMQP 0-10 ........... SUCCESS [  6.841 s]
[INFO] Apache Qpid Protocol Tests for AMQP 1.0 ............ SUCCESS [  8.006 s]
[INFO] Apache Qpid Broker-J System Tests Spawn Broker Admin SUCCESS [  7.473 s]
[INFO] Apache Qpid Broker-J End to End Conversion Tests ... SUCCESS [ 15.795 s]
[INFO] Apache Qpid Broker-J Performance Tests ............. SUCCESS [ 15.729 s]
[INFO] Apache Qpid Broker-J Performance Test System Tests . SUCCESS [  7.074 s]
[INFO] Apache Qpid Broker-J Performance Tests Visualisation JFC SUCCESS [ 12.509 s]
[INFO] Apache Qpid Broker-J BDB Store System Tests ........ SUCCESS [  8.031 s]
[INFO] Apache Qpid Joram JMS Tests ........................ SUCCESS [  7.581 s]
[INFO] Apache Qpid Broker-J JMS TCK Configuration ......... SUCCESS [  6.754 s]
[INFO] Apache Qpid Broker-J Docbook ....................... SUCCESS [  3.400 s]
[INFO] Apache Qpid Broker-J Docbook ....................... SUCCESS [  6.951 s]
[INFO] Apache Qpid Broker-J Performance Test Docbook ...... SUCCESS [  5.286 s]
[INFO] ------------------------------------------------------------------------
[INFO] BUILD FAILURE
[INFO] ------------------------------------------------------------------------
[INFO] Total time: 10:52 min
[INFO] Finished at: 2018-10-08T16:41:29+00:00

[INFO] Final Memory: 211M/1608M
[INFO] ------------------------------------------------------------------------
[ERROR] Failed to execute goal org.apache.maven.plugins:maven-antrun-plugin:1.8:run (dependency-change-verification)
on project apache-qpid-broker-j: An Ant BuildException has occured: Generated dependency info
does not match the reference. Ensure LICENCE and NOTICE files are correct and then update
the reference by running again with -Dupdate-dependency-reference. Generated file: '<https://builds.apache.org/job/Qpid-Broker-J-Checks/ws/apache-qpid-broker-j/target/dependency-change-verification/PROCESSED_DEPENDENCIES_INFO'.>
Reference file: '<https://builds.apache.org/job/Qpid-Broker-J-Checks/ws/apache-qpid-broker-j/src/main/assembly/dependency-verification/DEPENDENCIES_REFERENCE'.>
[ERROR] around Ant part ...<fail message="Generated dependency info does not match the
reference. Ensure LICENCE and NOTICE files are correct and then update the reference by running
again with -Dupdate-dependency-reference. Generated file: &apos;${dependency-verification-output-file}&apos;.
Reference file: &apos;<https://builds.apache.org/job/Qpid-Broker-J-Checks/ws/apache-qpid-broker-j/src/main/assembly/dependency-verification/DEPENDENCIES_REFERENCE&apos;.">...>
@ 48:444 in <https://builds.apache.org/job/Qpid-Broker-J-Checks/ws/apache-qpid-broker-j/target/antrun/build-main.xml>
[ERROR] -> [Help 1]
org.apache.maven.lifecycle.LifecycleExecutionException: Failed to execute goal org.apache.maven.plugins:maven-antrun-plugin:1.8:run
(dependency-change-verification) on project apache-qpid-broker-j: An Ant BuildException has
occured: Generated dependency info does not match the reference. Ensure LICENCE and NOTICE
files are correct and then update the reference by running again with -Dupdate-dependency-reference.
Generated file: '<https://builds.apache.org/job/Qpid-Broker-J-Checks/ws/apache-qpid-broker-j/target/dependency-change-verification/PROCESSED_DEPENDENCIES_INFO'.>
Reference file: '<https://builds.apache.org/job/Qpid-Broker-J-Checks/ws/apache-qpid-broker-j/src/main/assembly/dependency-verification/DEPENDENCIES_REFERENCE'.>
around Ant part ...<fail message="Generated dependency info does not match the reference.
Ensure LICENCE and NOTICE files are correct and then update the reference by running again
with -Dupdate-dependency-reference. Generated file: &apos;${dependency-verification-output-file}&apos;.
Reference file: &apos;<https://builds.apache.org/job/Qpid-Broker-J-Checks/ws/apache-qpid-broker-j/src/main/assembly/dependency-verification/DEPENDENCIES_REFERENCE&apos;.">...>
@ 48:444 in <https://builds.apache.org/job/Qpid-Broker-J-Checks/ws/apache-qpid-broker-j/target/antrun/build-main.xml>
	at org.apache.maven.lifecycle.internal.MojoExecutor.execute(MojoExecutor.java:212)
	at org.apache.maven.lifecycle.internal.MojoExecutor.execute(MojoExecutor.java:153)
	at org.apache.maven.lifecycle.internal.MojoExecutor.execute(MojoExecutor.java:145)
	at org.apache.maven.lifecycle.internal.LifecycleModuleBuilder.buildProject(LifecycleModuleBuilder.java:116)
	at org.apache.maven.lifecycle.internal.LifecycleModuleBuilder.buildProject(LifecycleModuleBuilder.java:80)
	at org.apache.maven.lifecycle.internal.builder.singlethreaded.SingleThreadedBuilder.build(SingleThreadedBuilder.java:51)
	at org.apache.maven.lifecycle.internal.LifecycleStarter.execute(LifecycleStarter.java:128)
	at org.apache.maven.DefaultMaven.doExecute(DefaultMaven.java:307)
	at org.apache.maven.DefaultMaven.doExecute(DefaultMaven.java:193)
	at org.apache.maven.DefaultMaven.execute(DefaultMaven.java:106)
	at org.jvnet.hudson.maven3.launcher.Maven33Launcher.main(Maven33Launcher.java:129)
	at sun.reflect.NativeMethodAccessorImpl.invoke0(Native Method)
	at sun.reflect.NativeMethodAccessorImpl.invoke(NativeMethodAccessorImpl.java:62)
	at sun.reflect.DelegatingMethodAccessorImpl.invoke(DelegatingMethodAccessorImpl.java:43)
	at java.lang.reflect.Method.invoke(Method.java:498)
	at org.codehaus.plexus.classworlds.launcher.Launcher.launchStandard(Launcher.java:330)
	at org.codehaus.plexus.classworlds.launcher.Launcher.launch(Launcher.java:238)
	at jenkins.maven3.agent.Maven33Main.launch(Maven33Main.java:176)
	at sun.reflect.NativeMethodAccessorImpl.invoke0(Native Method)
	at sun.reflect.NativeMethodAccessorImpl.invoke(NativeMethodAccessorImpl.java:62)
	at sun.reflect.DelegatingMethodAccessorImpl.invoke(DelegatingMethodAccessorImpl.java:43)
	at java.lang.reflect.Method.invoke(Method.java:498)
	at hudson.maven.Maven3Builder.call(Maven3Builder.java:139)
	at hudson.maven.Maven3Builder.call(Maven3Builder.java:70)
	at hudson.remoting.UserRequest.perform(UserRequest.java:212)
	at hudson.remoting.UserRequest.perform(UserRequest.java:54)
	at hudson.remoting.Request$2.run(Request.java:369)
	at hudson.remoting.InterceptingExecutorService$1.call(InterceptingExecutorService.java:72)
	at java.util.concurrent.FutureTask.run(FutureTask.java:266)
	at java.util.concurrent.ThreadPoolExecutor.runWorker(ThreadPoolExecutor.java:1149)
	at java.util.concurrent.ThreadPoolExecutor$Worker.run(ThreadPoolExecutor.java:624)
	at java.lang.Thread.run(Thread.java:748)
Caused by: org.apache.maven.plugin.MojoExecutionException: An Ant BuildException has occured:
Generated dependency info does not match the reference. Ensure LICENCE and NOTICE files are
correct and then update the reference by running again with -Dupdate-dependency-reference.
Generated file: '<https://builds.apache.org/job/Qpid-Broker-J-Checks/ws/apache-qpid-broker-j/target/dependency-change-verification/PROCESSED_DEPENDENCIES_INFO'.>
Reference file: '<https://builds.apache.org/job/Qpid-Broker-J-Checks/ws/apache-qpid-broker-j/src/main/assembly/dependency-verification/DEPENDENCIES_REFERENCE'.>
around Ant part ...<fail message="Generated dependency info does not match the reference.
Ensure LICENCE and NOTICE files are correct and then update the reference by running again
with -Dupdate-dependency-reference. Generated file: &apos;${dependency-verification-output-file}&apos;.
Reference file: &apos;<https://builds.apache.org/job/Qpid-Broker-J-Checks/ws/apache-qpid-broker-j/src/main/assembly/dependency-verification/DEPENDENCIES_REFERENCE&apos;.">...>
@ 48:444 in <https://builds.apache.org/job/Qpid-Broker-J-Checks/ws/apache-qpid-broker-j/target/antrun/build-main.xml>
	at org.apache.maven.plugin.antrun.AntRunMojo.execute(AntRunMojo.java:342)
	at org.apache.maven.plugin.DefaultBuildPluginManager.executeMojo(DefaultBuildPluginManager.java:134)
	at org.apache.maven.lifecycle.internal.MojoExecutor.execute(MojoExecutor.java:207)
	... 31 more
Caused by: <https://builds.apache.org/job/Qpid-Broker-J-Checks/ws/apache-qpid-broker-j/target/antrun/build-main.xml>:48:
Generated dependency info does not match the reference. Ensure LICENCE and NOTICE files are
correct and then update the reference by running again with -Dupdate-dependency-reference.
Generated file: '<https://builds.apache.org/job/Qpid-Broker-J-Checks/ws/apache-qpid-broker-j/target/dependency-change-verification/PROCESSED_DEPENDENCIES_INFO'.>
Reference file: '<https://builds.apache.org/job/Qpid-Broker-J-Checks/ws/apache-qpid-broker-j/src/main/assembly/dependency-verification/DEPENDENCIES_REFERENCE'.>
	at org.apache.tools.ant.taskdefs.Exit.execute(Exit.java:164)
	at org.apache.tools.ant.UnknownElement.execute(UnknownElement.java:292)
	at sun.reflect.GeneratedMethodAccessor38.invoke(Unknown Source)
	at sun.reflect.DelegatingMethodAccessorImpl.invoke(DelegatingMethodAccessorImpl.java:43)
	at java.lang.reflect.Method.invoke(Method.java:498)
	at org.apache.tools.ant.dispatch.DispatchUtils.execute(DispatchUtils.java:106)
	at org.apache.tools.ant.Task.perform(Task.java:348)
	at org.apache.tools.ant.Target.execute(Target.java:435)
	at org.apache.tools.ant.Target.performTasks(Target.java:456)
	at org.apache.tools.ant.Project.executeSortedTargets(Project.java:1393)
	at org.apache.tools.ant.Project.executeTarget(Project.java:1364)
	at org.apache.maven.plugin.antrun.AntRunMojo.execute(AntRunMojo.java:313)
	... 33 more
[ERROR] 
[ERROR] Re-run Maven using the -X switch to enable full debug logging.
[ERROR] 
[ERROR] For more information about the errors and possible solutions, please read the following
articles:
[ERROR] [Help 1] http://cwiki.apache.org/confluence/display/MAVEN/MojoExecutionException
[ERROR] 
[ERROR] After correcting the problems, you can resume the build with the command
[ERROR]   mvn <goals> -rf :apache-qpid-broker-j
channel stopped
Archiving artifacts

Mime
View raw message