qpid-notifications mailing list archives

Site index · List index
Message view « Date » · « Thread »
Top « Date » · « Thread »
From Apache Jenkins Server <jenk...@builds.apache.org>
Subject Build failed in Jenkins: Qpid-Broker-J-TestMatrix » ubuntu,JDK 1.8 (latest),java-mms.0-9-1 #4245
Date Thu, 05 Jul 2018 14:27:09 GMT
See <https://builds.apache.org/job/Qpid-Broker-J-TestMatrix/Ubuntu%20Slaves=ubuntu,jdk=JDK%201.8%20(latest),profile=java-mms.0-9-1/4245/display/redirect>

------------------------------------------
[...truncated 3.30 KB...]
	at java.util.concurrent.ThreadPoolExecutor.runWorker(ThreadPoolExecutor.java:1142)
	at java.util.concurrent.ThreadPoolExecutor$Worker.run(ThreadPoolExecutor.java:617)
	at java.lang.Thread.run(Thread.java:748)
Caused: java.io.IOException: remote file operation failed: <https://builds.apache.org/job/Qpid-Broker-J-TestMatrix/Ubuntu%20Slaves=ubuntu,jdk=JDK%201.8%20(latest),profile=java-mms.0-9-1/ws/>
at hudson.remoting.Channel@410bfcd:H29
	at hudson.FilePath.act(FilePath.java:1043)
	at hudson.FilePath.act(FilePath.java:1025)
	at hudson.FilePath.mkdirs(FilePath.java:1213)
	at hudson.model.AbstractProject.checkout(AbstractProject.java:1202)
	at hudson.model.AbstractBuild$AbstractBuildExecution.defaultCheckout(AbstractBuild.java:574)
	at jenkins.scm.SCMCheckoutStrategy.checkout(SCMCheckoutStrategy.java:86)
	at hudson.model.AbstractBuild$AbstractBuildExecution.run(AbstractBuild.java:499)
	at hudson.model.Run.execute(Run.java:1794)
	at hudson.matrix.MatrixRun.run(MatrixRun.java:153)
	at hudson.model.ResourceController.execute(ResourceController.java:97)
	at hudson.model.Executor.run(Executor.java:429)
Retrying after 10 seconds
Also:   hudson.remoting.Channel$CallSiteStackTrace: Remote call to H29
		at hudson.remoting.Channel.attachCallSiteStackTrace(Channel.java:1741)
		at hudson.remoting.UserRequest$ExceptionResponse.retrieve(UserRequest.java:357)
		at hudson.remoting.Channel.call(Channel.java:955)
		at hudson.FilePath.act(FilePath.java:1036)
		at hudson.FilePath.act(FilePath.java:1025)
		at hudson.FilePath.mkdirs(FilePath.java:1213)
		at hudson.model.AbstractProject.checkout(AbstractProject.java:1202)
		at hudson.model.AbstractBuild$AbstractBuildExecution.defaultCheckout(AbstractBuild.java:574)
		at jenkins.scm.SCMCheckoutStrategy.checkout(SCMCheckoutStrategy.java:86)
		at hudson.model.AbstractBuild$AbstractBuildExecution.run(AbstractBuild.java:499)
		at hudson.model.Run.execute(Run.java:1794)
		at hudson.matrix.MatrixRun.run(MatrixRun.java:153)
		at hudson.model.ResourceController.execute(ResourceController.java:97)
		at hudson.model.Executor.run(Executor.java:429)
java.nio.file.FileSystemException: <https://builds.apache.org/job/Qpid-Broker-J-TestMatrix/Ubuntu%20Slaves=ubuntu,jdk=JDK%201.8%20(latest),profile=java-mms.0-9-1/ws/>:
No space left on device
	at sun.nio.fs.UnixException.translateToIOException(UnixException.java:91)
	at sun.nio.fs.UnixException.rethrowAsIOException(UnixException.java:102)
	at sun.nio.fs.UnixException.rethrowAsIOException(UnixException.java:107)
	at sun.nio.fs.UnixFileSystemProvider.createDirectory(UnixFileSystemProvider.java:384)
	at java.nio.file.Files.createDirectory(Files.java:674)
	at java.nio.file.Files.createAndCheckIsDirectory(Files.java:781)
	at java.nio.file.Files.createDirectories(Files.java:767)
	at hudson.FilePath.mkdirs(FilePath.java:3103)
	at hudson.FilePath.access$900(FilePath.java:209)
	at hudson.FilePath$Mkdirs.invoke(FilePath.java:1221)
	at hudson.FilePath$Mkdirs.invoke(FilePath.java:1217)
	at hudson.FilePath$FileCallableWrapper.call(FilePath.java:2918)
	at hudson.remoting.UserRequest.perform(UserRequest.java:212)
	at hudson.remoting.UserRequest.perform(UserRequest.java:54)
	at hudson.remoting.Request$2.run(Request.java:369)
	at hudson.remoting.InterceptingExecutorService$1.call(InterceptingExecutorService.java:72)
	at java.util.concurrent.FutureTask.run(FutureTask.java:266)
	at java.util.concurrent.ThreadPoolExecutor.runWorker(ThreadPoolExecutor.java:1142)
	at java.util.concurrent.ThreadPoolExecutor$Worker.run(ThreadPoolExecutor.java:617)
	at java.lang.Thread.run(Thread.java:748)
Caused: java.io.IOException: remote file operation failed: <https://builds.apache.org/job/Qpid-Broker-J-TestMatrix/Ubuntu%20Slaves=ubuntu,jdk=JDK%201.8%20(latest),profile=java-mms.0-9-1/ws/>
at hudson.remoting.Channel@410bfcd:H29
	at hudson.FilePath.act(FilePath.java:1043)
	at hudson.FilePath.act(FilePath.java:1025)
	at hudson.FilePath.mkdirs(FilePath.java:1213)
	at hudson.model.AbstractProject.checkout(AbstractProject.java:1202)
	at hudson.model.AbstractBuild$AbstractBuildExecution.defaultCheckout(AbstractBuild.java:574)
	at jenkins.scm.SCMCheckoutStrategy.checkout(SCMCheckoutStrategy.java:86)
	at hudson.model.AbstractBuild$AbstractBuildExecution.run(AbstractBuild.java:499)
	at hudson.model.Run.execute(Run.java:1794)
	at hudson.matrix.MatrixRun.run(MatrixRun.java:153)
	at hudson.model.ResourceController.execute(ResourceController.java:97)
	at hudson.model.Executor.run(Executor.java:429)
Retrying after 10 seconds
Also:   hudson.remoting.Channel$CallSiteStackTrace: Remote call to H29
		at hudson.remoting.Channel.attachCallSiteStackTrace(Channel.java:1741)
		at hudson.remoting.UserRequest$ExceptionResponse.retrieve(UserRequest.java:357)
		at hudson.remoting.Channel.call(Channel.java:955)
		at hudson.FilePath.act(FilePath.java:1036)
		at hudson.FilePath.act(FilePath.java:1025)
		at hudson.FilePath.mkdirs(FilePath.java:1213)
		at hudson.model.AbstractProject.checkout(AbstractProject.java:1202)
		at hudson.model.AbstractBuild$AbstractBuildExecution.defaultCheckout(AbstractBuild.java:574)
		at jenkins.scm.SCMCheckoutStrategy.checkout(SCMCheckoutStrategy.java:86)
		at hudson.model.AbstractBuild$AbstractBuildExecution.run(AbstractBuild.java:499)
		at hudson.model.Run.execute(Run.java:1794)
		at hudson.matrix.MatrixRun.run(MatrixRun.java:153)
		at hudson.model.ResourceController.execute(ResourceController.java:97)
		at hudson.model.Executor.run(Executor.java:429)
java.nio.file.FileSystemException: <https://builds.apache.org/job/Qpid-Broker-J-TestMatrix/Ubuntu%20Slaves=ubuntu,jdk=JDK%201.8%20(latest),profile=java-mms.0-9-1/ws/>:
No space left on device
	at sun.nio.fs.UnixException.translateToIOException(UnixException.java:91)
	at sun.nio.fs.UnixException.rethrowAsIOException(UnixException.java:102)
	at sun.nio.fs.UnixException.rethrowAsIOException(UnixException.java:107)
	at sun.nio.fs.UnixFileSystemProvider.createDirectory(UnixFileSystemProvider.java:384)
	at java.nio.file.Files.createDirectory(Files.java:674)
	at java.nio.file.Files.createAndCheckIsDirectory(Files.java:781)
	at java.nio.file.Files.createDirectories(Files.java:767)
	at hudson.FilePath.mkdirs(FilePath.java:3103)
	at hudson.FilePath.access$900(FilePath.java:209)
	at hudson.FilePath$Mkdirs.invoke(FilePath.java:1221)
	at hudson.FilePath$Mkdirs.invoke(FilePath.java:1217)
	at hudson.FilePath$FileCallableWrapper.call(FilePath.java:2918)
	at hudson.remoting.UserRequest.perform(UserRequest.java:212)
	at hudson.remoting.UserRequest.perform(UserRequest.java:54)
	at hudson.remoting.Request$2.run(Request.java:369)
	at hudson.remoting.InterceptingExecutorService$1.call(InterceptingExecutorService.java:72)
	at java.util.concurrent.FutureTask.run(FutureTask.java:266)
	at java.util.concurrent.ThreadPoolExecutor.runWorker(ThreadPoolExecutor.java:1142)
	at java.util.concurrent.ThreadPoolExecutor$Worker.run(ThreadPoolExecutor.java:617)
	at java.lang.Thread.run(Thread.java:748)
Caused: java.io.IOException: remote file operation failed: <https://builds.apache.org/job/Qpid-Broker-J-TestMatrix/Ubuntu%20Slaves=ubuntu,jdk=JDK%201.8%20(latest),profile=java-mms.0-9-1/ws/>
at hudson.remoting.Channel@410bfcd:H29
	at hudson.FilePath.act(FilePath.java:1043)
	at hudson.FilePath.act(FilePath.java:1025)
	at hudson.FilePath.mkdirs(FilePath.java:1213)
	at hudson.model.AbstractProject.checkout(AbstractProject.java:1202)
	at hudson.model.AbstractBuild$AbstractBuildExecution.defaultCheckout(AbstractBuild.java:574)
	at jenkins.scm.SCMCheckoutStrategy.checkout(SCMCheckoutStrategy.java:86)
	at hudson.model.AbstractBuild$AbstractBuildExecution.run(AbstractBuild.java:499)
	at hudson.model.Run.execute(Run.java:1794)
	at hudson.matrix.MatrixRun.run(MatrixRun.java:153)
	at hudson.model.ResourceController.execute(ResourceController.java:97)
	at hudson.model.Executor.run(Executor.java:429)
Archiving artifacts
ERROR: Build step failed with exception
Also:   hudson.remoting.Channel$CallSiteStackTrace: Remote call to H29
		at hudson.remoting.Channel.attachCallSiteStackTrace(Channel.java:1741)
		at hudson.remoting.UserRequest$ExceptionResponse.retrieve(UserRequest.java:357)
		at hudson.remoting.Channel.call(Channel.java:955)
		at hudson.FilePath.act(FilePath.java:1036)
		at hudson.FilePath.act(FilePath.java:1025)
		at hudson.tasks.ArtifactArchiver.perform(ArtifactArchiver.java:233)
		at hudson.tasks.BuildStepCompatibilityLayer.perform(BuildStepCompatibilityLayer.java:81)
		at hudson.tasks.BuildStepMonitor$1.perform(BuildStepMonitor.java:20)
		at hudson.model.AbstractBuild$AbstractBuildExecution.perform(AbstractBuild.java:744)
		at hudson.model.AbstractBuild$AbstractBuildExecution.performAllBuildSteps(AbstractBuild.java:690)
		at hudson.model.Build$BuildExecution.post2(Build.java:186)
		at hudson.model.AbstractBuild$AbstractBuildExecution.post(AbstractBuild.java:635)
		at hudson.model.Run.execute(Run.java:1819)
		at hudson.matrix.MatrixRun.run(MatrixRun.java:153)
		at hudson.model.ResourceController.execute(ResourceController.java:97)
		at hudson.model.Executor.run(Executor.java:429)
<https://builds.apache.org/job/Qpid-Broker-J-TestMatrix/Ubuntu%20Slaves=ubuntu,jdk=JDK%201.8%20(latest),profile=java-mms.0-9-1/ws/>
does not exist.
	at org.apache.tools.ant.types.AbstractFileSet.getDirectoryScanner(AbstractFileSet.java:484)
	at org.apache.tools.ant.types.AbstractFileSet.getDirectoryScanner(AbstractFileSet.java:461)
	at hudson.tasks.ArtifactArchiver$ListFiles.invoke(ArtifactArchiver.java:288)
	at hudson.tasks.ArtifactArchiver$ListFiles.invoke(ArtifactArchiver.java:268)
	at hudson.FilePath$FileCallableWrapper.call(FilePath.java:2918)
	at hudson.remoting.UserRequest.perform(UserRequest.java:212)
	at hudson.remoting.UserRequest.perform(UserRequest.java:54)
	at hudson.remoting.Request$2.run(Request.java:369)
	at hudson.remoting.InterceptingExecutorService$1.call(InterceptingExecutorService.java:72)
	at java.util.concurrent.FutureTask.run(FutureTask.java:266)
	at java.util.concurrent.ThreadPoolExecutor.runWorker(ThreadPoolExecutor.java:1142)
	at java.util.concurrent.ThreadPoolExecutor$Worker.run(ThreadPoolExecutor.java:617)
	at java.lang.Thread.run(Thread.java:748)
Build step 'Archive the artifacts' marked build as failure
Performing Post build task...
Match found for : : True
Logical operation result is TRUE
Running script  : echo Finishing build
date
FATAL: Unable to produce a script file
Also:   hudson.remoting.Channel$CallSiteStackTrace: Remote call to H29
		at hudson.remoting.Channel.attachCallSiteStackTrace(Channel.java:1741)
		at hudson.remoting.UserRequest$ExceptionResponse.retrieve(UserRequest.java:357)
		at hudson.remoting.Channel.call(Channel.java:955)
		at hudson.FilePath.act(FilePath.java:1036)
		at hudson.FilePath.act(FilePath.java:1025)
		at hudson.FilePath.createTextTempFile(FilePath.java:1423)
		at hudson.tasks.CommandInterpreter.createScriptFile(CommandInterpreter.java:162)
		at hudson.tasks.CommandInterpreter.perform(CommandInterpreter.java:94)
		at hudson.tasks.CommandInterpreter.perform(CommandInterpreter.java:66)
		at hudson.plugins.postbuildtask.PostbuildTask.perform(PostbuildTask.java:123)
		at hudson.tasks.BuildStepMonitor$1.perform(BuildStepMonitor.java:20)
		at hudson.model.AbstractBuild$AbstractBuildExecution.perform(AbstractBuild.java:744)
		at hudson.model.AbstractBuild$AbstractBuildExecution.performAllBuildSteps(AbstractBuild.java:690)
		at hudson.model.Build$BuildExecution.post2(Build.java:186)
		at hudson.model.AbstractBuild$AbstractBuildExecution.post(AbstractBuild.java:635)
		at hudson.model.Run.execute(Run.java:1819)
		at hudson.matrix.MatrixRun.run(MatrixRun.java:153)
		at hudson.model.ResourceController.execute(ResourceController.java:97)
		at hudson.model.Executor.run(Executor.java:429)
java.io.IOException: No space left on device
	at java.io.FileOutputStream.writeBytes(Native Method)
	at java.io.FileOutputStream.write(FileOutputStream.java:326)
	at sun.nio.cs.StreamEncoder.writeBytes(StreamEncoder.java:221)
	at sun.nio.cs.StreamEncoder.implClose(StreamEncoder.java:316)
	at sun.nio.cs.StreamEncoder.close(StreamEncoder.java:149)
	at java.io.OutputStreamWriter.close(OutputStreamWriter.java:233)
	at hudson.FilePath$CreateTextTempFile.invoke(FilePath.java:1456)
	at hudson.FilePath$CreateTextTempFile.invoke(FilePath.java:1428)
	at hudson.FilePath$FileCallableWrapper.call(FilePath.java:2918)
	at hudson.remoting.UserRequest.perform(UserRequest.java:212)
	at hudson.remoting.UserRequest.perform(UserRequest.java:54)
	at hudson.remoting.Request$2.run(Request.java:369)
	at hudson.remoting.InterceptingExecutorService$1.call(InterceptingExecutorService.java:72)
	at java.util.concurrent.FutureTask.run(FutureTask.java:266)
	at java.util.concurrent.ThreadPoolExecutor.runWorker(ThreadPoolExecutor.java:1142)
	at java.util.concurrent.ThreadPoolExecutor$Worker.run(ThreadPoolExecutor.java:617)
	at java.lang.Thread.run(Thread.java:748)
Caused: java.io.IOException: remote file operation failed: <https://builds.apache.org/job/Qpid-Broker-J-TestMatrix/Ubuntu%20Slaves=ubuntu,jdk=JDK%201.8%20(latest),profile=java-mms.0-9-1/ws/>
at hudson.remoting.Channel@410bfcd:H29
	at hudson.FilePath.act(FilePath.java:1043)
	at hudson.FilePath.act(FilePath.java:1025)
	at hudson.FilePath.createTextTempFile(FilePath.java:1423)
Caused: java.io.IOException: Failed to create a temp file on <https://builds.apache.org/job/Qpid-Broker-J-TestMatrix/Ubuntu%20Slaves=ubuntu,jdk=JDK%201.8%20(latest),profile=java-mms.0-9-1/ws/>
	at hudson.FilePath.createTextTempFile(FilePath.java:1425)
	at hudson.tasks.CommandInterpreter.createScriptFile(CommandInterpreter.java:162)
	at hudson.tasks.CommandInterpreter.perform(CommandInterpreter.java:94)
	at hudson.tasks.CommandInterpreter.perform(CommandInterpreter.java:66)
	at hudson.plugins.postbuildtask.PostbuildTask.perform(PostbuildTask.java:123)
	at hudson.tasks.BuildStepMonitor$1.perform(BuildStepMonitor.java:20)
	at hudson.model.AbstractBuild$AbstractBuildExecution.perform(AbstractBuild.java:744)
	at hudson.model.AbstractBuild$AbstractBuildExecution.performAllBuildSteps(AbstractBuild.java:690)
	at hudson.model.Build$BuildExecution.post2(Build.java:186)
	at hudson.model.AbstractBuild$AbstractBuildExecution.post(AbstractBuild.java:635)
	at hudson.model.Run.execute(Run.java:1819)
	at hudson.matrix.MatrixRun.run(MatrixRun.java:153)
	at hudson.model.ResourceController.execute(ResourceController.java:97)
	at hudson.model.Executor.run(Executor.java:429)
POST BUILD TASK : FAILURE
END OF POST BUILD TASK : 0
Recording test results
ERROR: Build step failed with exception
Also:   hudson.remoting.Channel$CallSiteStackTrace: Remote call to H29
		at hudson.remoting.Channel.attachCallSiteStackTrace(Channel.java:1741)
		at hudson.remoting.UserRequest$ExceptionResponse.retrieve(UserRequest.java:357)
		at hudson.remoting.Channel.call(Channel.java:955)
		at hudson.FilePath.act(FilePath.java:1036)
		at hudson.FilePath.act(FilePath.java:1025)
		at hudson.tasks.junit.JUnitParser.parseResult(JUnitParser.java:114)
		at hudson.tasks.junit.JUnitResultArchiver.parse(JUnitResultArchiver.java:136)
		at hudson.tasks.junit.JUnitResultArchiver.parseAndAttach(JUnitResultArchiver.java:166)
		at hudson.tasks.junit.JUnitResultArchiver.perform(JUnitResultArchiver.java:153)
		at hudson.tasks.BuildStepCompatibilityLayer.perform(BuildStepCompatibilityLayer.java:81)
		at hudson.tasks.BuildStepMonitor$1.perform(BuildStepMonitor.java:20)
		at hudson.model.AbstractBuild$AbstractBuildExecution.perform(AbstractBuild.java:744)
		at hudson.model.AbstractBuild$AbstractBuildExecution.performAllBuildSteps(AbstractBuild.java:690)
		at hudson.model.Build$BuildExecution.post2(Build.java:186)
		at hudson.model.AbstractBuild$AbstractBuildExecution.post(AbstractBuild.java:635)
		at hudson.model.Run.execute(Run.java:1819)
		at hudson.matrix.MatrixRun.run(MatrixRun.java:153)
		at hudson.model.ResourceController.execute(ResourceController.java:97)
		at hudson.model.Executor.run(Executor.java:429)
<https://builds.apache.org/job/Qpid-Broker-J-TestMatrix/Ubuntu%20Slaves=ubuntu,jdk=JDK%201.8%20(latest),profile=java-mms.0-9-1/ws/>
does not exist.
	at org.apache.tools.ant.types.AbstractFileSet.getDirectoryScanner(AbstractFileSet.java:484)
	at org.apache.tools.ant.types.AbstractFileSet.getDirectoryScanner(AbstractFileSet.java:461)
	at hudson.tasks.junit.JUnitParser$ParseResultCallable.invoke(JUnitParser.java:141)
	at hudson.tasks.junit.JUnitParser$ParseResultCallable.invoke(JUnitParser.java:118)
	at hudson.FilePath$FileCallableWrapper.call(FilePath.java:2918)
	at hudson.remoting.UserRequest.perform(UserRequest.java:212)
	at hudson.remoting.UserRequest.perform(UserRequest.java:54)
	at hudson.remoting.Request$2.run(Request.java:369)
	at hudson.remoting.InterceptingExecutorService$1.call(InterceptingExecutorService.java:72)
	at java.util.concurrent.FutureTask.run(FutureTask.java:266)
	at java.util.concurrent.ThreadPoolExecutor.runWorker(ThreadPoolExecutor.java:1142)
	at java.util.concurrent.ThreadPoolExecutor$Worker.run(ThreadPoolExecutor.java:617)
	at java.lang.Thread.run(Thread.java:748)
Build step 'Publish JUnit test result report' marked build as failure

Mime
View raw message