qpid-notifications mailing list archives

Site index · List index
Message view « Date » · « Thread »
Top « Date » · « Thread »
From Apache Jenkins Server <jenk...@builds.apache.org>
Subject Build failed in Jenkins: Qpid-JMS-AMQP-0-x-Artefact-Release-6.3.x #16
Date Fri, 13 Jul 2018 10:16:43 GMT
See <https://builds.apache.org/job/Qpid-JMS-AMQP-0-x-Artefact-Release-6.3.x/16/display/redirect?page=changes>

Changes:

[orudyy] QPID-8212: Improve handling of received method frames

[orudyy] QPID-8212: Throw exception only when session is not closing

------------------------------------------
Started by an SCM change
[EnvInject] - Loading node environment variables.
Building remotely on H21 (ubuntu xenial) in workspace <https://builds.apache.org/job/Qpid-JMS-AMQP-0-x-Artefact-Release-6.3.x/ws/>
Cloning the remote Git repository
Cloning repository https://git-wip-us.apache.org/repos/asf/qpid-jms-amqp-0-x.git
 > git init <https://builds.apache.org/job/Qpid-JMS-AMQP-0-x-Artefact-Release-6.3.x/ws/>
# timeout=10
Fetching upstream changes from https://git-wip-us.apache.org/repos/asf/qpid-jms-amqp-0-x.git
 > git --version # timeout=10
 > git fetch --tags --progress https://git-wip-us.apache.org/repos/asf/qpid-jms-amqp-0-x.git
+refs/heads/*:refs/remotes/origin/*
 > git config remote.origin.url https://git-wip-us.apache.org/repos/asf/qpid-jms-amqp-0-x.git
# timeout=10
 > git config --add remote.origin.fetch +refs/heads/*:refs/remotes/origin/* # timeout=10
 > git config remote.origin.url https://git-wip-us.apache.org/repos/asf/qpid-jms-amqp-0-x.git
# timeout=10
Cleaning workspace
 > git rev-parse --verify HEAD # timeout=10
No valid HEAD. Skipping the resetting
 > git clean -fdx # timeout=10
Fetching upstream changes from https://git-wip-us.apache.org/repos/asf/qpid-jms-amqp-0-x.git
 > git fetch --tags --progress https://git-wip-us.apache.org/repos/asf/qpid-jms-amqp-0-x.git
+refs/heads/*:refs/remotes/origin/*
 > git rev-parse refs/remotes/origin/6.3.x^{commit} # timeout=10
 > git rev-parse refs/remotes/origin/origin/6.3.x^{commit} # timeout=10
Checking out Revision ea1292afb3638ae737f7f502ece3677356a5332f (refs/remotes/origin/6.3.x)
 > git config core.sparsecheckout # timeout=10
 > git checkout -f ea1292afb3638ae737f7f502ece3677356a5332f
Commit message: "QPID-8212: Throw exception only when session is not closing"
 > git rev-list --no-walk 242099b05b78d2a8c8360df10619d066f509891e # timeout=10
[Qpid-JMS-AMQP-0-x-Artefact-Release-6.3.x] $ /home/jenkins/tools/maven/latest3/bin/mvn -f
./pom.xml -DskipTests=true clean package
[INFO] Scanning for projects...
[INFO] ------------------------------------------------------------------------
[INFO] Reactor Build Order:
[INFO] 
[INFO] Apache Qpid JMS AMQP 0-x Parent
[INFO] Apache Qpid JMS AMQP 0-x
[INFO] Apache Qpid JMS AMQP 0-x Bundles
[INFO] Apache Qpid JMS AMQP 0-x Examples
[INFO] Apache Qpid JMS AMQP 0-x Docbook
[INFO] Apache Qpid JMS AMQP 0-8, 0-9 and 0-9-1 Docbook
[INFO] Apache Qpid JMS AMQP 0-10 Docbook
[INFO] 
[INFO] ------------------------------------------------------------------------
[INFO] Building Apache Qpid JMS AMQP 0-x Parent 6.3.2-SNAPSHOT
[INFO] ------------------------------------------------------------------------
[INFO] 
[INFO] --- maven-clean-plugin:3.0.0:clean (default-clean) @ qpid-jms-amqp-0-x-parent ---
[INFO] 
[INFO] --- maven-enforcer-plugin:1.4.1:enforce (enforce-minimum-versions) @ qpid-jms-amqp-0-x-parent
---
[INFO] 
[INFO] --- jacoco-maven-plugin:0.7.5.201505241946:prepare-agent (default-prepare-agent) @
qpid-jms-amqp-0-x-parent ---
[INFO] argLine set to -javaagent:/home/jenkins/.m2/repository/org/jacoco/org.jacoco.agent/0.7.5.201505241946/org.jacoco.agent-0.7.5.201505241946-runtime.jar=destfile=<https://builds.apache.org/job/Qpid-JMS-AMQP-0-x-Artefact-Release-6.3.x/ws/./target/jacoco.exec>
[INFO] 
[INFO] --- maven-remote-resources-plugin:1.5:process (process-resource-bundles) @ qpid-jms-amqp-0-x-parent
---
[INFO] 
[INFO] --- maven-site-plugin:3.5.1:attach-descriptor (attach-descriptor) @ qpid-jms-amqp-0-x-parent
---
[INFO] 
[INFO] ------------------------------------------------------------------------
[INFO] Building Apache Qpid JMS AMQP 0-x 6.3.2-SNAPSHOT
[INFO] ------------------------------------------------------------------------
[INFO] 
[INFO] --- maven-clean-plugin:3.0.0:clean (default-clean) @ qpid-client ---
[INFO] 
[INFO] --- maven-enforcer-plugin:1.4.1:enforce (enforce-minimum-versions) @ qpid-client ---
[INFO] 
[INFO] --- buildnumber-maven-plugin:1.3:create (default) @ qpid-client ---
[INFO] Executing: /bin/sh -c cd <https://builds.apache.org/job/Qpid-JMS-AMQP-0-x-Artefact-Release-6.3.x/ws/client>
&& git rev-parse --verify HEAD
[INFO] Working directory: <https://builds.apache.org/job/Qpid-JMS-AMQP-0-x-Artefact-Release-6.3.x/ws/client>
[INFO] Storing buildNumber: ea1292afb3638ae737f7f502ece3677356a5332f at timestamp: 1531476983475
[WARNING] Cannot get the branch information from the git repository: 
Detecting the current branch failed: fatal: ref HEAD is not a symbolic ref

[INFO] Executing: /bin/sh -c cd <https://builds.apache.org/job/Qpid-JMS-AMQP-0-x-Artefact-Release-6.3.x/ws/client>
&& git rev-parse --verify HEAD
[INFO] Working directory: <https://builds.apache.org/job/Qpid-JMS-AMQP-0-x-Artefact-Release-6.3.x/ws/client>
[INFO] Storing buildScmBranch: UNKNOWN
[INFO] 
[INFO] --- jacoco-maven-plugin:0.7.5.201505241946:prepare-agent (default-prepare-agent) @
qpid-client ---
[INFO] argLine set to -javaagent:/home/jenkins/.m2/repository/org/jacoco/org.jacoco.agent/0.7.5.201505241946/org.jacoco.agent-0.7.5.201505241946-runtime.jar=destfile=<https://builds.apache.org/job/Qpid-JMS-AMQP-0-x-Artefact-Release-6.3.x/ws/client/target/jacoco.exec>
[INFO] 
[INFO] --- maven-remote-resources-plugin:1.5:process (process-resource-bundles) @ qpid-client
---
[INFO] 
[INFO] --- maven-resources-plugin:2.7:resources (default-resources) @ qpid-client ---
[INFO] Using 'UTF-8' encoding to copy filtered resources.
[INFO] Copying 1 resource
[INFO] Copying 4 resources
[INFO] Copying 3 resources
[INFO] 
[INFO] --- maven-compiler-plugin:3.5.1:compile (default-compile) @ qpid-client ---
[INFO] Compiling 553 source files to <https://builds.apache.org/job/Qpid-JMS-AMQP-0-x-Artefact-Release-6.3.x/ws/client/target/classes>
[INFO] <https://builds.apache.org/job/Qpid-JMS-AMQP-0-x-Artefact-Release-6.3.x/ws/client/src/main/java/org/apache/qpid/framing/FieldTable.java>:
Some input files use unchecked or unsafe operations.
[INFO] <https://builds.apache.org/job/Qpid-JMS-AMQP-0-x-Artefact-Release-6.3.x/ws/client/src/main/java/org/apache/qpid/framing/FieldTable.java>:
Recompile with -Xlint:unchecked for details.
[INFO] -------------------------------------------------------------
[ERROR] COMPILATION ERROR : 
[INFO] -------------------------------------------------------------
[ERROR] <https://builds.apache.org/job/Qpid-JMS-AMQP-0-x-Artefact-Release-6.3.x/ws/client/src/main/java/org/apache/qpid/client/protocol/AMQProtocolSession.java>:[501,37]
cannot find symbol
  symbol:   method propagateExceptionToMethodFrameListener(int,org.apache.qpid.framing.AMQMethodBody,org.apache.qpid.QpidException)
  location: variable _protocolHandler of type org.apache.qpid.client.AMQProtocolHandler
[INFO] 1 error
[INFO] -------------------------------------------------------------
[INFO] ------------------------------------------------------------------------
[INFO] Reactor Summary:
[INFO] 
[INFO] Apache Qpid JMS AMQP 0-x Parent .................... SUCCESS [  2.588 s]
[INFO] Apache Qpid JMS AMQP 0-x ........................... FAILURE [  7.554 s]
[INFO] Apache Qpid JMS AMQP 0-x Bundles ................... SKIPPED
[INFO] Apache Qpid JMS AMQP 0-x Examples .................. SKIPPED
[INFO] Apache Qpid JMS AMQP 0-x Docbook ................... SKIPPED
[INFO] Apache Qpid JMS AMQP 0-8, 0-9 and 0-9-1 Docbook .... SKIPPED
[INFO] Apache Qpid JMS AMQP 0-10 Docbook .................. SKIPPED
[INFO] ------------------------------------------------------------------------
[INFO] BUILD FAILURE
[INFO] ------------------------------------------------------------------------
[INFO] Total time: 10.495 s
[INFO] Finished at: 2018-07-13T10:16:30Z
[INFO] Final Memory: 28M/1447M
[INFO] ------------------------------------------------------------------------
[ERROR] Failed to execute goal org.apache.maven.plugins:maven-compiler-plugin:3.5.1:compile
(default-compile) on project qpid-client: Compilation failure
[ERROR] <https://builds.apache.org/job/Qpid-JMS-AMQP-0-x-Artefact-Release-6.3.x/ws/client/src/main/java/org/apache/qpid/client/protocol/AMQProtocolSession.java>:[501,37]
cannot find symbol
[ERROR]   symbol:   method propagateExceptionToMethodFrameListener(int,org.apache.qpid.framing.AMQMethodBody,org.apache.qpid.QpidException)
[ERROR]   location: variable _protocolHandler of type org.apache.qpid.client.AMQProtocolHandler
[ERROR] 
[ERROR] -> [Help 1]
[ERROR] 
[ERROR] To see the full stack trace of the errors, re-run Maven with the -e switch.
[ERROR] Re-run Maven using the -X switch to enable full debug logging.
[ERROR] 
[ERROR] For more information about the errors and possible solutions, please read the following
articles:
[ERROR] [Help 1] http://cwiki.apache.org/confluence/display/MAVEN/MojoFailureException
[ERROR] 
[ERROR] After correcting the problems, you can resume the build with the command
[ERROR]   mvn <goals> -rf :qpid-client
Build step 'Invoke top-level Maven targets' marked build as failure
Archiving artifacts

Mime
View raw message