qpid-notifications mailing list archives

Site index · List index
Message view « Date » · « Thread »
Top « Date » · « Thread »
From Apache Jenkins Server <jenk...@builds.apache.org>
Subject Build failed in Jenkins: Qpid-JMS-AMQP-0-x-Artefact-Release-6.3.x #18
Date Fri, 13 Jul 2018 20:52:14 GMT
See <https://builds.apache.org/job/Qpid-JMS-AMQP-0-x-Artefact-Release-6.3.x/18/display/redirect?page=changes>

Changes:

[orudyy] [maven-release-plugin] prepare release 6.3.2

------------------------------------------
[...truncated 8.60 KB...]
[INFO] Compiling 88 source files to <https://builds.apache.org/job/Qpid-JMS-AMQP-0-x-Artefact-Release-6.3.x/ws/client/target/test-classes>
[INFO] <https://builds.apache.org/job/Qpid-JMS-AMQP-0-x-Artefact-Release-6.3.x/ws/client/src/test/java/org/apache/qpid/client/AMQDestinationTest.java>:
Some input files use unchecked or unsafe operations.
[INFO] <https://builds.apache.org/job/Qpid-JMS-AMQP-0-x-Artefact-Release-6.3.x/ws/client/src/test/java/org/apache/qpid/client/AMQDestinationTest.java>:
Recompile with -Xlint:unchecked for details.
[INFO] 
[INFO] --- maven-surefire-plugin:2.19.1:test (default-test) @ qpid-client ---
[INFO] Tests are skipped.
[INFO] 
[INFO] --- maven-jar-plugin:3.0.0:jar (default-jar) @ qpid-client ---
[INFO] Building jar: <https://builds.apache.org/job/Qpid-JMS-AMQP-0-x-Artefact-Release-6.3.x/ws/client/target/qpid-client-6.3.2.jar>
[INFO] 
[INFO] --- maven-site-plugin:3.5.1:attach-descriptor (attach-descriptor) @ qpid-client ---
[INFO] 
[INFO] ------------------------------------------------------------------------
[INFO] Building Apache Qpid JMS AMQP 0-x Bundles 6.3.2
[INFO] ------------------------------------------------------------------------
[INFO] 
[INFO] --- maven-clean-plugin:3.0.0:clean (default-clean) @ apache-qpid-jms-amqp-0-x ---
[INFO] 
[INFO] --- maven-enforcer-plugin:1.4.1:enforce (enforce-minimum-versions) @ apache-qpid-jms-amqp-0-x
---
[INFO] 
[INFO] --- jacoco-maven-plugin:0.7.5.201505241946:prepare-agent (default-prepare-agent) @
apache-qpid-jms-amqp-0-x ---
[INFO] argLine set to -javaagent:/home/jenkins/.m2/repository/org/jacoco/org.jacoco.agent/0.7.5.201505241946/org.jacoco.agent-0.7.5.201505241946-runtime.jar=destfile=<https://builds.apache.org/job/Qpid-JMS-AMQP-0-x-Artefact-Release-6.3.x/ws/apache-qpid-jms-amqp-0-x/target/jacoco.exec>
[INFO] 
[INFO] --- maven-remote-resources-plugin:1.5:process (process-resource-bundles) @ apache-qpid-jms-amqp-0-x
---
[INFO] 
[INFO] --- maven-site-plugin:3.5.1:attach-descriptor (attach-descriptor) @ apache-qpid-jms-amqp-0-x
---
[INFO] 
[INFO] --- maven-assembly-plugin:2.6:single (make-assembly) @ apache-qpid-jms-amqp-0-x ---
[INFO] Reading assembly descriptor: src/main/assembly/bin.xml
[WARNING] Cannot include project artifact: org.apache.qpid:apache-qpid-jms-amqp-0-x:pom:6.3.2;
it doesn't have an associated file or directory.
[INFO] Building tar: <https://builds.apache.org/job/Qpid-JMS-AMQP-0-x-Artefact-Release-6.3.x/18/artifact/apache-qpid-jms-amqp-0-x/target/apache-qpid-jms-amqp-0-x-6.3.2-bin.tar.gz>
[WARNING] Cannot include project artifact: org.apache.qpid:apache-qpid-jms-amqp-0-x:pom:6.3.2;
it doesn't have an associated file or directory.
[INFO] Building zip: <https://builds.apache.org/job/Qpid-JMS-AMQP-0-x-Artefact-Release-6.3.x/ws/apache-qpid-jms-amqp-0-x/target/apache-qpid-jms-amqp-0-x-6.3.2-bin.zip>
[INFO] 
[INFO] ------------------------------------------------------------------------
[INFO] Building Apache Qpid JMS AMQP 0-x Examples 6.3.2
[INFO] ------------------------------------------------------------------------
[INFO] 
[INFO] --- maven-clean-plugin:3.0.0:clean (default-clean) @ qpid-client-examples ---
[INFO] 
[INFO] --- maven-enforcer-plugin:1.4.1:enforce (enforce-minimum-versions) @ qpid-client-examples
---
[INFO] 
[INFO] --- jacoco-maven-plugin:0.7.5.201505241946:prepare-agent (default-prepare-agent) @
qpid-client-examples ---
[INFO] argLine set to -javaagent:/home/jenkins/.m2/repository/org/jacoco/org.jacoco.agent/0.7.5.201505241946/org.jacoco.agent-0.7.5.201505241946-runtime.jar=destfile=<https://builds.apache.org/job/Qpid-JMS-AMQP-0-x-Artefact-Release-6.3.x/ws/client/example/target/jacoco.exec>
[INFO] 
[INFO] --- maven-remote-resources-plugin:1.5:process (process-resource-bundles) @ qpid-client-examples
---
[INFO] 
[INFO] --- maven-resources-plugin:2.7:resources (default-resources) @ qpid-client-examples
---
[INFO] Using 'UTF-8' encoding to copy filtered resources.
[INFO] skip non existing resourceDirectory <https://builds.apache.org/job/Qpid-JMS-AMQP-0-x-Artefact-Release-6.3.x/ws/client/example/src/main/resources>
[INFO] Copying 1 resource
[INFO] Copying 3 resources
[INFO] 
[INFO] --- maven-compiler-plugin:3.5.1:compile (default-compile) @ qpid-client-examples ---
[INFO] Compiling 8 source files to <https://builds.apache.org/job/Qpid-JMS-AMQP-0-x-Artefact-Release-6.3.x/ws/client/example/target/classes>
[INFO] 
[INFO] --- maven-resources-plugin:2.7:testResources (default-testResources) @ qpid-client-examples
---
[INFO] Using 'UTF-8' encoding to copy filtered resources.
[INFO] skip non existing resourceDirectory <https://builds.apache.org/job/Qpid-JMS-AMQP-0-x-Artefact-Release-6.3.x/ws/client/example/src/test/resources>
[INFO] Copying 3 resources
[INFO] 
[INFO] --- maven-compiler-plugin:3.5.1:testCompile (default-testCompile) @ qpid-client-examples
---
[INFO] No sources to compile
[INFO] 
[INFO] --- maven-surefire-plugin:2.19.1:test (default-test) @ qpid-client-examples ---
[INFO] Tests are skipped.
[INFO] 
[INFO] --- maven-jar-plugin:3.0.0:jar (default-jar) @ qpid-client-examples ---
[INFO] Building jar: <https://builds.apache.org/job/Qpid-JMS-AMQP-0-x-Artefact-Release-6.3.x/ws/client/example/target/qpid-client-examples-6.3.2.jar>
[INFO] 
[INFO] --- maven-site-plugin:3.5.1:attach-descriptor (attach-descriptor) @ qpid-client-examples
---
[INFO] 
[INFO] ------------------------------------------------------------------------
[INFO] Building Apache Qpid JMS AMQP 0-x Docbook 6.3.2
[INFO] ------------------------------------------------------------------------
[INFO] 
[INFO] --- maven-clean-plugin:3.0.0:clean (default-clean) @ qpid-java-doc ---
[INFO] 
[INFO] --- maven-enforcer-plugin:1.4.1:enforce (enforce-minimum-versions) @ qpid-java-doc
---
[INFO] 
[INFO] --- jacoco-maven-plugin:0.7.5.201505241946:prepare-agent (default-prepare-agent) @
qpid-java-doc ---
[INFO] argLine set to -javaagent:/home/jenkins/.m2/repository/org/jacoco/org.jacoco.agent/0.7.5.201505241946/org.jacoco.agent-0.7.5.201505241946-runtime.jar=destfile=<https://builds.apache.org/job/Qpid-JMS-AMQP-0-x-Artefact-Release-6.3.x/ws/doc/target/jacoco.exec>
[INFO] 
[INFO] --- maven-remote-resources-plugin:1.5:process (process-resource-bundles) @ qpid-java-doc
---
[INFO] 
[INFO] --- maven-site-plugin:3.5.1:attach-descriptor (attach-descriptor) @ qpid-java-doc ---
[INFO] 
[INFO] --- maven-assembly-plugin:2.6:single (default) @ qpid-java-doc ---
[INFO] Assemblies have been skipped per configuration of the skipAssembly parameter.
[INFO] 
[INFO] ------------------------------------------------------------------------
[INFO] Building Apache Qpid JMS AMQP 0-8, 0-9 and 0-9-1 Docbook 6.3.2
[INFO] ------------------------------------------------------------------------
[INFO] 
[INFO] --- maven-clean-plugin:3.0.0:clean (default-clean) @ qpid-java-doc-jms-client-0-8 ---
[INFO] 
[INFO] --- maven-enforcer-plugin:1.4.1:enforce (enforce-minimum-versions) @ qpid-java-doc-jms-client-0-8
---
[INFO] 
[INFO] --- jacoco-maven-plugin:0.7.5.201505241946:prepare-agent (default-prepare-agent) @
qpid-java-doc-jms-client-0-8 ---
[INFO] argLine set to -javaagent:/home/jenkins/.m2/repository/org/jacoco/org.jacoco.agent/0.7.5.201505241946/org.jacoco.agent-0.7.5.201505241946-runtime.jar=destfile=<https://builds.apache.org/job/Qpid-JMS-AMQP-0-x-Artefact-Release-6.3.x/ws/doc/jms-client-0-8/target/jacoco.exec>
[INFO] 
[INFO] --- maven-resources-plugin:2.7:copy-resources (filter-docbook-sources) @ qpid-java-doc-jms-client-0-8
---
[INFO] Using 'UTF-8' encoding to copy filtered resources.
[INFO] Copying 18 resources
[INFO] 
[INFO] --- maven-remote-resources-plugin:1.5:process (process-resource-bundles) @ qpid-java-doc-jms-client-0-8
---
[INFO] 
[INFO] --- maven-resources-plugin:2.7:resources (default-resources) @ qpid-java-doc-jms-client-0-8
---
[INFO] Using 'UTF-8' encoding to copy filtered resources.
[INFO] Copying 18 resources
[INFO] 
[INFO] --- maven-compiler-plugin:3.5.1:compile (default-compile) @ qpid-java-doc-jms-client-0-8
---
[INFO] No sources to compile
[INFO] 
[INFO] --- maven-resources-plugin:2.7:testResources (default-testResources) @ qpid-java-doc-jms-client-0-8
---
[INFO] Using 'UTF-8' encoding to copy filtered resources.
[INFO] Copying 18 resources
[INFO] 
[INFO] --- maven-compiler-plugin:3.5.1:testCompile (default-testCompile) @ qpid-java-doc-jms-client-0-8
---
[INFO] No sources to compile
[INFO] 
[INFO] --- maven-surefire-plugin:2.19.1:test (default-test) @ qpid-java-doc-jms-client-0-8
---
[INFO] Tests are skipped.
[INFO] 
[INFO] --- maven-jar-plugin:3.0.0:jar (default-jar) @ qpid-java-doc-jms-client-0-8 ---
[WARNING] JAR will be empty - no content was marked for inclusion!
[INFO] Building jar: <https://builds.apache.org/job/Qpid-JMS-AMQP-0-x-Artefact-Release-6.3.x/ws/doc/jms-client-0-8/target/qpid-java-doc-jms-client-0-8-6.3.2.jar>
[INFO] 
[INFO] --- maven-site-plugin:3.5.1:attach-descriptor (attach-descriptor) @ qpid-java-doc-jms-client-0-8
---
[INFO] 
[INFO] --- maven-assembly-plugin:2.6:single (default) @ qpid-java-doc-jms-client-0-8 ---
[INFO] Assemblies have been skipped per configuration of the skipAssembly parameter.
[INFO] 
[INFO] ------------------------------------------------------------------------
[INFO] Building Apache Qpid JMS AMQP 0-10 Docbook 6.3.2
[INFO] ------------------------------------------------------------------------
[INFO] 
[INFO] --- maven-clean-plugin:3.0.0:clean (default-clean) @ qpid-java-doc-jms-client-0-10
---
[INFO] 
[INFO] --- maven-enforcer-plugin:1.4.1:enforce (enforce-minimum-versions) @ qpid-java-doc-jms-client-0-10
---
[INFO] 
[INFO] --- jacoco-maven-plugin:0.7.5.201505241946:prepare-agent (default-prepare-agent) @
qpid-java-doc-jms-client-0-10 ---
[INFO] argLine set to -javaagent:/home/jenkins/.m2/repository/org/jacoco/org.jacoco.agent/0.7.5.201505241946/org.jacoco.agent-0.7.5.201505241946-runtime.jar=destfile=<https://builds.apache.org/job/Qpid-JMS-AMQP-0-x-Artefact-Release-6.3.x/ws/doc/jms-client-0-10/target/jacoco.exec>
[INFO] 
[INFO] --- maven-resources-plugin:2.7:copy-resources (filter-docbook-sources) @ qpid-java-doc-jms-client-0-10
---
[INFO] Using 'UTF-8' encoding to copy filtered resources.
[INFO] Copying 1 resource
[INFO] 
[INFO] --- maven-remote-resources-plugin:1.5:process (process-resource-bundles) @ qpid-java-doc-jms-client-0-10
---
[INFO] 
[INFO] --- maven-resources-plugin:2.7:resources (default-resources) @ qpid-java-doc-jms-client-0-10
---
[INFO] Using 'UTF-8' encoding to copy filtered resources.
[INFO] Copying 1 resource
[INFO] 
[INFO] --- maven-compiler-plugin:3.5.1:compile (default-compile) @ qpid-java-doc-jms-client-0-10
---
[INFO] No sources to compile
[INFO] 
[INFO] --- maven-resources-plugin:2.7:testResources (default-testResources) @ qpid-java-doc-jms-client-0-10
---
[INFO] Using 'UTF-8' encoding to copy filtered resources.
[INFO] Copying 1 resource
[INFO] 
[INFO] --- maven-compiler-plugin:3.5.1:testCompile (default-testCompile) @ qpid-java-doc-jms-client-0-10
---
[INFO] No sources to compile
[INFO] 
[INFO] --- maven-surefire-plugin:2.19.1:test (default-test) @ qpid-java-doc-jms-client-0-10
---
[INFO] Tests are skipped.
[INFO] 
[INFO] --- maven-jar-plugin:3.0.0:jar (default-jar) @ qpid-java-doc-jms-client-0-10 ---
[WARNING] JAR will be empty - no content was marked for inclusion!
[INFO] Building jar: <https://builds.apache.org/job/Qpid-JMS-AMQP-0-x-Artefact-Release-6.3.x/ws/doc/jms-client-0-10/target/qpid-java-doc-jms-client-0-10-6.3.2.jar>
[INFO] 
[INFO] --- maven-site-plugin:3.5.1:attach-descriptor (attach-descriptor) @ qpid-java-doc-jms-client-0-10
---
[INFO] 
[INFO] --- maven-assembly-plugin:2.6:single (default) @ qpid-java-doc-jms-client-0-10 ---
[INFO] Assemblies have been skipped per configuration of the skipAssembly parameter.
[INFO] ------------------------------------------------------------------------
[INFO] Reactor Summary:
[INFO] 
[INFO] Apache Qpid JMS AMQP 0-x Parent .................... SUCCESS [  2.597 s]
[INFO] Apache Qpid JMS AMQP 0-x ........................... SUCCESS [ 10.730 s]
[INFO] Apache Qpid JMS AMQP 0-x Bundles ................... SUCCESS [  1.241 s]
[INFO] Apache Qpid JMS AMQP 0-x Examples .................. SUCCESS [  0.286 s]
[INFO] Apache Qpid JMS AMQP 0-x Docbook ................... SUCCESS [  0.029 s]
[INFO] Apache Qpid JMS AMQP 0-8, 0-9 and 0-9-1 Docbook .... SUCCESS [  0.404 s]
[INFO] Apache Qpid JMS AMQP 0-10 Docbook .................. SUCCESS [  0.124 s]
[INFO] ------------------------------------------------------------------------
[INFO] BUILD SUCCESS
[INFO] ------------------------------------------------------------------------
[INFO] Total time: 15.844 s
[INFO] Finished at: 2018-07-13T20:52:04Z
[INFO] Final Memory: 29M/1447M
[INFO] ------------------------------------------------------------------------
[Qpid-JMS-AMQP-0-x-Artefact-Release-6.3.x] $ /home/jenkins/tools/maven/latest3/bin/mvn -f
./pom.xml -DskipTests=true deploy
[INFO] Scanning for projects...
[INFO] ------------------------------------------------------------------------
[INFO] Reactor Build Order:
[INFO] 
[INFO] Apache Qpid JMS AMQP 0-x Parent
[INFO] Apache Qpid JMS AMQP 0-x
[INFO] Apache Qpid JMS AMQP 0-x Bundles
[INFO] Apache Qpid JMS AMQP 0-x Examples
[INFO] Apache Qpid JMS AMQP 0-x Docbook
[INFO] Apache Qpid JMS AMQP 0-8, 0-9 and 0-9-1 Docbook
[INFO] Apache Qpid JMS AMQP 0-10 Docbook
[INFO] 
[INFO] ------------------------------------------------------------------------
[INFO] Building Apache Qpid JMS AMQP 0-x Parent 6.3.2
[INFO] ------------------------------------------------------------------------
[INFO] 
[INFO] --- maven-enforcer-plugin:1.4.1:enforce (enforce-minimum-versions) @ qpid-jms-amqp-0-x-parent
---
[INFO] 
[INFO] --- jacoco-maven-plugin:0.7.5.201505241946:prepare-agent (default-prepare-agent) @
qpid-jms-amqp-0-x-parent ---
[INFO] argLine set to -javaagent:/home/jenkins/.m2/repository/org/jacoco/org.jacoco.agent/0.7.5.201505241946/org.jacoco.agent-0.7.5.201505241946-runtime.jar=destfile=<https://builds.apache.org/job/Qpid-JMS-AMQP-0-x-Artefact-Release-6.3.x/ws/./target/jacoco.exec>
[INFO] 
[INFO] --- maven-remote-resources-plugin:1.5:process (process-resource-bundles) @ qpid-jms-amqp-0-x-parent
---
[INFO] 
[INFO] --- maven-site-plugin:3.5.1:attach-descriptor (attach-descriptor) @ qpid-jms-amqp-0-x-parent
---
[INFO] 
[INFO] --- maven-install-plugin:2.5.2:install (default-install) @ qpid-jms-amqp-0-x-parent
---
[INFO] Installing <https://builds.apache.org/job/Qpid-JMS-AMQP-0-x-Artefact-Release-6.3.x/ws/./pom.xml>
to /home/jenkins/.m2/repository/org/apache/qpid/qpid-jms-amqp-0-x-parent/6.3.2/qpid-jms-amqp-0-x-parent-6.3.2.pom
[INFO] 
[INFO] --- maven-deploy-plugin:2.8.2:deploy (default-deploy) @ qpid-jms-amqp-0-x-parent ---
Uploading to apache.releases.https: https://repository.apache.org/service/local/staging/deploy/maven2/org/apache/qpid/qpid-jms-amqp-0-x-parent/6.3.2/qpid-jms-amqp-0-x-parent-6.3.2.pom
Progress (1): 2.0/23 kBProgress (1): 4.1/23 kBProgress (1): 6.1/23 kBProgress (1): 8.2/23
kBProgress (1): 10/23 kB Progress (1): 12/23 kBProgress (1): 14/23 kBProgress (1): 16/23 kBProgress
(1): 18/23 kBProgress (1): 20/23 kBProgress (1): 23/23 kBProgress (1): 23 kB             
        [INFO] ------------------------------------------------------------------------
[INFO] Reactor Summary:
[INFO] 
[INFO] Apache Qpid JMS AMQP 0-x Parent .................... FAILURE [  4.123 s]
[INFO] Apache Qpid JMS AMQP 0-x ........................... SKIPPED
[INFO] Apache Qpid JMS AMQP 0-x Bundles ................... SKIPPED
[INFO] Apache Qpid JMS AMQP 0-x Examples .................. SKIPPED
[INFO] Apache Qpid JMS AMQP 0-x Docbook ................... SKIPPED
[INFO] Apache Qpid JMS AMQP 0-8, 0-9 and 0-9-1 Docbook .... SKIPPED
[INFO] Apache Qpid JMS AMQP 0-10 Docbook .................. SKIPPED
[INFO] ------------------------------------------------------------------------
[INFO] BUILD FAILURE
[INFO] ------------------------------------------------------------------------
[INFO] Total time: 4.480 s
[INFO] Finished at: 2018-07-13T20:52:12Z
[INFO] Final Memory: 41M/1447M
[INFO] ------------------------------------------------------------------------
[ERROR] Failed to execute goal org.apache.maven.plugins:maven-deploy-plugin:2.8.2:deploy (default-deploy)
on project qpid-jms-amqp-0-x-parent: Failed to deploy artifacts: Could not transfer artifact
org.apache.qpid:qpid-jms-amqp-0-x-parent:pom:6.3.2 from/to apache.releases.https (https://repository.apache.org/service/local/staging/deploy/maven2):
Failed to transfer file: https://repository.apache.org/service/local/staging/deploy/maven2/org/apache/qpid/qpid-jms-amqp-0-x-parent/6.3.2/qpid-jms-amqp-0-x-parent-6.3.2.pom.
Return code is: 401, ReasonPhrase: Unauthorized. -> [Help 1]
[ERROR] 
[ERROR] To see the full stack trace of the errors, re-run Maven with the -e switch.
[ERROR] Re-run Maven using the -X switch to enable full debug logging.
[ERROR] 
[ERROR] For more information about the errors and possible solutions, please read the following
articles:
[ERROR] [Help 1] http://cwiki.apache.org/confluence/display/MAVEN/MojoExecutionException
Build step 'Invoke top-level Maven targets' marked build as failure
Archiving artifacts

Mime
View raw message