qpid-notifications mailing list archives

Site index · List index
Message view « Date » · « Thread »
Top « Date » · « Thread »
From Apache Jenkins Server <jenk...@builds.apache.org>
Subject Build failed in Jenkins: Qpid-JMS-Test-JDK9 #159
Date Thu, 05 Jul 2018 14:34:29 GMT
See <https://builds.apache.org/job/Qpid-JMS-Test-JDK9/159/display/redirect?page=changes>

Changes:

[robbie] NO-JIRA: increase timeout to avoid spurious failure in slower CI envs

------------------------------------------
[...truncated 74.30 KB...]
[WARNING] Tests run: 1, Failures: 0, Errors: 0, Skipped: 1, Time elapsed: 0 s - in org.apache.qpid.jms.bench.ProduceToOpenWireTest
[INFO] Running org.apache.qpid.jms.JmsTopicConnectionTest
[INFO] Tests run: 5, Failures: 0, Errors: 0, Skipped: 0, Time elapsed: 0.088 s - in org.apache.qpid.jms.JmsTopicConnectionTest
[INFO] Running org.apache.qpid.jms.producer.JmsAnonymousProducerTest
[INFO] Tests run: 8, Failures: 0, Errors: 0, Skipped: 0, Time elapsed: 0.812 s - in org.apache.qpid.jms.producer.JmsAnonymousProducerTest
[INFO] Running org.apache.qpid.jms.producer.JmsMessageProducerTest
[INFO] Tests run: 12, Failures: 0, Errors: 0, Skipped: 0, Time elapsed: 4.14 s - in org.apache.qpid.jms.producer.JmsMessageProducerTest
[INFO] Running org.apache.qpid.jms.producer.JmsQueueSenderTest
[INFO] Tests run: 1, Failures: 0, Errors: 0, Skipped: 0, Time elapsed: 0.037 s - in org.apache.qpid.jms.producer.JmsQueueSenderTest
[INFO] Running org.apache.qpid.jms.producer.JmsTopicPublisherTest
[INFO] Tests run: 1, Failures: 0, Errors: 0, Skipped: 0, Time elapsed: 0.023 s - in org.apache.qpid.jms.producer.JmsTopicPublisherTest
[INFO] Running org.apache.qpid.jms.producer.JmsProducerFlowControlFailIfNoSpaceTest
[INFO] Tests run: 2, Failures: 0, Errors: 0, Skipped: 0, Time elapsed: 0.272 s - in org.apache.qpid.jms.producer.JmsProducerFlowControlFailIfNoSpaceTest
[INFO] Running org.apache.qpid.jms.producer.JmsProduceMessageTypesTest
[INFO] Tests run: 6, Failures: 0, Errors: 0, Skipped: 0, Time elapsed: 0.188 s - in org.apache.qpid.jms.producer.JmsProduceMessageTypesTest
[INFO] Running org.apache.qpid.jms.usecases.JmsLargeMessageSendRecvTimedTest
[WARNING] Tests run: 4, Failures: 0, Errors: 0, Skipped: 1, Time elapsed: 1.179 s - in org.apache.qpid.jms.usecases.JmsLargeMessageSendRecvTimedTest
[INFO] Running org.apache.qpid.jms.usecases.JmsLargeMessagesInGroupsTest
[INFO] Tests run: 1, Failures: 0, Errors: 0, Skipped: 0, Time elapsed: 0.559 s - in org.apache.qpid.jms.usecases.JmsLargeMessagesInGroupsTest
[INFO] Running org.apache.qpid.jms.destinations.JmsTemporaryTopicTest
[INFO] Tests run: 4, Failures: 0, Errors: 0, Skipped: 0, Time elapsed: 0.139 s - in org.apache.qpid.jms.destinations.JmsTemporaryTopicTest
[INFO] Running org.apache.qpid.jms.destinations.JmsTemporaryQueueTest
[INFO] Tests run: 4, Failures: 0, Errors: 0, Skipped: 0, Time elapsed: 0.152 s - in org.apache.qpid.jms.destinations.JmsTemporaryQueueTest
[INFO] Running org.apache.qpid.jms.JmsConnectionTest
[INFO] Tests run: 10, Failures: 0, Errors: 0, Skipped: 0, Time elapsed: 0.302 s - in org.apache.qpid.jms.JmsConnectionTest
[INFO] Running org.apache.qpid.jms.session.JmsSessionTest
[INFO] Tests run: 7, Failures: 0, Errors: 0, Skipped: 0, Time elapsed: 0.22 s - in org.apache.qpid.jms.session.JmsSessionTest
[INFO] Running org.apache.qpid.jms.joram.JoramTemporaryQueueTest
[INFO] Tests run: 1, Failures: 0, Errors: 0, Skipped: 0, Time elapsed: 0.137 s - in org.apache.qpid.jms.joram.JoramTemporaryQueueTest
[INFO] Running org.apache.qpid.jms.joram.JoramSelectorSyntaxTest
[INFO] Tests run: 22, Failures: 0, Errors: 0, Skipped: 0, Time elapsed: 0.714 s - in org.apache.qpid.jms.joram.JoramSelectorSyntaxTest
[INFO] Running org.apache.qpid.jms.joram.JoramMessageBodyTest
[INFO] Tests run: 3, Failures: 0, Errors: 0, Skipped: 0, Time elapsed: 0.108 s - in org.apache.qpid.jms.joram.JoramMessageBodyTest
[INFO] Running org.apache.qpid.jms.joram.JoramSessionTest
[INFO] Tests run: 10, Failures: 0, Errors: 0, Skipped: 0, Time elapsed: 0.485 s - in org.apache.qpid.jms.joram.JoramSessionTest
[INFO] Running org.apache.qpid.jms.joram.JoramMessageTypeTest
[INFO] Tests run: 14, Failures: 0, Errors: 0, Skipped: 0, Time elapsed: 0.78 s - in org.apache.qpid.jms.joram.JoramMessageTypeTest
[INFO] Running org.apache.qpid.jms.joram.JoramJMSXPropertyTest
[INFO] Tests run: 3, Failures: 0, Errors: 0, Skipped: 0, Time elapsed: 0.057 s - in org.apache.qpid.jms.joram.JoramJMSXPropertyTest
[INFO] Running org.apache.qpid.jms.joram.JoramQueueSessionTest
[INFO] Tests run: 5, Failures: 0, Errors: 0, Skipped: 0, Time elapsed: 0.385 s - in org.apache.qpid.jms.joram.JoramQueueSessionTest
[INFO] Running org.apache.qpid.jms.joram.JoramTemporaryTopicTest
[INFO] Tests run: 1, Failures: 0, Errors: 0, Skipped: 0, Time elapsed: 0.037 s - in org.apache.qpid.jms.joram.JoramTemporaryTopicTest
[INFO] Running org.apache.qpid.jms.joram.JoramMessageHeaderTest
[INFO] Tests run: 9, Failures: 0, Errors: 0, Skipped: 0, Time elapsed: 0.292 s - in org.apache.qpid.jms.joram.JoramMessageHeaderTest
[INFO] Running org.apache.qpid.jms.joram.JoramMessageDefaultTest
[INFO] Tests run: 2, Failures: 0, Errors: 0, Skipped: 0, Time elapsed: 0.005 s - in org.apache.qpid.jms.joram.JoramMessageDefaultTest
[INFO] Running org.apache.qpid.jms.joram.JoramTopicConnectionTest
[INFO] Tests run: 2, Failures: 0, Errors: 0, Skipped: 0, Time elapsed: 0.069 s - in org.apache.qpid.jms.joram.JoramTopicConnectionTest
[INFO] Running org.apache.qpid.jms.joram.JoramSelectorTest
[INFO] Tests run: 14, Failures: 0, Errors: 0, Skipped: 0, Time elapsed: 0.594 s - in org.apache.qpid.jms.joram.JoramSelectorTest
[INFO] Running org.apache.qpid.jms.joram.JoramMessagePropertyConversionTest
[INFO] Tests run: 71, Failures: 0, Errors: 0, Skipped: 0, Time elapsed: 2.267 s - in org.apache.qpid.jms.joram.JoramMessagePropertyConversionTest
[INFO] Running org.apache.qpid.jms.joram.JoramTopicSessionTest
[INFO] Tests run: 7, Failures: 0, Errors: 0, Skipped: 0, Time elapsed: 0.287 s - in org.apache.qpid.jms.joram.JoramTopicSessionTest
[INFO] Running org.apache.qpid.jms.joram.JoramConnectionTest
[INFO] Tests run: 7, Failures: 0, Errors: 0, Skipped: 0, Time elapsed: 1.226 s - in org.apache.qpid.jms.joram.JoramConnectionTest
[INFO] Running org.apache.qpid.jms.joram.JoramMessagePropertyTest
[INFO] Tests run: 15, Failures: 0, Errors: 0, Skipped: 0, Time elapsed: 0.325 s - in org.apache.qpid.jms.joram.JoramMessagePropertyTest
[INFO] Running org.apache.qpid.jms.joram.JoramQueueBrowserTest
[INFO] Tests run: 2, Failures: 0, Errors: 0, Skipped: 0, Time elapsed: 0.144 s - in org.apache.qpid.jms.joram.JoramQueueBrowserTest
[INFO] Running org.apache.qpid.jms.failover.JmsTxProducerFailoverTest
[INFO] Tests run: 4, Failures: 0, Errors: 0, Skipped: 0, Time elapsed: 5.741 s - in org.apache.qpid.jms.failover.JmsTxProducerFailoverTest
[INFO] Running org.apache.qpid.jms.failover.JmsTxConsumerFailoverTest
[INFO] Tests run: 4, Failures: 0, Errors: 0, Skipped: 0, Time elapsed: 4.684 s - in org.apache.qpid.jms.failover.JmsTxConsumerFailoverTest
[INFO] Running org.apache.qpid.jms.failover.JmsOfflineBehaviorTests
[INFO] Tests run: 8, Failures: 0, Errors: 0, Skipped: 0, Time elapsed: 0.478 s - in org.apache.qpid.jms.failover.JmsOfflineBehaviorTests
[INFO] Running org.apache.qpid.jms.failover.JmsFailoverTest
[INFO] Tests run: 12, Failures: 0, Errors: 0, Skipped: 0, Time elapsed: 13.263 s - in org.apache.qpid.jms.failover.JmsFailoverTest
[INFO] Running org.apache.qpid.jms.JmsMessageIntegrityTest
[INFO] Tests run: 6, Failures: 0, Errors: 0, Skipped: 0, Time elapsed: 0.13 s - in org.apache.qpid.jms.JmsMessageIntegrityTest
[INFO] Running org.apache.qpid.jms.JmsConnectionConcurrentCloseCallsTest
[INFO] Tests run: 1, Failures: 0, Errors: 0, Skipped: 0, Time elapsed: 0.024 s - in org.apache.qpid.jms.JmsConnectionConcurrentCloseCallsTest
[INFO] Running org.apache.qpid.jms.JmsQueueConnectionTest
[INFO] Tests run: 5, Failures: 0, Errors: 0, Skipped: 0, Time elapsed: 0.083 s - in org.apache.qpid.jms.JmsQueueConnectionTest
[INFO] Running org.apache.qpid.jms.JmsConnectionInRandomBatchesTest
[INFO] Tests run: 3, Failures: 0, Errors: 0, Skipped: 0, Time elapsed: 2.523 s - in org.apache.qpid.jms.JmsConnectionInRandomBatchesTest
[INFO] 
[INFO] Results:
[INFO] 
[WARNING] Tests run: 401, Failures: 0, Errors: 0, Skipped: 7
[INFO] 
[JENKINS] Recording test results
[INFO] 
[INFO] --- maven-jar-plugin:3.0.2:jar (default-jar) @ qpid-jms-activemq-tests ---
[INFO] Building jar: <https://builds.apache.org/job/Qpid-JMS-Test-JDK9/ws/qpid-jms-interop-tests/qpid-jms-activemq-tests/target/qpid-jms-activemq-tests-0.35.0-SNAPSHOT.jar>
[INFO] 
[INFO] --- maven-site-plugin:3.7:attach-descriptor (attach-descriptor) @ qpid-jms-activemq-tests
---
[INFO] Skipping because packaging 'jar' is not pom.
[JENKINS] Archiving disabled
[INFO] 
[INFO] ------------------------------------------------------------------------
[INFO] Building QpidJMS Examples 0.35.0-SNAPSHOT
[INFO] ------------------------------------------------------------------------
[INFO] 
[INFO] --- maven-clean-plugin:3.0.0:clean (default-clean) @ qpid-jms-examples ---
[INFO] 
[INFO] --- maven-enforcer-plugin:1.4.1:enforce (enforce-maven-version) @ qpid-jms-examples
---
[INFO] 
[INFO] --- jacoco-maven-plugin:0.8.1:prepare-agent (default) @ qpid-jms-examples ---
[INFO] Skipping JaCoCo execution because property jacoco.skip is set.
[INFO] jacoco-config set to empty
[INFO] 
[INFO] --- maven-remote-resources-plugin:1.5:process (process-resource-bundles) @ qpid-jms-examples
---
[INFO] 
[INFO] --- maven-resources-plugin:3.0.2:resources (default-resources) @ qpid-jms-examples
---
[INFO] Using 'UTF-8' encoding to copy filtered resources.
[INFO] Copying 2 resources
[INFO] Copying 3 resources
[INFO] 
[INFO] --- maven-compiler-plugin:3.6.0:compile (default-compile) @ qpid-jms-examples ---
[INFO] Changes detected - recompiling the module!
[INFO] Compiling 5 source files to <https://builds.apache.org/job/Qpid-JMS-Test-JDK9/ws/qpid-jms-examples/target/classes>
[WARNING] bootstrap class path not set in conjunction with -source 1.8
[INFO] 
[INFO] --- maven-resources-plugin:3.0.2:testResources (default-testResources) @ qpid-jms-examples
---
[INFO] Using 'UTF-8' encoding to copy filtered resources.
[INFO] skip non existing resourceDirectory <https://builds.apache.org/job/Qpid-JMS-Test-JDK9/ws/qpid-jms-examples/src/test/resources>
[INFO] Copying 3 resources
[INFO] 
[INFO] --- maven-compiler-plugin:3.6.0:testCompile (default-testCompile) @ qpid-jms-examples
---
[INFO] No sources to compile
[INFO] 
[INFO] --- maven-surefire-plugin:2.21.0:test (default-test) @ qpid-jms-examples ---
[JENKINS] Recording test results
[INFO] 
[INFO] --- maven-jar-plugin:3.0.2:jar (default-jar) @ qpid-jms-examples ---
[INFO] Building jar: <https://builds.apache.org/job/Qpid-JMS-Test-JDK9/ws/qpid-jms-examples/target/qpid-jms-examples-0.35.0-SNAPSHOT.jar>
[INFO] 
[INFO] --- maven-site-plugin:3.7:attach-descriptor (attach-descriptor) @ qpid-jms-examples
---
[INFO] Skipping because packaging 'jar' is not pom.
[JENKINS] Archiving disabled
[INFO] 
[INFO] ------------------------------------------------------------------------
[INFO] Building QpidJMS Docs 0.35.0-SNAPSHOT
[INFO] ------------------------------------------------------------------------
[INFO] 
[INFO] --- maven-clean-plugin:3.0.0:clean (default-clean) @ qpid-jms-docs ---
[INFO] 
[INFO] --- maven-enforcer-plugin:1.4.1:enforce (enforce-maven-version) @ qpid-jms-docs ---
[INFO] 
[INFO] --- jacoco-maven-plugin:0.8.1:prepare-agent (default) @ qpid-jms-docs ---
[INFO] Skipping JaCoCo execution because property jacoco.skip is set.
[INFO] jacoco-config set to empty
[INFO] 
[INFO] --- maven-remote-resources-plugin:1.5:process (process-resource-bundles) @ qpid-jms-docs
---
[INFO] 
[INFO] --- maven-site-plugin:3.7:attach-descriptor (attach-descriptor) @ qpid-jms-docs ---
[INFO] No site descriptor found: nothing to attach.
[JENKINS] Archiving disabled
[INFO] 
[INFO] ------------------------------------------------------------------------
[INFO] Building Apache Qpid JMS 0.35.0-SNAPSHOT
[INFO] ------------------------------------------------------------------------
[INFO] 
[INFO] --- maven-clean-plugin:3.0.0:clean (default-clean) @ apache-qpid-jms ---
[INFO] 
[INFO] --- maven-enforcer-plugin:1.4.1:enforce (enforce-maven-version) @ apache-qpid-jms ---
[INFO] 
[INFO] --- jacoco-maven-plugin:0.8.1:prepare-agent (default) @ apache-qpid-jms ---
[INFO] jacoco-config set to -javaagent:/home/jenkins/jenkins-slave/maven-repositories/1/org/jacoco/org.jacoco.agent/0.8.1/org.jacoco.agent-0.8.1-runtime.jar=destfile=<https://builds.apache.org/job/Qpid-JMS-Test-JDK9/ws/apache-qpid-jms/target/jacoco.exec>
[INFO] 
[INFO] --- maven-remote-resources-plugin:1.5:process (process-resource-bundles) @ apache-qpid-jms
---
[JENKINS] Archiving disabled
[JENKINS] Archiving disabled
[JENKINS] Archiving disabled
[JENKINS] Archiving disabled
[JENKINS] Archiving disabled
[JENKINS] Archiving disabled
[JENKINS] Archiving disabled
[JENKINS] Archiving disabled
[JENKINS] Archiving disabled
[INFO] ------------------------------------------------------------------------
[INFO] Reactor Summary:
[INFO] 
[INFO] QpidJMS ............................................ SUCCESS [ 15.881 s]
[INFO] QpidJMS Client ..................................... SUCCESS [03:37 min]
[INFO] QpidJMS Discovery Library .......................... SUCCESS [ 11.027 s]
[INFO] QpidJMS Broker Interop Tests ....................... SUCCESS [  2.307 s]
[INFO] QpidJMS ActiveMQ Interop Tests ..................... SUCCESS [01:46 min]
[INFO] QpidJMS Examples ................................... SUCCESS [  3.709 s]
[INFO] QpidJMS Docs ....................................... SUCCESS [  1.865 s]
[INFO] Apache Qpid JMS .................................... FAILURE [  1.617 s]
[INFO] ------------------------------------------------------------------------
[INFO] BUILD FAILURE
[INFO] ------------------------------------------------------------------------
[INFO] Total time: 06:48 min
[INFO] Finished at: 2018-07-05T14:26:05Z
[INFO] Final Memory: 59M/1024M
[INFO] ------------------------------------------------------------------------
Waiting for Jenkins to finish collecting data
[ERROR] Failed to execute goal org.apache.maven.plugins:maven-remote-resources-plugin:1.5:process
(process-resource-bundles) on project apache-qpid-jms: Error finding remote resources manifests:
<https://builds.apache.org/job/Qpid-JMS-Test-JDK9/ws/apache-qpid-jms/target/maven-shared-archive-resources/META-INF/NOTICE>
(No such file or directory) -> [Help 1]
org.apache.maven.lifecycle.LifecycleExecutionException: Failed to execute goal org.apache.maven.plugins:maven-remote-resources-plugin:1.5:process
(process-resource-bundles) on project apache-qpid-jms: Error finding remote resources manifests
	at org.apache.maven.lifecycle.internal.MojoExecutor.execute(MojoExecutor.java:213)
	at org.apache.maven.lifecycle.internal.MojoExecutor.execute(MojoExecutor.java:154)
	at org.apache.maven.lifecycle.internal.MojoExecutor.execute(MojoExecutor.java:146)
	at org.apache.maven.lifecycle.internal.LifecycleModuleBuilder.buildProject(LifecycleModuleBuilder.java:117)
	at org.apache.maven.lifecycle.internal.LifecycleModuleBuilder.buildProject(LifecycleModuleBuilder.java:81)
	at org.apache.maven.lifecycle.internal.builder.singlethreaded.SingleThreadedBuilder.build(SingleThreadedBuilder.java:51)
	at org.apache.maven.lifecycle.internal.LifecycleStarter.execute(LifecycleStarter.java:128)
	at org.apache.maven.DefaultMaven.doExecute(DefaultMaven.java:309)
	at org.apache.maven.DefaultMaven.doExecute(DefaultMaven.java:194)
	at org.apache.maven.DefaultMaven.execute(DefaultMaven.java:107)
	at org.jvnet.hudson.maven3.launcher.Maven35Launcher.main(Maven35Launcher.java:130)
	at java.base/jdk.internal.reflect.NativeMethodAccessorImpl.invoke0(Native Method)
	at java.base/jdk.internal.reflect.NativeMethodAccessorImpl.invoke(NativeMethodAccessorImpl.java:62)
	at java.base/jdk.internal.reflect.DelegatingMethodAccessorImpl.invoke(DelegatingMethodAccessorImpl.java:43)
	at java.base/java.lang.reflect.Method.invoke(Method.java:564)
	at org.codehaus.plexus.classworlds.launcher.Launcher.launchEnhanced(Launcher.java:289)
	at org.codehaus.plexus.classworlds.launcher.Launcher.launch(Launcher.java:229)
	at jenkins.maven3.agent.Maven35Main.launch(Maven35Main.java:176)
	at java.base/jdk.internal.reflect.NativeMethodAccessorImpl.invoke0(Native Method)
	at java.base/jdk.internal.reflect.NativeMethodAccessorImpl.invoke(NativeMethodAccessorImpl.java:62)
	at java.base/jdk.internal.reflect.DelegatingMethodAccessorImpl.invoke(DelegatingMethodAccessorImpl.java:43)
	at java.base/java.lang.reflect.Method.invoke(Method.java:564)
	at hudson.maven.Maven3Builder.call(Maven3Builder.java:139)
	at hudson.maven.Maven3Builder.call(Maven3Builder.java:70)
	at hudson.remoting.UserRequest.perform(UserRequest.java:212)
	at hudson.remoting.UserRequest.perform(UserRequest.java:54)
	at hudson.remoting.Request$2.run(Request.java:369)
	at hudson.remoting.InterceptingExecutorService$1.call(InterceptingExecutorService.java:72)
	at java.base/java.util.concurrent.FutureTask.run(FutureTask.java:264)
	at java.base/java.util.concurrent.ThreadPoolExecutor.runWorker(ThreadPoolExecutor.java:1167)
	at java.base/java.util.concurrent.ThreadPoolExecutor$Worker.run(ThreadPoolExecutor.java:641)
	at java.base/java.lang.Thread.run(Thread.java:844)
Caused by: org.apache.maven.plugin.MojoExecutionException: Error finding remote resources
manifests
	at org.apache.maven.plugin.resources.remote.ProcessRemoteResourcesMojo.processResourceBundles(ProcessRemoteResourcesMojo.java:1238)
	at org.apache.maven.plugin.resources.remote.ProcessRemoteResourcesMojo.execute(ProcessRemoteResourcesMojo.java:520)
	at org.apache.maven.plugin.DefaultBuildPluginManager.executeMojo(DefaultBuildPluginManager.java:134)
	at org.apache.maven.lifecycle.internal.MojoExecutor.execute(MojoExecutor.java:208)
	... 31 more
Caused by: java.io.FileNotFoundException: <https://builds.apache.org/job/Qpid-JMS-Test-JDK9/ws/apache-qpid-jms/target/maven-shared-archive-resources/META-INF/NOTICE>
(No such file or directory)
	at java.base/java.io.FileOutputStream.open0(Native Method)
	at java.base/java.io.FileOutputStream.open(FileOutputStream.java:276)
	at java.base/java.io.FileOutputStream.<init>(FileOutputStream.java:220)
	at java.base/java.io.FileOutputStream.<init>(FileOutputStream.java:170)
	at java.base/java.io.FileWriter.<init>(FileWriter.java:90)
	at org.apache.maven.plugin.resources.remote.ProcessRemoteResourcesMojo.processResourceBundles(ProcessRemoteResourcesMojo.java:1146)
	... 34 more
[ERROR] 
[ERROR] Re-run Maven using the -X switch to enable full debug logging.
[ERROR] 
[ERROR] For more information about the errors and possible solutions, please read the following
articles:
[ERROR] [Help 1] http://cwiki.apache.org/confluence/display/MAVEN/MojoExecutionException
[ERROR] 
[ERROR] After correcting the problems, you can resume the build with the command
[ERROR]   mvn <goals> -rf :apache-qpid-jms
Sending e-mails to: notifications@qpid.apache.org
channel stopped

Mime
View raw message