qpid-notifications mailing list archives

Site index · List index
Message view « Date » · « Thread »
Top « Date » · « Thread »
From Apache Jenkins Server <jenk...@builds.apache.org>
Subject Build failed in Jenkins: Qpid-JMS-AMQP-0-x-Broker-J-TestMatrix » ubuntu,JDK 1.8 (latest),0-9-1 #26
Date Fri, 13 Jul 2018 10:15:19 GMT
See <https://builds.apache.org/job/Qpid-JMS-AMQP-0-x-Broker-J-TestMatrix/Ubuntu%20Slaves=ubuntu,jdk=JDK%201.8%20(latest),qpid.amqp.version=0-9-1/26/display/redirect?page=changes>

Changes:

[orudyy] QPID-8212: Throw exception only when session is not closing

------------------------------------------
[...truncated 2.27 KB...]
 > git config core.sparsecheckout # timeout=10
 > git checkout -f a48e285e3e6057cf4114ec057bffa685e3f51531
Commit message: "QPID-8212: Throw exception only when session is not closing"
 > git rev-list --no-walk 9fe911a9576ac69b64b1d4322ceae8cd1f3cfbec # timeout=10
[0-9-1] $ /home/jenkins/tools/maven/latest3/bin/mvn -f pom.xml -Dqpid.amqp.version=0-9-1 clean
verify -Pbroker-j -fae
[INFO] Scanning for projects...
[INFO] ------------------------------------------------------------------------
[INFO] Reactor Build Order:
[INFO] 
[INFO] Apache Qpid JMS AMQP 0-x Parent
[INFO] Apache Qpid JMS AMQP 0-x
[INFO] Apache Qpid JMS AMQP 0-x Bundles
[INFO] Apache Qpid JMS AMQP 0-x Examples
[INFO] Apache Qpid JMS AMQP 0-x Docbook
[INFO] Apache Qpid JMS AMQP 0-8, 0-9 and 0-9-1 Docbook
[INFO] Apache Qpid JMS AMQP 0-10 Docbook
[INFO] Apache Qpid JMS AMQP 0-x System Tests
[INFO] 
[INFO] ------------------------------------------------------------------------
[INFO] Building Apache Qpid JMS AMQP 0-x Parent 6.4.0-SNAPSHOT
[INFO] ------------------------------------------------------------------------
[INFO] 
[INFO] --- maven-clean-plugin:3.0.0:clean (default-clean) @ qpid-jms-amqp-0-x-parent ---
[INFO] 
[INFO] --- maven-enforcer-plugin:1.4.1:enforce (enforce-minimum-versions) @ qpid-jms-amqp-0-x-parent
---
[INFO] 
[INFO] --- jacoco-maven-plugin:0.7.5.201505241946:prepare-agent (default-prepare-agent) @
qpid-jms-amqp-0-x-parent ---
[INFO] argLine set to "-javaagent:/home/jenkins/.m2/repository/org/jacoco/org.jacoco.agent/0.7.5.201505241946/org.jacoco.agent-0.7.5.201505241946-runtime.jar=destfile=<https://builds.apache.org/job/Qpid-JMS-AMQP-0-x-Broker-J-TestMatrix/Ubuntu%20Slaves=ubuntu,jdk=JDK%201.8%20(latest),qpid.amqp.version=0-9-1/ws/target/jacoco.exec">
[INFO] 
[INFO] --- maven-remote-resources-plugin:1.5:process (process-resource-bundles) @ qpid-jms-amqp-0-x-parent
---
[INFO] 
[INFO] --- maven-site-plugin:3.5.1:attach-descriptor (attach-descriptor) @ qpid-jms-amqp-0-x-parent
---
[INFO] 
[INFO] ------------------------------------------------------------------------
[INFO] Building Apache Qpid JMS AMQP 0-x 6.4.0-SNAPSHOT
[INFO] ------------------------------------------------------------------------
[INFO] 
[INFO] --- maven-clean-plugin:3.0.0:clean (default-clean) @ qpid-client ---
[INFO] 
[INFO] --- maven-enforcer-plugin:1.4.1:enforce (enforce-minimum-versions) @ qpid-client ---
[INFO] 
[INFO] --- buildnumber-maven-plugin:1.3:create (default) @ qpid-client ---
[INFO] Executing: /bin/sh -c cd "<https://builds.apache.org/job/Qpid-JMS-AMQP-0-x-Broker-J-TestMatrix/Ubuntu%20Slaves=ubuntu,jdk=JDK%201.8%20(latest),qpid.amqp.version=0-9-1/ws/client">
&& git rev-parse --verify HEAD
[INFO] Working directory: <https://builds.apache.org/job/Qpid-JMS-AMQP-0-x-Broker-J-TestMatrix/Ubuntu%20Slaves=ubuntu,jdk=JDK%201.8%20(latest),qpid.amqp.version=0-9-1/ws/client>
[INFO] Storing buildNumber: a48e285e3e6057cf4114ec057bffa685e3f51531 at timestamp: 1531476911215
[WARNING] Cannot get the branch information from the git repository: 
Detecting the current branch failed: fatal: ref HEAD is not a symbolic ref

[INFO] Executing: /bin/sh -c cd "<https://builds.apache.org/job/Qpid-JMS-AMQP-0-x-Broker-J-TestMatrix/Ubuntu%20Slaves=ubuntu,jdk=JDK%201.8%20(latest),qpid.amqp.version=0-9-1/ws/client">
&& git rev-parse --verify HEAD
[INFO] Working directory: <https://builds.apache.org/job/Qpid-JMS-AMQP-0-x-Broker-J-TestMatrix/Ubuntu%20Slaves=ubuntu,jdk=JDK%201.8%20(latest),qpid.amqp.version=0-9-1/ws/client>
[INFO] Storing buildScmBranch: UNKNOWN
[INFO] 
[INFO] --- jacoco-maven-plugin:0.7.5.201505241946:prepare-agent (default-prepare-agent) @
qpid-client ---
[INFO] argLine set to "-javaagent:/home/jenkins/.m2/repository/org/jacoco/org.jacoco.agent/0.7.5.201505241946/org.jacoco.agent-0.7.5.201505241946-runtime.jar=destfile=<https://builds.apache.org/job/Qpid-JMS-AMQP-0-x-Broker-J-TestMatrix/Ubuntu%20Slaves=ubuntu,jdk=JDK%201.8%20(latest),qpid.amqp.version=0-9-1/ws/client/target/jacoco.exec">
[INFO] 
[INFO] --- maven-remote-resources-plugin:1.5:process (process-resource-bundles) @ qpid-client
---
[INFO] 
[INFO] --- maven-resources-plugin:2.7:resources (default-resources) @ qpid-client ---
[INFO] Using 'UTF-8' encoding to copy filtered resources.
[INFO] Copying 1 resource
[INFO] Copying 4 resources
[INFO] Copying 3 resources
[INFO] 
[INFO] --- maven-compiler-plugin:3.5.1:compile (default-compile) @ qpid-client ---
[INFO] Compiling 553 source files to <https://builds.apache.org/job/Qpid-JMS-AMQP-0-x-Broker-J-TestMatrix/Ubuntu%20Slaves=ubuntu,jdk=JDK%201.8%20(latest),qpid.amqp.version=0-9-1/ws/client/target/classes>
[INFO] <https://builds.apache.org/job/Qpid-JMS-AMQP-0-x-Broker-J-TestMatrix/Ubuntu%20Slaves=ubuntu,jdk=JDK%201.8%20(latest),qpid.amqp.version=0-9-1/ws/client/src/main/java/org/apache/qpid/client/message/AbstractJMSMessageFactory.java>:
Some input files use unchecked or unsafe operations.
[INFO] <https://builds.apache.org/job/Qpid-JMS-AMQP-0-x-Broker-J-TestMatrix/Ubuntu%20Slaves=ubuntu,jdk=JDK%201.8%20(latest),qpid.amqp.version=0-9-1/ws/client/src/main/java/org/apache/qpid/client/message/AbstractJMSMessageFactory.java>:
Recompile with -Xlint:unchecked for details.
[INFO] -------------------------------------------------------------
[WARNING] COMPILATION WARNING : 
[INFO] -------------------------------------------------------------
[WARNING] bootstrap class path not set in conjunction with -source 1.7
[INFO] 1 warning
[INFO] -------------------------------------------------------------
[INFO] -------------------------------------------------------------
[ERROR] COMPILATION ERROR : 
[INFO] -------------------------------------------------------------
[ERROR] <https://builds.apache.org/job/Qpid-JMS-AMQP-0-x-Broker-J-TestMatrix/Ubuntu%20Slaves=ubuntu,jdk=JDK%201.8%20(latest),qpid.amqp.version=0-9-1/ws/client/src/main/java/org/apache/qpid/client/protocol/AMQProtocolSession.java>:[501,37]
cannot find symbol
  symbol:   method propagateExceptionToMethodFrameListener(int,org.apache.qpid.framing.AMQMethodBody,org.apache.qpid.QpidException)
  location: variable _protocolHandler of type org.apache.qpid.client.AMQProtocolHandler
[INFO] 1 error
[INFO] -------------------------------------------------------------
[INFO] 
[INFO] ------------------------------------------------------------------------
[INFO] Skipping Apache Qpid JMS AMQP 0-x Bundles
[INFO] This project has been banned from the build due to previous failures.
[INFO] ------------------------------------------------------------------------
[INFO] 
[INFO] ------------------------------------------------------------------------
[INFO] Skipping Apache Qpid JMS AMQP 0-x Examples
[INFO] This project has been banned from the build due to previous failures.
[INFO] ------------------------------------------------------------------------
[INFO] 
[INFO] ------------------------------------------------------------------------
[INFO] Building Apache Qpid JMS AMQP 0-x Docbook 6.4.0-SNAPSHOT
[INFO] ------------------------------------------------------------------------
[INFO] 
[INFO] --- maven-clean-plugin:3.0.0:clean (default-clean) @ qpid-java-doc ---
[INFO] 
[INFO] --- maven-enforcer-plugin:1.4.1:enforce (enforce-minimum-versions) @ qpid-java-doc
---
[INFO] 
[INFO] --- jacoco-maven-plugin:0.7.5.201505241946:prepare-agent (default-prepare-agent) @
qpid-java-doc ---
[INFO] argLine set to "-javaagent:/home/jenkins/.m2/repository/org/jacoco/org.jacoco.agent/0.7.5.201505241946/org.jacoco.agent-0.7.5.201505241946-runtime.jar=destfile=<https://builds.apache.org/job/Qpid-JMS-AMQP-0-x-Broker-J-TestMatrix/Ubuntu%20Slaves=ubuntu,jdk=JDK%201.8%20(latest),qpid.amqp.version=0-9-1/ws/doc/target/jacoco.exec">
[INFO] 
[INFO] --- maven-remote-resources-plugin:1.5:process (process-resource-bundles) @ qpid-java-doc
---
[INFO] 
[INFO] --- maven-site-plugin:3.5.1:attach-descriptor (attach-descriptor) @ qpid-java-doc ---
[INFO] 
[INFO] --- maven-assembly-plugin:2.6:single (default) @ qpid-java-doc ---
[INFO] Assemblies have been skipped per configuration of the skipAssembly parameter.
[INFO] 
[INFO] ------------------------------------------------------------------------
[INFO] Building Apache Qpid JMS AMQP 0-8, 0-9 and 0-9-1 Docbook 6.4.0-SNAPSHOT
[INFO] ------------------------------------------------------------------------
[INFO] 
[INFO] --- maven-clean-plugin:3.0.0:clean (default-clean) @ qpid-java-doc-jms-client-0-8 ---
[INFO] 
[INFO] --- maven-enforcer-plugin:1.4.1:enforce (enforce-minimum-versions) @ qpid-java-doc-jms-client-0-8
---
[INFO] 
[INFO] --- jacoco-maven-plugin:0.7.5.201505241946:prepare-agent (default-prepare-agent) @
qpid-java-doc-jms-client-0-8 ---
[INFO] argLine set to "-javaagent:/home/jenkins/.m2/repository/org/jacoco/org.jacoco.agent/0.7.5.201505241946/org.jacoco.agent-0.7.5.201505241946-runtime.jar=destfile=<https://builds.apache.org/job/Qpid-JMS-AMQP-0-x-Broker-J-TestMatrix/Ubuntu%20Slaves=ubuntu,jdk=JDK%201.8%20(latest),qpid.amqp.version=0-9-1/ws/doc/jms-client-0-8/target/jacoco.exec">
[INFO] 
[INFO] --- maven-resources-plugin:2.7:copy-resources (filter-docbook-sources) @ qpid-java-doc-jms-client-0-8
---
[INFO] Using 'UTF-8' encoding to copy filtered resources.
[INFO] Copying 18 resources
[INFO] 
[INFO] --- maven-remote-resources-plugin:1.5:process (process-resource-bundles) @ qpid-java-doc-jms-client-0-8
---
[INFO] 
[INFO] --- maven-resources-plugin:2.7:resources (default-resources) @ qpid-java-doc-jms-client-0-8
---
[INFO] Using 'UTF-8' encoding to copy filtered resources.
[INFO] Copying 18 resources
[INFO] 
[INFO] --- maven-compiler-plugin:3.5.1:compile (default-compile) @ qpid-java-doc-jms-client-0-8
---
[INFO] No sources to compile
[INFO] 
[INFO] --- maven-resources-plugin:2.7:testResources (default-testResources) @ qpid-java-doc-jms-client-0-8
---
[INFO] Using 'UTF-8' encoding to copy filtered resources.
[INFO] Copying 18 resources
[INFO] 
[INFO] --- maven-compiler-plugin:3.5.1:testCompile (default-testCompile) @ qpid-java-doc-jms-client-0-8
---
[INFO] No sources to compile
[INFO] 
[INFO] --- maven-surefire-plugin:2.19.1:test (default-test) @ qpid-java-doc-jms-client-0-8
---
[INFO] No tests to run.
[INFO] 
[INFO] --- maven-jar-plugin:3.0.0:jar (default-jar) @ qpid-java-doc-jms-client-0-8 ---
[WARNING] JAR will be empty - no content was marked for inclusion!
[INFO] Building jar: <https://builds.apache.org/job/Qpid-JMS-AMQP-0-x-Broker-J-TestMatrix/Ubuntu%20Slaves=ubuntu,jdk=JDK%201.8%20(latest),qpid.amqp.version=0-9-1/ws/doc/jms-client-0-8/target/qpid-java-doc-jms-client-0-8-6.4.0-SNAPSHOT.jar>
[INFO] 
[INFO] --- maven-site-plugin:3.5.1:attach-descriptor (attach-descriptor) @ qpid-java-doc-jms-client-0-8
---
[INFO] 
[INFO] --- maven-assembly-plugin:2.6:single (default) @ qpid-java-doc-jms-client-0-8 ---
[INFO] Assemblies have been skipped per configuration of the skipAssembly parameter.
[INFO] 
[INFO] ------------------------------------------------------------------------
[INFO] Building Apache Qpid JMS AMQP 0-10 Docbook 6.4.0-SNAPSHOT
[INFO] ------------------------------------------------------------------------
[INFO] 
[INFO] --- maven-clean-plugin:3.0.0:clean (default-clean) @ qpid-java-doc-jms-client-0-10
---
[INFO] 
[INFO] --- maven-enforcer-plugin:1.4.1:enforce (enforce-minimum-versions) @ qpid-java-doc-jms-client-0-10
---
[INFO] 
[INFO] --- jacoco-maven-plugin:0.7.5.201505241946:prepare-agent (default-prepare-agent) @
qpid-java-doc-jms-client-0-10 ---
[INFO] argLine set to "-javaagent:/home/jenkins/.m2/repository/org/jacoco/org.jacoco.agent/0.7.5.201505241946/org.jacoco.agent-0.7.5.201505241946-runtime.jar=destfile=<https://builds.apache.org/job/Qpid-JMS-AMQP-0-x-Broker-J-TestMatrix/Ubuntu%20Slaves=ubuntu,jdk=JDK%201.8%20(latest),qpid.amqp.version=0-9-1/ws/doc/jms-client-0-10/target/jacoco.exec">
[INFO] 
[INFO] --- maven-resources-plugin:2.7:copy-resources (filter-docbook-sources) @ qpid-java-doc-jms-client-0-10
---
[INFO] Using 'UTF-8' encoding to copy filtered resources.
[INFO] Copying 1 resource
[INFO] 
[INFO] --- maven-remote-resources-plugin:1.5:process (process-resource-bundles) @ qpid-java-doc-jms-client-0-10
---
[INFO] 
[INFO] --- maven-resources-plugin:2.7:resources (default-resources) @ qpid-java-doc-jms-client-0-10
---
[INFO] Using 'UTF-8' encoding to copy filtered resources.
[INFO] Copying 1 resource
[INFO] 
[INFO] --- maven-compiler-plugin:3.5.1:compile (default-compile) @ qpid-java-doc-jms-client-0-10
---
[INFO] No sources to compile
[INFO] 
[INFO] --- maven-resources-plugin:2.7:testResources (default-testResources) @ qpid-java-doc-jms-client-0-10
---
[INFO] Using 'UTF-8' encoding to copy filtered resources.
[INFO] Copying 1 resource
[INFO] 
[INFO] --- maven-compiler-plugin:3.5.1:testCompile (default-testCompile) @ qpid-java-doc-jms-client-0-10
---
[INFO] No sources to compile
[INFO] 
[INFO] --- maven-surefire-plugin:2.19.1:test (default-test) @ qpid-java-doc-jms-client-0-10
---
[INFO] No tests to run.
[INFO] 
[INFO] --- maven-jar-plugin:3.0.0:jar (default-jar) @ qpid-java-doc-jms-client-0-10 ---
[WARNING] JAR will be empty - no content was marked for inclusion!
[INFO] Building jar: <https://builds.apache.org/job/Qpid-JMS-AMQP-0-x-Broker-J-TestMatrix/Ubuntu%20Slaves=ubuntu,jdk=JDK%201.8%20(latest),qpid.amqp.version=0-9-1/ws/doc/jms-client-0-10/target/qpid-java-doc-jms-client-0-10-6.4.0-SNAPSHOT.jar>
[INFO] 
[INFO] --- maven-site-plugin:3.5.1:attach-descriptor (attach-descriptor) @ qpid-java-doc-jms-client-0-10
---
[INFO] 
[INFO] --- maven-assembly-plugin:2.6:single (default) @ qpid-java-doc-jms-client-0-10 ---
[INFO] Assemblies have been skipped per configuration of the skipAssembly parameter.
[INFO] 
[INFO] ------------------------------------------------------------------------
[INFO] Skipping Apache Qpid JMS AMQP 0-x System Tests
[INFO] This project has been banned from the build due to previous failures.
[INFO] ------------------------------------------------------------------------
[INFO] ------------------------------------------------------------------------
[INFO] Reactor Summary:
[INFO] 
[INFO] Apache Qpid JMS AMQP 0-x Parent .................... SUCCESS [  2.243 s]
[INFO] Apache Qpid JMS AMQP 0-x ........................... FAILURE [  5.057 s]
[INFO] Apache Qpid JMS AMQP 0-x Bundles ................... SKIPPED
[INFO] Apache Qpid JMS AMQP 0-x Examples .................. SKIPPED
[INFO] Apache Qpid JMS AMQP 0-x Docbook ................... SUCCESS [  0.305 s]
[INFO] Apache Qpid JMS AMQP 0-8, 0-9 and 0-9-1 Docbook .... SUCCESS [  0.621 s]
[INFO] Apache Qpid JMS AMQP 0-10 Docbook .................. SUCCESS [  0.094 s]
[INFO] Apache Qpid JMS AMQP 0-x System Tests .............. SKIPPED
[INFO] ------------------------------------------------------------------------
[INFO] BUILD FAILURE
[INFO] ------------------------------------------------------------------------
[INFO] Total time: 8.648 s
[INFO] Finished at: 2018-07-13T10:15:16Z
[INFO] Final Memory: 35M/1619M
[INFO] ------------------------------------------------------------------------
[ERROR] Failed to execute goal org.apache.maven.plugins:maven-compiler-plugin:3.5.1:compile
(default-compile) on project qpid-client: Compilation failure
[ERROR] <https://builds.apache.org/job/Qpid-JMS-AMQP-0-x-Broker-J-TestMatrix/Ubuntu%20Slaves=ubuntu,jdk=JDK%201.8%20(latest),qpid.amqp.version=0-9-1/ws/client/src/main/java/org/apache/qpid/client/protocol/AMQProtocolSession.java>:[501,37]
cannot find symbol
[ERROR]   symbol:   method propagateExceptionToMethodFrameListener(int,org.apache.qpid.framing.AMQMethodBody,org.apache.qpid.QpidException)
[ERROR]   location: variable _protocolHandler of type org.apache.qpid.client.AMQProtocolHandler
[ERROR] 
[ERROR] -> [Help 1]
[ERROR] 
[ERROR] To see the full stack trace of the errors, re-run Maven with the -e switch.
[ERROR] Re-run Maven using the -X switch to enable full debug logging.
[ERROR] 
[ERROR] For more information about the errors and possible solutions, please read the following
articles:
[ERROR] [Help 1] http://cwiki.apache.org/confluence/display/MAVEN/MojoFailureException
[ERROR] 
[ERROR] After correcting the problems, you can resume the build with the command
[ERROR]   mvn <goals> -rf :qpid-client
Build step 'Invoke top-level Maven targets' marked build as failure
Archiving artifacts
Performing Post build task...
Match found for : : True
Logical operation result is TRUE
Running script  : echo Finishing build
date
[0-9-1] $ /bin/bash -xe /tmp/jenkins1026575121303349603.sh
+ echo Finishing build
Finishing build
+ date
Fri Jul 13 10:15:18 UTC 2018
POST BUILD TASK : SUCCESS
END OF POST BUILD TASK : 0
Recording test results
ERROR: Step ?Publish JUnit test result report? failed: No test report files were found. Configuration
error?

Mime
View raw message