qpid-notifications mailing list archives

Site index · List index
Message view « Date » · « Thread »
Top « Date » · « Thread »
From Apache Jenkins Server <jenk...@builds.apache.org>
Subject Build failed in Jenkins: Qpid-JMS-Test-JDK8 #678
Date Thu, 21 Jun 2018 22:17:12 GMT
See <https://builds.apache.org/job/Qpid-JMS-Test-JDK8/678/display/redirect?page=changes>

Changes:

[tabish121] QPIDJMS-395 Adding additional failover handling tests

------------------------------------------
[...truncated 6.83 KB...]
[INFO] Changes detected - recompiling the module!
[INFO] Compiling 247 source files to <https://builds.apache.org/job/Qpid-JMS-Test-JDK8/ws/qpid-jms-client/target/classes>
[INFO] <https://builds.apache.org/job/Qpid-JMS-Test-JDK8/ws/qpid-jms-client/src/main/java/org/apache/qpid/jms/jndi/LazyCreateContext.java>:
Some input files use unchecked or unsafe operations.
[INFO] <https://builds.apache.org/job/Qpid-JMS-Test-JDK8/ws/qpid-jms-client/src/main/java/org/apache/qpid/jms/jndi/LazyCreateContext.java>:
Recompile with -Xlint:unchecked for details.
[INFO] 
[INFO] --- maven-resources-plugin:2.7:testResources (default-testResources) @ qpid-jms-client
---
[INFO] Using 'UTF-8' encoding to copy filtered resources.
[INFO] Copying 32 resources
[INFO] Copying 3 resources
[INFO] 
[INFO] --- maven-compiler-plugin:3.5.1:testCompile (default-testCompile) @ qpid-jms-client
---
[INFO] Changes detected - recompiling the module!
[INFO] Compiling 310 source files to <https://builds.apache.org/job/Qpid-JMS-Test-JDK8/ws/qpid-jms-client/target/test-classes>
[INFO] 
[INFO] --- maven-surefire-plugin:2.19.1:test (default-test) @ qpid-jms-client ---
[INFO] Surefire report directory: <https://builds.apache.org/job/Qpid-JMS-Test-JDK8/ws/qpid-jms-client/target/surefire-reports>

-------------------------------------------------------
 T E S T S
-------------------------------------------------------
Running org.apache.qpid.jms.util.TypeConversionSupportTest
Tests run: 38, Failures: 0, Errors: 0, Skipped: 0, Time elapsed: 0.112 sec - in org.apache.qpid.jms.util.TypeConversionSupportTest
Running org.apache.qpid.jms.util.FifoMessageQueueTest
Tests run: 22, Failures: 0, Errors: 0, Skipped: 0, Time elapsed: 1.249 sec - in org.apache.qpid.jms.util.FifoMessageQueueTest
Running org.apache.qpid.jms.util.LRUCacheTest
Tests run: 3, Failures: 0, Errors: 0, Skipped: 0, Time elapsed: 5.086 sec - in org.apache.qpid.jms.util.LRUCacheTest
Running org.apache.qpid.jms.util.ContentTypeSupportTest
Tests run: 31, Failures: 0, Errors: 0, Skipped: 0, Time elapsed: 0.035 sec - in org.apache.qpid.jms.util.ContentTypeSupportTest
Running org.apache.qpid.jms.util.ClassLoadingAwareObjectInputStreamTest
Tests run: 33, Failures: 0, Errors: 0, Skipped: 0, Time elapsed: 0.165 sec - in org.apache.qpid.jms.util.ClassLoadingAwareObjectInputStreamTest
Running org.apache.qpid.jms.util.StopWatchTest
Tests run: 4, Failures: 0, Errors: 0, Skipped: 0, Time elapsed: 0.914 sec - in org.apache.qpid.jms.util.StopWatchTest
Running org.apache.qpid.jms.util.PriorityMessageQueueTest
Tests run: 26, Failures: 0, Errors: 0, Skipped: 0, Time elapsed: 2.27 sec - in org.apache.qpid.jms.util.PriorityMessageQueueTest
Running org.apache.qpid.jms.util.ThreadPoolUtilsTest
Tests run: 11, Failures: 0, Errors: 0, Skipped: 0, Time elapsed: 0.152 sec - in org.apache.qpid.jms.util.ThreadPoolUtilsTest
Running org.apache.qpid.jms.util.PropertyUtilTest
Tests run: 65, Failures: 0, Errors: 0, Skipped: 0, Time elapsed: 0.467 sec - in org.apache.qpid.jms.util.PropertyUtilTest
Running org.apache.qpid.jms.util.IOExceptionSupportTest
Tests run: 5, Failures: 0, Errors: 0, Skipped: 0, Time elapsed: 0 sec - in org.apache.qpid.jms.util.IOExceptionSupportTest
Running org.apache.qpid.jms.util.URISupportTest
Tests run: 30, Failures: 0, Errors: 0, Skipped: 0, Time elapsed: 0.012 sec - in org.apache.qpid.jms.util.URISupportTest
Running org.apache.qpid.jms.util.IdGeneratorTest
Tests run: 4, Failures: 0, Errors: 0, Skipped: 0, Time elapsed: 0.001 sec - in org.apache.qpid.jms.util.IdGeneratorTest
Running org.apache.qpid.jms.util.StringArrayConverterTest
Tests run: 3, Failures: 0, Errors: 0, Skipped: 0, Time elapsed: 0.001 sec - in org.apache.qpid.jms.util.StringArrayConverterTest
Running org.apache.qpid.jms.util.FactoryFinderTest
Tests run: 4, Failures: 0, Errors: 0, Skipped: 0, Time elapsed: 0.005 sec - in org.apache.qpid.jms.util.FactoryFinderTest
Running org.apache.qpid.jms.jndi.JmsInitialContextFactoryTest
Tests run: 23, Failures: 0, Errors: 0, Skipped: 0, Time elapsed: 0.082 sec - in org.apache.qpid.jms.jndi.JmsInitialContextFactoryTest
Running org.apache.qpid.jms.jndi.JNDIReferenceFactoryTest
Tests run: 6, Failures: 0, Errors: 0, Skipped: 0, Time elapsed: 0.234 sec - in org.apache.qpid.jms.jndi.JNDIReferenceFactoryTest
Running org.apache.qpid.jms.JmsConnectionFactoryTest
Tests run: 47, Failures: 0, Errors: 0, Skipped: 0, Time elapsed: 0.794 sec - in org.apache.qpid.jms.JmsConnectionFactoryTest
Running org.apache.qpid.jms.policy.JmsDefaultPrefetchPolicyTest
Tests run: 7, Failures: 0, Errors: 0, Skipped: 0, Time elapsed: 0 sec - in org.apache.qpid.jms.policy.JmsDefaultPrefetchPolicyTest
Running org.apache.qpid.jms.policy.JmsDefaultPresettlePolicyTest
Tests run: 19, Failures: 0, Errors: 0, Skipped: 0, Time elapsed: 0.444 sec - in org.apache.qpid.jms.policy.JmsDefaultPresettlePolicyTest
Running org.apache.qpid.jms.policy.JmsDefaultRedeliveryPolicyTest
Tests run: 12, Failures: 0, Errors: 0, Skipped: 0, Time elapsed: 0.001 sec - in org.apache.qpid.jms.policy.JmsDefaultRedeliveryPolicyTest
Running org.apache.qpid.jms.policy.JmsDefaultDeserializationPolicyTest
Tests run: 10, Failures: 0, Errors: 0, Skipped: 0, Time elapsed: 0.008 sec - in org.apache.qpid.jms.policy.JmsDefaultDeserializationPolicyTest
Running org.apache.qpid.jms.JmsQueueTest
Tests run: 18, Failures: 0, Errors: 0, Skipped: 0, Time elapsed: 0.01 sec - in org.apache.qpid.jms.JmsQueueTest
Running org.apache.qpid.jms.sasl.AnonymousMechanismTest
Tests run: 11, Failures: 0, Errors: 0, Skipped: 0, Time elapsed: 0.003 sec - in org.apache.qpid.jms.sasl.AnonymousMechanismTest
Running org.apache.qpid.jms.sasl.AbstractMechanismTest
Tests run: 1, Failures: 0, Errors: 0, Skipped: 0, Time elapsed: 0 sec - in org.apache.qpid.jms.sasl.AbstractMechanismTest
Running org.apache.qpid.jms.sasl.PlainMechanismTest
Tests run: 11, Failures: 0, Errors: 0, Skipped: 0, Time elapsed: 0.002 sec - in org.apache.qpid.jms.sasl.PlainMechanismTest
Running org.apache.qpid.jms.sasl.ExternalMechanismTest
Tests run: 6, Failures: 0, Errors: 0, Skipped: 0, Time elapsed: 0.002 sec - in org.apache.qpid.jms.sasl.ExternalMechanismTest
Running org.apache.qpid.jms.sasl.GssapiMechanismTest
Tests run: 2, Failures: 0, Errors: 0, Skipped: 0, Time elapsed: 0.001 sec - in org.apache.qpid.jms.sasl.GssapiMechanismTest
Running org.apache.qpid.jms.sasl.XOauth2MechanismTest
Tests run: 13, Failures: 0, Errors: 0, Skipped: 0, Time elapsed: 0.003 sec - in org.apache.qpid.jms.sasl.XOauth2MechanismTest
Running org.apache.qpid.jms.sasl.ScramSHA1MechanismTest
Tests run: 10, Failures: 0, Errors: 0, Skipped: 0, Time elapsed: 0.128 sec - in org.apache.qpid.jms.sasl.ScramSHA1MechanismTest
Running org.apache.qpid.jms.sasl.CramMD5MechanismTest
Tests run: 10, Failures: 0, Errors: 0, Skipped: 0, Time elapsed: 0.005 sec - in org.apache.qpid.jms.sasl.CramMD5MechanismTest
Running org.apache.qpid.jms.sasl.ScramSHA256MechanismTest
Tests run: 10, Failures: 0, Errors: 0, Skipped: 0, Time elapsed: 0.096 sec - in org.apache.qpid.jms.sasl.ScramSHA256MechanismTest
Running org.apache.qpid.jms.JmsQueueConnectionTest
Tests run: 3, Failures: 0, Errors: 0, Skipped: 0, Time elapsed: 0.011 sec - in org.apache.qpid.jms.JmsQueueConnectionTest
Running org.apache.qpid.jms.JmsContextTest
Tests run: 93, Failures: 0, Errors: 0, Skipped: 0, Time elapsed: 1.059 sec - in org.apache.qpid.jms.JmsContextTest
Running org.apache.qpid.jms.provider.WrappedAsyncResultTest
Tests run: 4, Failures: 0, Errors: 0, Skipped: 0, Time elapsed: 0 sec - in org.apache.qpid.jms.provider.WrappedAsyncResultTest
Running org.apache.qpid.jms.provider.NoOpAsyncResultTest
Tests run: 3, Failures: 0, Errors: 0, Skipped: 0, Time elapsed: 0 sec - in org.apache.qpid.jms.provider.NoOpAsyncResultTest
Running org.apache.qpid.jms.provider.ProviderFutureTest
Tests run: 9, Failures: 0, Errors: 0, Skipped: 0, Time elapsed: 0.038 sec - in org.apache.qpid.jms.provider.ProviderFutureTest
Running org.apache.qpid.jms.provider.failover.FailoverProviderOfflineBehaviorTest
Tests run: 10, Failures: 0, Errors: 0, Skipped: 0, Time elapsed: 0.314 sec - in org.apache.qpid.jms.provider.failover.FailoverProviderOfflineBehaviorTest
Running org.apache.qpid.jms.provider.failover.FailoverWithAmqpOpenProvidedServerListIntegrationTest
Tests run: 12, Failures: 0, Errors: 0, Skipped: 0, Time elapsed: 2.458 sec - in org.apache.qpid.jms.provider.failover.FailoverWithAmqpOpenProvidedServerListIntegrationTest
Running org.apache.qpid.jms.provider.failover.FailoverUriPoolTest
Tests run: 34, Failures: 0, Errors: 0, Skipped: 0, Time elapsed: 0.103 sec - in org.apache.qpid.jms.provider.failover.FailoverUriPoolTest
Running org.apache.qpid.jms.provider.failover.FailoverProviderClosedTest
Tests run: 15, Failures: 0, Errors: 0, Skipped: 0, Time elapsed: 0.016 sec - in org.apache.qpid.jms.provider.failover.FailoverProviderClosedTest
Running org.apache.qpid.jms.provider.failover.FailoverIntegrationTest
Killed

Results :

Tests run: 678, Failures: 0, Errors: 0, Skipped: 0

[JENKINS] Recording test results
[JENKINS] Archiving disabled
[INFO]                                                                         
[INFO] ------------------------------------------------------------------------
[INFO] Skipping QpidJMS Discovery Library
[INFO] This project has been banned from the build due to previous failures.
[INFO] ------------------------------------------------------------------------
[INFO]                                                                         
[INFO] ------------------------------------------------------------------------
[INFO] Building QpidJMS Broker Interop Tests 0.34.0-SNAPSHOT
[INFO] ------------------------------------------------------------------------
[INFO] 
[INFO] --- maven-clean-plugin:3.0.0:clean (default-clean) @ qpid-jms-interop-tests ---
[INFO] 
[INFO] --- jacoco-maven-plugin:0.8.1:prepare-agent (default) @ qpid-jms-interop-tests ---
[INFO] Skipping JaCoCo execution because property jacoco.skip is set.
[INFO] jacoco-config set to empty
[INFO] 
[INFO] --- maven-remote-resources-plugin:1.5:process (process-resource-bundles) @ qpid-jms-interop-tests
---
[INFO] 
[INFO] --- maven-site-plugin:3.5.1:attach-descriptor (attach-descriptor) @ qpid-jms-interop-tests
---
[JENKINS] Archiving disabled
[INFO]                                                                         
[INFO] ------------------------------------------------------------------------
[INFO] Skipping QpidJMS ActiveMQ Interop Tests
[INFO] This project has been banned from the build due to previous failures.
[INFO] ------------------------------------------------------------------------
[INFO]                                                                         
[INFO] ------------------------------------------------------------------------
[INFO] Skipping QpidJMS Examples
[INFO] This project has been banned from the build due to previous failures.
[INFO] ------------------------------------------------------------------------
[INFO]                                                                         
[INFO] ------------------------------------------------------------------------
[INFO] Building QpidJMS Docs 0.34.0-SNAPSHOT
[INFO] ------------------------------------------------------------------------
[INFO] 
[INFO] --- maven-clean-plugin:3.0.0:clean (default-clean) @ qpid-jms-docs ---
[INFO] 
[INFO] --- jacoco-maven-plugin:0.8.1:prepare-agent (default) @ qpid-jms-docs ---
[INFO] Skipping JaCoCo execution because property jacoco.skip is set.
[INFO] jacoco-config set to empty
[INFO] 
[INFO] --- maven-remote-resources-plugin:1.5:process (process-resource-bundles) @ qpid-jms-docs
---
[INFO] 
[INFO] --- maven-site-plugin:3.5.1:attach-descriptor (attach-descriptor) @ qpid-jms-docs ---
[JENKINS] Archiving disabled
[INFO]                                                                         
[INFO] ------------------------------------------------------------------------
[INFO] Skipping Apache Qpid JMS
[INFO] This project has been banned from the build due to previous failures.
[INFO] ------------------------------------------------------------------------
[JENKINS] Archiving disabled
[JENKINS] Archiving disabled
[JENKINS] Archiving disabled
[JENKINS] Archiving disabled
[JENKINS] Archiving disabled
[JENKINS] Archiving disabled
[JENKINS] Archiving disabled
[JENKINS] Archiving disabled
[INFO] ------------------------------------------------------------------------
[INFO] Reactor Summary:
[INFO] 
[INFO] QpidJMS ............................................ SUCCESS [  8.483 s]
[INFO] QpidJMS Client ..................................... FAILURE [01:53 min]
[INFO] QpidJMS Discovery Library .......................... SKIPPED
[INFO] QpidJMS Broker Interop Tests ....................... SUCCESS [  1.326 s]
[INFO] QpidJMS ActiveMQ Interop Tests ..................... SKIPPED
[INFO] QpidJMS Examples ................................... SKIPPED
[INFO] QpidJMS Docs ....................................... SUCCESS [  1.164 s]
[INFO] Apache Qpid JMS .................................... SKIPPED
[INFO] ------------------------------------------------------------------------
[INFO] BUILD FAILURE
[INFO] ------------------------------------------------------------------------
[INFO] Total time: 02:26 min
[INFO] Finished at: 2018-06-21T22:16:57+00:00
[INFO] Final Memory: 52M/1308M
[INFO] ------------------------------------------------------------------------
Waiting for Jenkins to finish collecting data
[ERROR] Failed to execute goal org.apache.maven.plugins:maven-surefire-plugin:2.19.1:test
(default-test) on project qpid-jms-client: Execution default-test of goal org.apache.maven.plugins:maven-surefire-plugin:2.19.1:test
failed: The forked VM terminated without properly saying goodbye. VM crash or System.exit
called?
[ERROR] Command was /bin/sh -c cd <https://builds.apache.org/job/Qpid-JMS-Test-JDK8/ws/qpid-jms-client>
&& /usr/local/asfpackages/java/jdk1.8.0_172/jre/bin/java -Xmx2g -enableassertions
'-javaagent:/home/jenkins/jenkins-slave/maven-repositories/0/org/jacoco/org.jacoco.agent/0.8.1/org.jacoco.agent-0.8.1-runtime.jar=destfile=<https://builds.apache.org/job/Qpid-JMS-Test-JDK8/ws/qpid-jms-client/target/jacoco.exec,excludes=org/apache/qpid/jms/selector/parser/*.*'>
-jar <https://builds.apache.org/job/Qpid-JMS-Test-JDK8/ws/qpid-jms-client/target/surefire/surefirebooter8894943694494230275.jar>
<https://builds.apache.org/job/Qpid-JMS-Test-JDK8/ws/qpid-jms-client/target/surefire/surefire8334824453641003525tmp>
<https://builds.apache.org/job/Qpid-JMS-Test-JDK8/ws/qpid-jms-client/target/surefire/surefire_08263027649622851731tmp>
[ERROR] -> [Help 1]
org.apache.maven.lifecycle.LifecycleExecutionException: Failed to execute goal org.apache.maven.plugins:maven-surefire-plugin:2.19.1:test
(default-test) on project qpid-jms-client: Execution default-test of goal org.apache.maven.plugins:maven-surefire-plugin:2.19.1:test
failed: The forked VM terminated without properly saying goodbye. VM crash or System.exit
called?
Command was /bin/sh -c cd <https://builds.apache.org/job/Qpid-JMS-Test-JDK8/ws/qpid-jms-client>
&& /usr/local/asfpackages/java/jdk1.8.0_172/jre/bin/java -Xmx2g -enableassertions
'-javaagent:/home/jenkins/jenkins-slave/maven-repositories/0/org/jacoco/org.jacoco.agent/0.8.1/org.jacoco.agent-0.8.1-runtime.jar=destfile=<https://builds.apache.org/job/Qpid-JMS-Test-JDK8/ws/qpid-jms-client/target/jacoco.exec,excludes=org/apache/qpid/jms/selector/parser/*.*'>
-jar <https://builds.apache.org/job/Qpid-JMS-Test-JDK8/ws/qpid-jms-client/target/surefire/surefirebooter8894943694494230275.jar>
<https://builds.apache.org/job/Qpid-JMS-Test-JDK8/ws/qpid-jms-client/target/surefire/surefire8334824453641003525tmp>
<https://builds.apache.org/job/Qpid-JMS-Test-JDK8/ws/qpid-jms-client/target/surefire/surefire_08263027649622851731tmp>
	at org.apache.maven.lifecycle.internal.MojoExecutor.execute(MojoExecutor.java:224)
	at org.apache.maven.lifecycle.internal.MojoExecutor.execute(MojoExecutor.java:153)
	at org.apache.maven.lifecycle.internal.MojoExecutor.execute(MojoExecutor.java:145)
	at org.apache.maven.lifecycle.internal.LifecycleModuleBuilder.buildProject(LifecycleModuleBuilder.java:116)
	at org.apache.maven.lifecycle.internal.LifecycleModuleBuilder.buildProject(LifecycleModuleBuilder.java:80)
	at org.apache.maven.lifecycle.internal.builder.singlethreaded.SingleThreadedBuilder.build(SingleThreadedBuilder.java:51)
	at org.apache.maven.lifecycle.internal.LifecycleStarter.execute(LifecycleStarter.java:128)
	at org.apache.maven.DefaultMaven.doExecute(DefaultMaven.java:307)
	at org.apache.maven.DefaultMaven.doExecute(DefaultMaven.java:193)
	at org.apache.maven.DefaultMaven.execute(DefaultMaven.java:106)
	at org.jvnet.hudson.maven3.launcher.Maven33Launcher.main(Maven33Launcher.java:129)
	at sun.reflect.NativeMethodAccessorImpl.invoke0(Native Method)
	at sun.reflect.NativeMethodAccessorImpl.invoke(NativeMethodAccessorImpl.java:62)
	at sun.reflect.DelegatingMethodAccessorImpl.invoke(DelegatingMethodAccessorImpl.java:43)
	at java.lang.reflect.Method.invoke(Method.java:498)
	at org.codehaus.plexus.classworlds.launcher.Launcher.launchStandard(Launcher.java:330)
	at org.codehaus.plexus.classworlds.launcher.Launcher.launch(Launcher.java:238)
	at jenkins.maven3.agent.Maven33Main.launch(Maven33Main.java:176)
	at sun.reflect.NativeMethodAccessorImpl.invoke0(Native Method)
	at sun.reflect.NativeMethodAccessorImpl.invoke(NativeMethodAccessorImpl.java:62)
	at sun.reflect.DelegatingMethodAccessorImpl.invoke(DelegatingMethodAccessorImpl.java:43)
	at java.lang.reflect.Method.invoke(Method.java:498)
	at hudson.maven.Maven3Builder.call(Maven3Builder.java:139)
	at hudson.maven.Maven3Builder.call(Maven3Builder.java:70)
	at hudson.remoting.UserRequest.perform(UserRequest.java:207)
	at hudson.remoting.UserRequest.perform(UserRequest.java:53)
	at hudson.remoting.Request$2.run(Request.java:358)
	at hudson.remoting.InterceptingExecutorService$1.call(InterceptingExecutorService.java:72)
	at java.util.concurrent.FutureTask.run(FutureTask.java:266)
	at java.util.concurrent.ThreadPoolExecutor.runWorker(ThreadPoolExecutor.java:1149)
	at java.util.concurrent.ThreadPoolExecutor$Worker.run(ThreadPoolExecutor.java:624)
	at java.lang.Thread.run(Thread.java:748)
Caused by: org.apache.maven.plugin.PluginExecutionException: Execution default-test of goal
org.apache.maven.plugins:maven-surefire-plugin:2.19.1:test failed: The forked VM terminated
without properly saying goodbye. VM crash or System.exit called?
Command was /bin/sh -c cd <https://builds.apache.org/job/Qpid-JMS-Test-JDK8/ws/qpid-jms-client>
&& /usr/local/asfpackages/java/jdk1.8.0_172/jre/bin/java -Xmx2g -enableassertions
'-javaagent:/home/jenkins/jenkins-slave/maven-repositories/0/org/jacoco/org.jacoco.agent/0.8.1/org.jacoco.agent-0.8.1-runtime.jar=destfile=<https://builds.apache.org/job/Qpid-JMS-Test-JDK8/ws/qpid-jms-client/target/jacoco.exec,excludes=org/apache/qpid/jms/selector/parser/*.*'>
-jar <https://builds.apache.org/job/Qpid-JMS-Test-JDK8/ws/qpid-jms-client/target/surefire/surefirebooter8894943694494230275.jar>
<https://builds.apache.org/job/Qpid-JMS-Test-JDK8/ws/qpid-jms-client/target/surefire/surefire8334824453641003525tmp>
<https://builds.apache.org/job/Qpid-JMS-Test-JDK8/ws/qpid-jms-client/target/surefire/surefire_08263027649622851731tmp>
	at org.apache.maven.plugin.DefaultBuildPluginManager.executeMojo(DefaultBuildPluginManager.java:145)
	at org.apache.maven.lifecycle.internal.MojoExecutor.execute(MojoExecutor.java:208)
	... 31 more
Caused by: java.lang.RuntimeException: The forked VM terminated without properly saying goodbye.
VM crash or System.exit called?
Command was /bin/sh -c cd <https://builds.apache.org/job/Qpid-JMS-Test-JDK8/ws/qpid-jms-client>
&& /usr/local/asfpackages/java/jdk1.8.0_172/jre/bin/java -Xmx2g -enableassertions
'-javaagent:/home/jenkins/jenkins-slave/maven-repositories/0/org/jacoco/org.jacoco.agent/0.8.1/org.jacoco.agent-0.8.1-runtime.jar=destfile=<https://builds.apache.org/job/Qpid-JMS-Test-JDK8/ws/qpid-jms-client/target/jacoco.exec,excludes=org/apache/qpid/jms/selector/parser/*.*'>
-jar <https://builds.apache.org/job/Qpid-JMS-Test-JDK8/ws/qpid-jms-client/target/surefire/surefirebooter8894943694494230275.jar>
<https://builds.apache.org/job/Qpid-JMS-Test-JDK8/ws/qpid-jms-client/target/surefire/surefire8334824453641003525tmp>
<https://builds.apache.org/job/Qpid-JMS-Test-JDK8/ws/qpid-jms-client/target/surefire/surefire_08263027649622851731tmp>
	at org.apache.maven.plugin.surefire.booterclient.ForkStarter.fork(ForkStarter.java:590)
	at org.apache.maven.plugin.surefire.booterclient.ForkStarter.fork(ForkStarter.java:460)
	at org.apache.maven.plugin.surefire.booterclient.ForkStarter.run(ForkStarter.java:229)
	at org.apache.maven.plugin.surefire.booterclient.ForkStarter.run(ForkStarter.java:201)
	at org.apache.maven.plugin.surefire.AbstractSurefireMojo.executeProvider(AbstractSurefireMojo.java:1026)
	at org.apache.maven.plugin.surefire.AbstractSurefireMojo.executeAfterPreconditionsChecked(AbstractSurefireMojo.java:862)
	at org.apache.maven.plugin.surefire.AbstractSurefireMojo.execute(AbstractSurefireMojo.java:755)
	at org.apache.maven.plugin.DefaultBuildPluginManager.executeMojo(DefaultBuildPluginManager.java:134)
	... 32 more
[ERROR] 
[ERROR] Re-run Maven using the -X switch to enable full debug logging.
[ERROR] 
[ERROR] For more information about the errors and possible solutions, please read the following
articles:
[ERROR] [Help 1] http://cwiki.apache.org/confluence/display/MAVEN/PluginExecutionException
[ERROR] 
[ERROR] After correcting the problems, you can resume the build with the command
[ERROR]   mvn <goals> -rf :qpid-jms-client
Sending e-mails to: notifications@qpid.apache.org
channel stopped

Mime
View raw message