qpid-notifications mailing list archives

Site index · List index
Message view « Date » · « Thread »
Top « Date » · « Thread »
From Apache Jenkins Server <jenk...@builds.apache.org>
Subject Build failed in Jenkins: Qpid-Broker-J-Artefact-Release-7.0.x #46
Date Wed, 21 Mar 2018 12:45:38 GMT
See <https://builds.apache.org/job/Qpid-Broker-J-Artefact-Release-7.0.x/46/display/redirect?page=changes>

Changes:

[orudyy] QPID-7948: [Broker-J] [AMQP 0-9-1] [Publisher Confirms] Ensure that

------------------------------------------
[...truncated 384.57 KB...]
[INFO] Apache Qpid Broker-J JDBC Message Store Plug-in .... SUCCESS [  1.048 s]
[INFO] Apache Qpid Broker-J Derby Message Store Plug-in ... SUCCESS [  0.749 s]
[INFO] Apache Qpid Broker-J JDBC Message Store Connection Pooling Plug-in SUCCESS [  0.412
s]
[INFO] Apache Qpid AMQP 1.0 JDBC Link Store Plug-in ....... SUCCESS [  0.337 s]
[INFO] Apache Qpid Broker-J HTTP Management Plug-in ....... SUCCESS [  2.074 s]
[INFO] Apache Qpid Broker-J AMQP Management Protocol Plug-in SUCCESS [  0.309 s]
[INFO] Apache Qpid Broker-J Memory Message Store Plug-in .. SUCCESS [  0.291 s]
[INFO] Apache Qpid Broker-J WebSocket Plug-in ............. SUCCESS [  0.640 s]
[INFO] Apache Qpid Broker-J BDB Message Store Plug-in ..... SUCCESS [  2.432 s]
[INFO] Apache Qpid AMQP 1.0 BDB Link Store Plug-in ........ SUCCESS [  0.485 s]
[INFO] Apache Qpid Broker-J ............................... SUCCESS [  1.370 s]
[INFO] Apache Qpid Broker-J Bundles ....................... SUCCESS [  9.782 s]
[INFO] Apache Qpid Broker-J Tools ......................... SUCCESS [  0.216 s]
[INFO] Apache Qpid Broker-J System Test Parent ............ SUCCESS [  0.975 s]
[INFO] Apache Qpid Broker-J System Tests .................. SUCCESS [  3.936 s]
[INFO] Apache Qpid Broker-J System Test Utils ............. SUCCESS [  0.329 s]
[INFO] Apache Qpid Broker-J JMS 2.0 System Tests .......... SUCCESS [  1.952 s]
[INFO] Apache Qpid Broker-J Protocol Tests Core ........... SUCCESS [  0.399 s]
[INFO] Apache Qpid Protocol Tests for AMQP 1.0 ............ SUCCESS [  1.915 s]
[INFO] Apache Qpid Broker-J End to End Conversion Tests ... SUCCESS [  4.203 s]
[INFO] Apache Qpid Broker-J Performance Tests ............. SUCCESS [  1.650 s]
[INFO] Apache Qpid Broker-J Performance Test System Tests . SUCCESS [  1.751 s]
[INFO] Apache Qpid Broker-J Performance Tests Visualisation JFC SUCCESS [  1.670 s]
[INFO] Apache Qpid Broker-J BDB Store System Tests ........ SUCCESS [  1.268 s]
[INFO] Apache Qpid Joram JMS Tests ........................ SUCCESS [  0.173 s]
[INFO] Apache Qpid Broker-J JMS TCK Configuration ......... SUCCESS [  0.149 s]
[INFO] Apache Qpid Broker-J Docbook ....................... SUCCESS [  0.041 s]
[INFO] Apache Qpid Broker-J Docbook ....................... SUCCESS [  0.396 s]
[INFO] Apache Qpid Broker-J Performance Test Docbook ...... SUCCESS [  0.084 s]
[INFO] ------------------------------------------------------------------------
[INFO] BUILD SUCCESS
[INFO] ------------------------------------------------------------------------
[INFO] Total time: 01:21 min
[INFO] Finished at: 2018-03-21T12:44:38Z
[INFO] Final Memory: 175M/6381M
[INFO] ------------------------------------------------------------------------
[Qpid-Broker-J-Artefact-Release-7.0.x] $ /home/jenkins/tools/maven/latest3/bin/mvn -f ./pom.xml
-Djava.io.tmpdir=<https://builds.apache.org/job/Qpid-Broker-J-Artefact-Release-7.0.x/ws/tmp>
-DskipTests=true deploy
[INFO] Scanning for projects...
[INFO] ------------------------------------------------------------------------
[INFO] Reactor Build Order:
[INFO] 
[INFO] Apache Qpid Broker-J Parent
[INFO] Apache Qpid Broker-J Code Generation
[INFO] Apache Qpid Broker-J Test Utilities
[INFO] Apache Qpid Broker-J Core
[INFO] Apache Qpid Broker-J LogBack Logging Plug-in
[INFO] Apache Qpid Broker-J Access Control Plug-in
[INFO] Apache Qpid Broker-J AMQP 0-10 Protocol Plug-in
[INFO] Apache Qpid Broker-J AMQP 0-8 Protocol Plug-in
[INFO] Apache Qpid Broker-J AMQP 1-0 Protocol Plug-in
[INFO] Apache Qpid Broker-J AMQP 0-8 to 0-10 Message Conversion Plug-in
[INFO] Apache Qpid Broker-J AMQP 0-8 to 1-0 Message Conversion Plug-in
[INFO] Apache Qpid Broker-J AMQP 0-10 to 1-0 Message Conversion Plug-in
[INFO] Apache Qpid Broker-J JDBC Message Store Plug-in
[INFO] Apache Qpid Broker-J Derby Message Store Plug-in
[INFO] Apache Qpid Broker-J JDBC Message Store Connection Pooling Plug-in
[INFO] Apache Qpid AMQP 1.0 JDBC Link Store Plug-in
[INFO] Apache Qpid Broker-J HTTP Management Plug-in
[INFO] Apache Qpid Broker-J AMQP Management Protocol Plug-in
[INFO] Apache Qpid Broker-J Memory Message Store Plug-in
[INFO] Apache Qpid Broker-J WebSocket Plug-in
[INFO] Apache Qpid Broker-J BDB Message Store Plug-in
[INFO] Apache Qpid AMQP 1.0 BDB Link Store Plug-in
[INFO] Apache Qpid Broker-J
[INFO] Apache Qpid Broker-J Bundles
[INFO] Apache Qpid Broker-J Tools
[INFO] Apache Qpid Broker-J System Test Parent
[INFO] Apache Qpid Broker-J System Tests
[INFO] Apache Qpid Broker-J System Test Utils
[INFO] Apache Qpid Broker-J JMS 2.0 System Tests
[INFO] Apache Qpid Broker-J Protocol Tests Core
[INFO] Apache Qpid Protocol Tests for AMQP 1.0
[INFO] Apache Qpid Broker-J End to End Conversion Tests
[INFO] Apache Qpid Broker-J Performance Tests
[INFO] Apache Qpid Broker-J Performance Test System Tests
[INFO] Apache Qpid Broker-J Performance Tests Visualisation JFC
[INFO] Apache Qpid Broker-J BDB Store System Tests
[INFO] Apache Qpid Joram JMS Tests
[INFO] Apache Qpid Broker-J JMS TCK Configuration
[INFO] Apache Qpid Broker-J Docbook
[INFO] Apache Qpid Broker-J Docbook
[INFO] Apache Qpid Broker-J Performance Test Docbook
[INFO] 
[INFO] ------------------------------------------------------------------------
[INFO] Building Apache Qpid Broker-J Parent 7.0.3-SNAPSHOT
[INFO] ------------------------------------------------------------------------
[INFO] 
[INFO] --- maven-antrun-plugin:1.8:run (output-test-properties) @ qpid-broker-parent ---
[INFO] Executing tasks

main:
     [echo] Qpid Test Profile Properties
     [echo] [profile] java-mms.1-0
     [echo] [profile.broker.language] java
     [echo] [profile.broker.type] internal
     [echo] [profile.broker.command] "<https://builds.apache.org/job/Qpid-Broker-J-Artefact-Release-7.0.x/ws/./bin/qpid-server">
-sp "@STORE_PATH" -st @STORE_TYPE -prop test.port=@PORT -prop "qpid.work_dir=@QPID_WORK"
     [echo] [profile.specific.excludes] JavaTransientExcludes Java10Excludes Java10BrokenTestsExcludes
Java10UninvestigatedTestsExcludes
     [echo] [profile.test.excludes] Excludes JavaExcludes java-mms.1-0.excludes JavaTransientExcludes
Java10Excludes Java10BrokenTestsExcludes Java10UninvestigatedTestsExcludes
     [echo] [profile.broker.version] v1_0
     [echo] [profile.test.amqp_port_protocols] ["AMQP_0_8","AMQP_0_9","AMQP_0_9_1","AMQP_0_10","AMQP_1_0"]
     [echo] [profile.broker.persistent] false
     [echo] [profile.virtualhostnode.type] Memory
     [echo] [profile.virtualhostnode.context.blueprint] {"type":"ProvidedStore","globalAddressDomains":"${qpid.globalAddressDomains}"}
     [echo] [profile.test_receive_timeout] 1000
[INFO] Executed tasks
[INFO] 
[INFO] --- maven-enforcer-plugin:1.4.1:enforce (enforce-minimum-versions) @ qpid-broker-parent
---
[INFO] 
[INFO] --- maven-enforcer-plugin:1.4.1:enforce (enforce-versions-standard-properties) @ qpid-broker-parent
---
[INFO] 
[INFO] --- maven-enforcer-plugin:1.4.1:enforce (enforce-enableAmqp0x) @ qpid-broker-parent
---
[INFO] 
[INFO] --- jacoco-maven-plugin:0.7.5.201505241946:prepare-agent (default-prepare-agent) @
qpid-broker-parent ---
[INFO] argLine set to -javaagent:/home/jenkins/.m2/repository/org/jacoco/org.jacoco.agent/0.7.5.201505241946/org.jacoco.agent-0.7.5.201505241946-runtime.jar=destfile=<https://builds.apache.org/job/Qpid-Broker-J-Artefact-Release-7.0.x/ws/./target/jacoco.exec>
-Xmx512m
[INFO] 
[INFO] --- maven-remote-resources-plugin:1.5:process (process-resource-bundles) @ qpid-broker-parent
---
[INFO] 
[INFO] --- maven-site-plugin:3.5.1:attach-descriptor (attach-descriptor) @ qpid-broker-parent
---
[INFO] 
[INFO] --- maven-install-plugin:2.5.2:install (default-install) @ qpid-broker-parent ---
[INFO] Installing <https://builds.apache.org/job/Qpid-Broker-J-Artefact-Release-7.0.x/ws/./pom.xml>
to /home/jenkins/.m2/repository/org/apache/qpid/qpid-broker-parent/7.0.3-SNAPSHOT/qpid-broker-parent-7.0.3-SNAPSHOT.pom
[INFO] 
[INFO] --- maven-deploy-plugin:2.8.2:deploy (default-deploy) @ qpid-broker-parent ---
Downloading from apache.snapshots.https: https://repository.apache.org/content/repositories/snapshots/org/apache/qpid/qpid-broker-parent/7.0.3-SNAPSHOT/maven-metadata.xml
Progress (1): 612 B                   Downloaded from apache.snapshots.https: https://repository.apache.org/content/repositories/snapshots/org/apache/qpid/qpid-broker-parent/7.0.3-SNAPSHOT/maven-metadata.xml
(612 B at 737 B/s)
Uploading to apache.snapshots.https: https://repository.apache.org/content/repositories/snapshots/org/apache/qpid/qpid-broker-parent/7.0.3-SNAPSHOT/qpid-broker-parent-7.0.3-20180321.124446-12.pom
Progress (1): 2.0/69 kBProgress (1): 4.1/69 kBProgress (1): 6.1/69 kBProgress (1): 8.2/69
kBProgress (1): 10/69 kB Progress (1): 12/69 kBProgress (1): 14/69 kBProgress (1): 16/69 kBProgress
(1): 18/69 kBProgress (1): 20/69 kBProgress (1): 23/69 kBProgress (1): 25/69 kBProgress (1):
27/69 kBProgress (1): 29/69 kBProgress (1): 31/69 kBProgress (1): 33/69 kBProgress (1): 35/69
kBProgress (1): 37/69 kBProgress (1): 39/69 kBProgress (1): 41/69 kBProgress (1): 43/69 kBProgress
(1): 45/69 kBProgress (1): 47/69 kBProgress (1): 49/69 kBProgress (1): 51/69 kBProgress (1):
53/69 kBProgress (1): 55/69 kBProgress (1): 57/69 kBProgress (1): 59/69 kBProgress (1): 61/69
kBProgress (1): 63/69 kBProgress (1): 66/69 kBProgress (1): 68/69 kBProgress (1): 69 kB  
                   Uploaded to apache.snapshots.https: https://repository.apache.org/content/repositories/snapshots/org/apache/qpid/qpid-broker-parent/7.0.3-SNAPSHOT/qpid-broker-parent-7.0.3-20180321.124446-12.pom
(69 kB at 65 kB/s)
Downloading from apache.snapshots.https: https://repository.apache.org/content/repositories/snapshots/org/apache/qpid/qpid-broker-parent/maven-metadata.xml
Progress (1): 393 B                   Downloaded from apache.snapshots.https: https://repository.apache.org/content/repositories/snapshots/org/apache/qpid/qpid-broker-parent/maven-metadata.xml
(393 B at 823 B/s)
Uploading to apache.snapshots.https: https://repository.apache.org/content/repositories/snapshots/org/apache/qpid/qpid-broker-parent/7.0.3-SNAPSHOT/maven-metadata.xml
Progress (1): 612 B                   Uploaded to apache.snapshots.https: https://repository.apache.org/content/repositories/snapshots/org/apache/qpid/qpid-broker-parent/7.0.3-SNAPSHOT/maven-metadata.xml
(612 B at 693 B/s)
Uploading to apache.snapshots.https: https://repository.apache.org/content/repositories/snapshots/org/apache/qpid/qpid-broker-parent/maven-metadata.xml
Progress (1): 393 B                   Uploaded to apache.snapshots.https: https://repository.apache.org/content/repositories/snapshots/org/apache/qpid/qpid-broker-parent/maven-metadata.xml
(393 B at 448 B/s)
[INFO] 
[INFO] ------------------------------------------------------------------------
[INFO] Building Apache Qpid Broker-J Code Generation 7.0.3-SNAPSHOT
[INFO] ------------------------------------------------------------------------
[INFO] 
[INFO] --- maven-antrun-plugin:1.8:run (output-test-properties) @ qpid-broker-codegen ---
[INFO] Executing tasks

main:
     [echo] Qpid Test Profile Properties
     [echo] [profile] java-mms.1-0
     [echo] [profile.broker.language] java
     [echo] [profile.broker.type] internal
     [echo] [profile.broker.command] "<https://builds.apache.org/job/Qpid-Broker-J-Artefact-Release-7.0.x/ws/broker-codegen/bin/qpid-server">
-sp "@STORE_PATH" -st @STORE_TYPE -prop test.port=@PORT -prop "qpid.work_dir=@QPID_WORK"
     [echo] [profile.specific.excludes] JavaTransientExcludes Java10Excludes Java10BrokenTestsExcludes
Java10UninvestigatedTestsExcludes
     [echo] [profile.test.excludes] Excludes JavaExcludes java-mms.1-0.excludes JavaTransientExcludes
Java10Excludes Java10BrokenTestsExcludes Java10UninvestigatedTestsExcludes
     [echo] [profile.broker.version] v1_0
     [echo] [profile.test.amqp_port_protocols] ["AMQP_0_8","AMQP_0_9","AMQP_0_9_1","AMQP_0_10","AMQP_1_0"]
     [echo] [profile.broker.persistent] false
     [echo] [profile.virtualhostnode.type] Memory
     [echo] [profile.virtualhostnode.context.blueprint] {"type":"ProvidedStore","globalAddressDomains":"${qpid.globalAddressDomains}"}
     [echo] [profile.test_receive_timeout] 1000
[INFO] Executed tasks
[INFO] 
[INFO] --- maven-enforcer-plugin:1.4.1:enforce (enforce-minimum-versions) @ qpid-broker-codegen
---
[INFO] 
[INFO] --- maven-enforcer-plugin:1.4.1:enforce (enforce-versions-standard-properties) @ qpid-broker-codegen
---
[INFO] 
[INFO] --- maven-enforcer-plugin:1.4.1:enforce (enforce-enableAmqp0x) @ qpid-broker-codegen
---
[INFO] 
[INFO] --- jacoco-maven-plugin:0.7.5.201505241946:prepare-agent (default-prepare-agent) @
qpid-broker-codegen ---
[INFO] argLine set to -javaagent:/home/jenkins/.m2/repository/org/jacoco/org.jacoco.agent/0.7.5.201505241946/org.jacoco.agent-0.7.5.201505241946-runtime.jar=destfile=<https://builds.apache.org/job/Qpid-Broker-J-Artefact-Release-7.0.x/ws/broker-codegen/target/jacoco.exec>
-Xmx512m
[INFO] 
[INFO] --- maven-remote-resources-plugin:1.5:process (process-resource-bundles) @ qpid-broker-codegen
---
[INFO] 
[INFO] --- maven-resources-plugin:2.7:resources (default-resources) @ qpid-broker-codegen
---
[INFO] Using 'UTF-8' encoding to copy filtered resources.
[INFO] Copying 1 resource
[INFO] Copying 3 resources
[INFO] 
[INFO] --- maven-compiler-plugin:3.5.1:compile (default-compile) @ qpid-broker-codegen ---
[INFO] Nothing to compile - all classes are up to date
[INFO] 
[INFO] --- maven-resources-plugin:2.7:testResources (default-testResources) @ qpid-broker-codegen
---
[INFO] Using 'UTF-8' encoding to copy filtered resources.
[INFO] skip non existing resourceDirectory <https://builds.apache.org/job/Qpid-Broker-J-Artefact-Release-7.0.x/ws/broker-codegen/src/test/resources>
[INFO] Copying 3 resources
[INFO] 
[INFO] --- maven-compiler-plugin:3.5.1:testCompile (default-testCompile) @ qpid-broker-codegen
---
[INFO] No sources to compile
[INFO] 
[INFO] --- maven-surefire-plugin:2.19.1:test (default-test) @ qpid-broker-codegen ---
[INFO] Tests are skipped.
[INFO] 
[INFO] --- maven-jar-plugin:3.0.0:jar (default-jar) @ qpid-broker-codegen ---
[INFO] Building jar: <https://builds.apache.org/job/Qpid-Broker-J-Artefact-Release-7.0.x/ws/broker-codegen/target/qpid-broker-codegen-7.0.3-SNAPSHOT.jar>
[INFO] ------------------------------------------------------------------------
[INFO] Reactor Summary:
[INFO] 
[INFO] Apache Qpid Broker-J Parent ........................ SUCCESS [  7.271 s]
[INFO] Apache Qpid Broker-J Code Generation ............... FAILURE [  0.884 s]
[INFO] Apache Qpid Broker-J Test Utilities ................ SKIPPED
[INFO] Apache Qpid Broker-J Core .......................... SKIPPED
[INFO] Apache Qpid Broker-J LogBack Logging Plug-in ....... SKIPPED
[INFO] Apache Qpid Broker-J Access Control Plug-in ........ SKIPPED
[INFO] Apache Qpid Broker-J AMQP 0-10 Protocol Plug-in .... SKIPPED
[INFO] Apache Qpid Broker-J AMQP 0-8 Protocol Plug-in ..... SKIPPED
[INFO] Apache Qpid Broker-J AMQP 1-0 Protocol Plug-in ..... SKIPPED
[INFO] Apache Qpid Broker-J AMQP 0-8 to 0-10 Message Conversion Plug-in SKIPPED
[INFO] Apache Qpid Broker-J AMQP 0-8 to 1-0 Message Conversion Plug-in SKIPPED
[INFO] Apache Qpid Broker-J AMQP 0-10 to 1-0 Message Conversion Plug-in SKIPPED
[INFO] Apache Qpid Broker-J JDBC Message Store Plug-in .... SKIPPED
[INFO] Apache Qpid Broker-J Derby Message Store Plug-in ... SKIPPED
[INFO] Apache Qpid Broker-J JDBC Message Store Connection Pooling Plug-in SKIPPED
[INFO] Apache Qpid AMQP 1.0 JDBC Link Store Plug-in ....... SKIPPED
[INFO] Apache Qpid Broker-J HTTP Management Plug-in ....... SKIPPED
[INFO] Apache Qpid Broker-J AMQP Management Protocol Plug-in SKIPPED
[INFO] Apache Qpid Broker-J Memory Message Store Plug-in .. SKIPPED
[INFO] Apache Qpid Broker-J WebSocket Plug-in ............. SKIPPED
[INFO] Apache Qpid Broker-J BDB Message Store Plug-in ..... SKIPPED
[INFO] Apache Qpid AMQP 1.0 BDB Link Store Plug-in ........ SKIPPED
[INFO] Apache Qpid Broker-J ............................... SKIPPED
[INFO] Apache Qpid Broker-J Bundles ....................... SKIPPED
[INFO] Apache Qpid Broker-J Tools ......................... SKIPPED
[INFO] Apache Qpid Broker-J System Test Parent ............ SKIPPED
[INFO] Apache Qpid Broker-J System Tests .................. SKIPPED
[INFO] Apache Qpid Broker-J System Test Utils ............. SKIPPED
[INFO] Apache Qpid Broker-J JMS 2.0 System Tests .......... SKIPPED
[INFO] Apache Qpid Broker-J Protocol Tests Core ........... SKIPPED
[INFO] Apache Qpid Protocol Tests for AMQP 1.0 ............ SKIPPED
[INFO] Apache Qpid Broker-J End to End Conversion Tests ... SKIPPED
[INFO] Apache Qpid Broker-J Performance Tests ............. SKIPPED
[INFO] Apache Qpid Broker-J Performance Test System Tests . SKIPPED
[INFO] Apache Qpid Broker-J Performance Tests Visualisation JFC SKIPPED
[INFO] Apache Qpid Broker-J BDB Store System Tests ........ SKIPPED
[INFO] Apache Qpid Joram JMS Tests ........................ SKIPPED
[INFO] Apache Qpid Broker-J JMS TCK Configuration ......... SKIPPED
[INFO] Apache Qpid Broker-J Docbook ....................... SKIPPED
[INFO] Apache Qpid Broker-J Docbook ....................... SKIPPED
[INFO] Apache Qpid Broker-J Performance Test Docbook ...... SKIPPED
[INFO] ------------------------------------------------------------------------
[INFO] BUILD FAILURE
[INFO] ------------------------------------------------------------------------
[INFO] Total time: 8.850 s
[INFO] Finished at: 2018-03-21T12:44:50Z
[INFO] Final Memory: 50M/1190M
[INFO] ------------------------------------------------------------------------
[ERROR] unable to create new native thread -> [Help 1]
[ERROR] 
[ERROR] To see the full stack trace of the errors, re-run Maven with the -e switch.
[ERROR] Re-run Maven using the -X switch to enable full debug logging.
[ERROR] 
[ERROR] For more information about the errors and possible solutions, please read the following
articles:
[ERROR] [Help 1] http://cwiki.apache.org/confluence/display/MAVEN/OutOfMemoryError
Build step 'Invoke top-level Maven targets' marked build as failure
Archiving artifacts

Mime
View raw message