qpid-notifications mailing list archives

Site index · List index
Message view « Date » · « Thread »
Top « Date » · « Thread »
From Apache Jenkins Server <jenk...@builds.apache.org>
Subject Build failed in Jenkins: Qpid-Broker-J-7.0.x-TestMatrix » ubuntu,JDK 1.8 (latest),java-bdb.0-10 #55
Date Thu, 22 Mar 2018 12:30:26 GMT
See <https://builds.apache.org/job/Qpid-Broker-J-7.0.x-TestMatrix/Ubuntu%20Slaves=ubuntu,jdk=JDK%201.8%20(latest),profile=java-bdb.0-10/55/display/redirect?page=changes>

Changes:

[orudyy] QPID-7948: [Broker-J] [AMQP 0-9-1] [Publisher Confirms] Ensure that

------------------------------------------
[...truncated 423.45 KB...]
[INFO] --- maven-clean-plugin:3.0.0:clean (default-clean) @ qpid-bdbstore-systests ---
[INFO] 
[INFO] --- maven-antrun-plugin:1.8:run (output-test-properties) @ qpid-bdbstore-systests ---
[INFO] Executing tasks

main:
     [echo] Qpid Test Profile Properties
     [echo] [profile] java-bdb.0-10
     [echo] [profile.broker.language] java
     [echo] [profile.broker.type] internal
     [echo] [profile.broker.command] "<https://builds.apache.org/job/Qpid-Broker-J-7.0.x-TestMatrix/Ubuntu%20Slaves=ubuntu,jdk=JDK%201.8%20(latest),profile=java-bdb.0-10/ws/bdbstore/systests/target/qpid-broker/7.0.3-SNAPSHOT/bin/qpid-server">
-sp "@STORE_PATH" -st @STORE_TYPE -prop test.port=@PORT -prop "qpid.work_dir=@QPID_WORK"
     [echo] [profile.specific.excludes] JavaPersistentExcludes Java010Excludes JavaBDBExcludes
     [echo] [profile.test.excludes] Excludes JavaExcludes java-bdb.0-10.excludes JavaPersistentExcludes
Java010Excludes JavaBDBExcludes
     [echo] [profile.broker.version] v0_10
     [echo] [profile.test.amqp_port_protocols] ["AMQP_0_8","AMQP_0_9","AMQP_0_9_1","AMQP_0_10"]
     [echo] [profile.broker.persistent] true
     [echo] [profile.virtualhostnode.type] BDB
     [echo] [profile.virtualhostnode.context.blueprint] {"type":"ProvidedStore","globalAddressDomains":"${qpid.globalAddressDomains}"}
     [echo] [profile.test_receive_timeout] 1000
[INFO] Executed tasks
[INFO] 
[INFO] --- maven-enforcer-plugin:1.4.1:enforce (enforce-minimum-versions) @ qpid-bdbstore-systests
---
[INFO] 
[INFO] --- maven-enforcer-plugin:1.4.1:enforce (enforce-versions-standard-properties) @ qpid-bdbstore-systests
---
[INFO] 
[INFO] --- maven-enforcer-plugin:1.4.1:enforce (enforce-enableAmqp0x) @ qpid-bdbstore-systests
---
[INFO] 
[INFO] --- jacoco-maven-plugin:0.7.5.201505241946:prepare-agent (default-prepare-agent) @
qpid-bdbstore-systests ---
[INFO] Skipping JaCoCo execution because property jacoco.skip is set.
[INFO] argLine set to empty
[INFO] 
[INFO] --- maven-remote-resources-plugin:1.5:process (process-resource-bundles) @ qpid-bdbstore-systests
---
[INFO] 
[INFO] --- maven-resources-plugin:2.7:copy-resources (copy-systests-etc-resources) @ qpid-bdbstore-systests
---
[INFO] Using 'UTF-8' encoding to copy filtered resources.
[INFO] Copying 4 resources
[INFO] 
[INFO] --- maven-resources-plugin:2.7:copy-resources (copy-test-profile-resources) @ qpid-bdbstore-systests
---
[INFO] Using 'UTF-8' encoding to copy filtered resources.
[INFO] Copying 54 resources
[INFO] 
[INFO] --- maven-resources-plugin:2.7:copy-resources (copy-bdbstore-bin-resources) @ qpid-bdbstore-systests
---
[INFO] Using 'UTF-8' encoding to copy filtered resources.
[INFO] Copying 0 resource
[INFO] 
[INFO] --- maven-resources-plugin:2.7:resources (default-resources) @ qpid-bdbstore-systests
---
[INFO] Using 'UTF-8' encoding to copy filtered resources.
[INFO] skip non existing resourceDirectory <https://builds.apache.org/job/Qpid-Broker-J-7.0.x-TestMatrix/Ubuntu%20Slaves=ubuntu,jdk=JDK%201.8%20(latest),profile=java-bdb.0-10/ws/bdbstore/systests/src/main/resources>
[INFO] Copying 3 resources
[INFO] 
[INFO] --- maven-compiler-plugin:3.5.1:compile (default-compile) @ qpid-bdbstore-systests
---
[INFO] No sources to compile
[INFO] 
[INFO] --- maven-resources-plugin:2.7:testResources (default-testResources) @ qpid-bdbstore-systests
---
[INFO] Using 'UTF-8' encoding to copy filtered resources.
[INFO] skip non existing resourceDirectory <https://builds.apache.org/job/Qpid-Broker-J-7.0.x-TestMatrix/Ubuntu%20Slaves=ubuntu,jdk=JDK%201.8%20(latest),profile=java-bdb.0-10/ws/bdbstore/systests/src/test/resources>
[INFO] Copying 3 resources
[INFO] 
[INFO] --- maven-compiler-plugin:3.5.1:testCompile (default-testCompile) @ qpid-bdbstore-systests
---
[INFO] Compiling 8 source files to <https://builds.apache.org/job/Qpid-Broker-J-7.0.x-TestMatrix/Ubuntu%20Slaves=ubuntu,jdk=JDK%201.8%20(latest),profile=java-bdb.0-10/ws/bdbstore/systests/target/test-classes>
[INFO] <https://builds.apache.org/job/Qpid-Broker-J-7.0.x-TestMatrix/Ubuntu%20Slaves=ubuntu,jdk=JDK%201.8%20(latest),profile=java-bdb.0-10/ws/bdbstore/systests/src/test/java/org/apache/qpid/server/store/berkeleydb/BDBUpgradeTest.java>:
<https://builds.apache.org/job/Qpid-Broker-J-7.0.x-TestMatrix/Ubuntu%20Slaves=ubuntu,jdk=JDK%201.8%20(latest),profile=java-bdb.0-10/ws/bdbstore/systests/src/test/java/org/apache/qpid/server/store/berkeleydb/BDBUpgradeTest.java>
uses unchecked or unsafe operations.
[INFO] <https://builds.apache.org/job/Qpid-Broker-J-7.0.x-TestMatrix/Ubuntu%20Slaves=ubuntu,jdk=JDK%201.8%20(latest),profile=java-bdb.0-10/ws/bdbstore/systests/src/test/java/org/apache/qpid/server/store/berkeleydb/BDBUpgradeTest.java>:
Recompile with -Xlint:unchecked for details.
[INFO] 
[INFO] --- maven-surefire-plugin:2.19.1:test (default-test) @ qpid-bdbstore-systests ---
[INFO] Tests are skipped.
[INFO] 
[INFO] --- maven-jar-plugin:3.0.0:jar (default-jar) @ qpid-bdbstore-systests ---
[INFO] Building jar: <https://builds.apache.org/job/Qpid-Broker-J-7.0.x-TestMatrix/Ubuntu%20Slaves=ubuntu,jdk=JDK%201.8%20(latest),profile=java-bdb.0-10/ws/bdbstore/systests/target/qpid-bdbstore-systests-7.0.3-SNAPSHOT.jar>
[INFO] 
[INFO] --- maven-site-plugin:3.5.1:attach-descriptor (attach-descriptor) @ qpid-bdbstore-systests
---
[INFO] 
[INFO] --- maven-antrun-plugin:1.8:run (fix-bdb-script-permissions) @ qpid-bdbstore-systests
---
[INFO] Executing tasks

main:
[INFO] Executed tasks
[INFO] 
[INFO] --- maven-dependency-plugin:2.10:unpack (extract-broker-distribution) @ qpid-bdbstore-systests
---
[INFO] Configured Artifact: org.apache.qpid:apache-qpid-broker-j:bin:7.0.3-SNAPSHOT:tar.gz
[INFO] Unpacking <https://builds.apache.org/job/Qpid-Broker-J-7.0.x-TestMatrix/Ubuntu%20Slaves=ubuntu,jdk=JDK%201.8%20(latest),profile=java-bdb.0-10/ws/apache-qpid-broker-j/target/apache-qpid-broker-j-7.0.3-SNAPSHOT-bin.tar.gz>
to <https://builds.apache.org/job/Qpid-Broker-J-7.0.x-TestMatrix/Ubuntu%20Slaves=ubuntu,jdk=JDK%201.8%20(latest),profile=java-bdb.0-10/ws/bdbstore/systests/target>
with includes "" and excludes ""
[INFO] Expanding: <https://builds.apache.org/job/Qpid-Broker-J-7.0.x-TestMatrix/Ubuntu%20Slaves=ubuntu,jdk=JDK%201.8%20(latest),profile=java-bdb.0-10/ws/apache-qpid-broker-j/target/apache-qpid-broker-j-7.0.3-SNAPSHOT-bin.tar.gz>
into <https://builds.apache.org/job/Qpid-Broker-J-7.0.x-TestMatrix/Ubuntu%20Slaves=ubuntu,jdk=JDK%201.8%20(latest),profile=java-bdb.0-10/ws/bdbstore/systests/target>
[INFO] 
[INFO] ------------------------------------------------------------------------
[INFO] Building Apache Qpid Joram JMS Tests 7.0.3-SNAPSHOT
[INFO] ------------------------------------------------------------------------
[INFO] 
[INFO] --- maven-clean-plugin:3.0.0:clean (default-clean) @ joramtests ---
[INFO] 
[INFO] --- maven-antrun-plugin:1.8:run (output-test-properties) @ joramtests ---
[INFO] 
[INFO] ------------------------------------------------------------------------
[INFO] Building Apache Qpid Broker-J JMS TCK Configuration 7.0.3-SNAPSHOT
[INFO] ------------------------------------------------------------------------
[INFO] 
[INFO] --- maven-clean-plugin:3.0.0:clean (default-clean) @ qpid-tck ---
[INFO] 
[INFO] --- maven-antrun-plugin:1.8:run (output-test-properties) @ qpid-tck ---
[INFO] 
[INFO] ------------------------------------------------------------------------
[INFO] Building Apache Qpid Broker-J Docbook 7.0.3-SNAPSHOT
[INFO] ------------------------------------------------------------------------
[INFO] 
[INFO] --- maven-clean-plugin:3.0.0:clean (default-clean) @ qpid-java-doc ---
[INFO] 
[INFO] --- maven-antrun-plugin:1.8:run (output-test-properties) @ qpid-java-doc ---
[INFO] 
[INFO] ------------------------------------------------------------------------
[INFO] Skipping Apache Qpid Broker-J Docbook
[INFO] This project has been banned from the build due to previous failures.
[INFO] ------------------------------------------------------------------------
[INFO] 
[INFO] ------------------------------------------------------------------------
[INFO] Skipping Apache Qpid Broker-J Performance Test Docbook
[INFO] This project has been banned from the build due to previous failures.
[INFO] ------------------------------------------------------------------------
[INFO] ------------------------------------------------------------------------
[INFO] Reactor Summary:
[INFO] 
[INFO] Apache Qpid Broker-J Parent ........................ SUCCESS [  2.618 s]
[INFO] Apache Qpid Broker-J Code Generation ............... SUCCESS [  1.862 s]
[INFO] Apache Qpid Broker-J Test Utilities ................ SUCCESS [  0.541 s]
[INFO] Apache Qpid Broker-J Core .......................... SUCCESS [ 17.293 s]
[INFO] Apache Qpid Broker-J LogBack Logging Plug-in ....... SUCCESS [  1.058 s]
[INFO] Apache Qpid Broker-J Access Control Plug-in ........ SUCCESS [  0.893 s]
[INFO] Apache Qpid Broker-J AMQP 0-10 Protocol Plug-in .... SUCCESS [  1.241 s]
[INFO] Apache Qpid Broker-J AMQP 0-8 Protocol Plug-in ..... SUCCESS [  1.109 s]
[INFO] Apache Qpid Broker-J AMQP 1-0 Protocol Plug-in ..... SUCCESS [  2.125 s]
[INFO] Apache Qpid Broker-J AMQP 0-8 to 0-10 Message Conversion Plug-in SUCCESS [  0.396 s]
[INFO] Apache Qpid Broker-J AMQP 0-8 to 1-0 Message Conversion Plug-in SUCCESS [  0.426 s]
[INFO] Apache Qpid Broker-J AMQP 0-10 to 1-0 Message Conversion Plug-in SUCCESS [  0.400 s]
[INFO] Apache Qpid Broker-J JDBC Message Store Plug-in .... SUCCESS [  0.760 s]
[INFO] Apache Qpid Broker-J Derby Message Store Plug-in ... SUCCESS [  0.720 s]
[INFO] Apache Qpid Broker-J JDBC Message Store Connection Pooling Plug-in SUCCESS [  0.252
s]
[INFO] Apache Qpid AMQP 1.0 JDBC Link Store Plug-in ....... SUCCESS [  0.287 s]
[INFO] Apache Qpid Broker-J HTTP Management Plug-in ....... SUCCESS [  2.013 s]
[INFO] Apache Qpid Broker-J AMQP Management Protocol Plug-in SUCCESS [  0.720 s]
[INFO] Apache Qpid Broker-J Memory Message Store Plug-in .. SUCCESS [  0.420 s]
[INFO] Apache Qpid Broker-J WebSocket Plug-in ............. SUCCESS [  0.535 s]
[INFO] Apache Qpid Broker-J BDB Message Store Plug-in ..... SUCCESS [  1.624 s]
[INFO] Apache Qpid AMQP 1.0 BDB Link Store Plug-in ........ SUCCESS [  0.329 s]
[INFO] Apache Qpid Broker-J ............................... SUCCESS [  0.867 s]
[INFO] Apache Qpid Broker-J Bundles ....................... SUCCESS [  4.728 s]
[INFO] Apache Qpid Broker-J Tools ......................... SUCCESS [  0.279 s]
[INFO] Apache Qpid Broker-J System Test Parent ............ SUCCESS [  1.328 s]
[INFO] Apache Qpid Broker-J System Tests .................. SUCCESS [31:32 min]
[INFO] Apache Qpid Broker-J System Test Utils ............. SUCCESS [  1.385 s]
[INFO] Apache Qpid Broker-J JMS 2.0 System Tests .......... SUCCESS [  3.054 s]
[INFO] Apache Qpid Broker-J Protocol Tests Core ........... SUCCESS [  1.081 s]
[INFO] Apache Qpid Protocol Tests for AMQP 1.0 ............ SUCCESS [01:20 min]
[INFO] Apache Qpid Broker-J End to End Conversion Tests ... SUCCESS [  2.465 s]
[INFO] Apache Qpid Broker-J Performance Tests ............. SUCCESS [  1.541 s]
[INFO] Apache Qpid Broker-J Performance Test System Tests . SUCCESS [ 26.088 s]
[INFO] Apache Qpid Broker-J Performance Tests Visualisation JFC SUCCESS [  1.356 s]
[INFO] Apache Qpid Broker-J BDB Store System Tests ........ FAILURE [  1.247 s]
[INFO] Apache Qpid Joram JMS Tests ........................ FAILURE [  0.010 s]
[INFO] Apache Qpid Broker-J JMS TCK Configuration ......... FAILURE [  0.003 s]
[INFO] Apache Qpid Broker-J Docbook ....................... FAILURE [  0.002 s]
[INFO] Apache Qpid Broker-J Docbook ....................... SKIPPED
[INFO] Apache Qpid Broker-J Performance Test Docbook ...... SKIPPED
[INFO] ------------------------------------------------------------------------
[INFO] BUILD FAILURE
[INFO] ------------------------------------------------------------------------
[INFO] Total time: 34:17 min
[INFO] Finished at: 2018-03-22T12:27:28Z
[INFO] Final Memory: 155M/5575M
[INFO] ------------------------------------------------------------------------
[ERROR] Failed to execute goal org.apache.maven.plugins:maven-dependency-plugin:2.10:unpack
(extract-broker-distribution) on project qpid-bdbstore-systests: Error unpacking file: <https://builds.apache.org/job/Qpid-Broker-J-7.0.x-TestMatrix/Ubuntu%20Slaves=ubuntu,jdk=JDK%201.8%20(latest),profile=java-bdb.0-10/ws/apache-qpid-broker-j/target/apache-qpid-broker-j-7.0.3-SNAPSHOT-bin.tar.gz>
to: <https://builds.apache.org/job/Qpid-Broker-J-7.0.x-TestMatrix/Ubuntu%20Slaves=ubuntu,jdk=JDK%201.8%20(latest),profile=java-bdb.0-10/ws/bdbstore/systests/target>
[ERROR] org.codehaus.plexus.archiver.ArchiverException: Error while expanding <https://builds.apache.org/job/Qpid-Broker-J-7.0.x-TestMatrix/Ubuntu%20Slaves=ubuntu,jdk=JDK%201.8%20(latest),profile=java-bdb.0-10/ws/apache-qpid-broker-j/target/apache-qpid-broker-j-7.0.3-SNAPSHOT-bin.tar.gz>:
No space left on device
[ERROR] -> [Help 1]
[ERROR] Failed to execute goal org.apache.maven.plugins:maven-antrun-plugin:1.8:run (output-test-properties)
on project joramtests: Error executing Ant tasks: <https://builds.apache.org/job/Qpid-Broker-J-7.0.x-TestMatrix/Ubuntu%20Slaves=ubuntu,jdk=JDK%201.8%20(latest),profile=java-bdb.0-10/ws/joramtests/target/antrun/build-main.xml>
(No such file or directory) -> [Help 1]
[ERROR] Failed to execute goal org.apache.maven.plugins:maven-antrun-plugin:1.8:run (output-test-properties)
on project qpid-tck: Error executing Ant tasks: <https://builds.apache.org/job/Qpid-Broker-J-7.0.x-TestMatrix/Ubuntu%20Slaves=ubuntu,jdk=JDK%201.8%20(latest),profile=java-bdb.0-10/ws/tck/target/antrun/build-main.xml>
(No such file or directory) -> [Help 1]
[ERROR] Failed to execute goal org.apache.maven.plugins:maven-antrun-plugin:1.8:run (output-test-properties)
on project qpid-java-doc: Error executing Ant tasks: <https://builds.apache.org/job/Qpid-Broker-J-7.0.x-TestMatrix/Ubuntu%20Slaves=ubuntu,jdk=JDK%201.8%20(latest),profile=java-bdb.0-10/ws/doc/target/antrun/build-main.xml>
(No such file or directory) -> [Help 1]
[ERROR] 
[ERROR] To see the full stack trace of the errors, re-run Maven with the -e switch.
[ERROR] Re-run Maven using the -X switch to enable full debug logging.
[ERROR] 
[ERROR] For more information about the errors and possible solutions, please read the following
articles:
[ERROR] [Help 1] http://cwiki.apache.org/confluence/display/MAVEN/MojoExecutionException
[ERROR] 
[ERROR] After correcting the problems, you can resume the build with the command
[ERROR]   mvn <goals> -rf :qpid-bdbstore-systests
Build step 'Invoke top-level Maven targets' marked build as failure
Archiving artifacts
Performing Post build task...
Match found for : : True
Logical operation result is TRUE
Running script  : echo Finishing build
date
FATAL: Unable to produce a script file
Also:   hudson.remoting.Channel$CallSiteStackTrace: Remote call to H23
		at hudson.remoting.Channel.attachCallSiteStackTrace(Channel.java:1693)
		at hudson.remoting.UserResponse.retrieve(UserRequest.java:310)
		at hudson.remoting.Channel.call(Channel.java:908)
		at hudson.FilePath.act(FilePath.java:986)
		at hudson.FilePath.act(FilePath.java:975)
		at hudson.FilePath.createTextTempFile(FilePath.java:1363)
		at hudson.tasks.CommandInterpreter.createScriptFile(CommandInterpreter.java:162)
		at hudson.tasks.CommandInterpreter.perform(CommandInterpreter.java:94)
		at hudson.tasks.CommandInterpreter.perform(CommandInterpreter.java:66)
		at hudson.plugins.postbuildtask.PostbuildTask.perform(PostbuildTask.java:123)
		at hudson.tasks.BuildStepMonitor$1.perform(BuildStepMonitor.java:20)
		at hudson.model.AbstractBuild$AbstractBuildExecution.perform(AbstractBuild.java:744)
		at hudson.model.AbstractBuild$AbstractBuildExecution.performAllBuildSteps(AbstractBuild.java:690)
		at hudson.model.Build$BuildExecution.post2(Build.java:186)
		at hudson.model.AbstractBuild$AbstractBuildExecution.post(AbstractBuild.java:635)
		at hudson.model.Run.execute(Run.java:1749)
		at hudson.matrix.MatrixRun.run(MatrixRun.java:146)
		at hudson.model.ResourceController.execute(ResourceController.java:97)
		at hudson.model.Executor.run(Executor.java:429)
java.io.IOException: No space left on device
	at java.io.FileOutputStream.writeBytes(Native Method)
	at java.io.FileOutputStream.write(FileOutputStream.java:326)
	at sun.nio.cs.StreamEncoder.writeBytes(StreamEncoder.java:221)
	at sun.nio.cs.StreamEncoder.implClose(StreamEncoder.java:316)
	at sun.nio.cs.StreamEncoder.close(StreamEncoder.java:149)
	at java.io.OutputStreamWriter.close(OutputStreamWriter.java:233)
	at hudson.FilePath$17.invoke(FilePath.java:1380)
	at hudson.FilePath$17.invoke(FilePath.java:1363)
	at hudson.FilePath$FileCallableWrapper.call(FilePath.java:2760)
	at hudson.remoting.UserRequest.perform(UserRequest.java:207)
	at hudson.remoting.UserRequest.perform(UserRequest.java:53)
	at hudson.remoting.Request$2.run(Request.java:358)
	at hudson.remoting.InterceptingExecutorService$1.call(InterceptingExecutorService.java:72)
	at java.util.concurrent.FutureTask.run(FutureTask.java:266)
	at java.util.concurrent.ThreadPoolExecutor.runWorker(ThreadPoolExecutor.java:1142)
	at java.util.concurrent.ThreadPoolExecutor$Worker.run(ThreadPoolExecutor.java:617)
	at java.lang.Thread.run(Thread.java:748)
Caused: java.io.IOException: remote file operation failed: <https://builds.apache.org/job/Qpid-Broker-J-7.0.x-TestMatrix/Ubuntu%20Slaves=ubuntu,jdk=JDK%201.8%20(latest),profile=java-bdb.0-10/ws/>
at hudson.remoting.Channel@6a234be3:H23
	at hudson.FilePath.act(FilePath.java:993)
	at hudson.FilePath.act(FilePath.java:975)
	at hudson.FilePath.createTextTempFile(FilePath.java:1363)
Caused: java.io.IOException: Failed to create a temp file on <https://builds.apache.org/job/Qpid-Broker-J-7.0.x-TestMatrix/Ubuntu%20Slaves=ubuntu,jdk=JDK%201.8%20(latest),profile=java-bdb.0-10/ws/>
	at hudson.FilePath.createTextTempFile(FilePath.java:1386)
	at hudson.tasks.CommandInterpreter.createScriptFile(CommandInterpreter.java:162)
	at hudson.tasks.CommandInterpreter.perform(CommandInterpreter.java:94)
	at hudson.tasks.CommandInterpreter.perform(CommandInterpreter.java:66)
	at hudson.plugins.postbuildtask.PostbuildTask.perform(PostbuildTask.java:123)
	at hudson.tasks.BuildStepMonitor$1.perform(BuildStepMonitor.java:20)
	at hudson.model.AbstractBuild$AbstractBuildExecution.perform(AbstractBuild.java:744)
	at hudson.model.AbstractBuild$AbstractBuildExecution.performAllBuildSteps(AbstractBuild.java:690)
	at hudson.model.Build$BuildExecution.post2(Build.java:186)
	at hudson.model.AbstractBuild$AbstractBuildExecution.post(AbstractBuild.java:635)
	at hudson.model.Run.execute(Run.java:1749)
	at hudson.matrix.MatrixRun.run(MatrixRun.java:146)
	at hudson.model.ResourceController.execute(ResourceController.java:97)
	at hudson.model.Executor.run(Executor.java:429)
POST BUILD TASK : FAILURE
END OF POST BUILD TASK : 0
Recording test results

Mime
View raw message