qpid-notifications mailing list archives

Site index · List index
Message view « Date » · « Thread »
Top « Date » · « Thread »
From Apache Jenkins Server <jenk...@builds.apache.org>
Subject Build failed in Jenkins: Qpid-Broker-J-Checks #834
Date Mon, 19 Mar 2018 12:53:15 GMT
See <https://builds.apache.org/job/Qpid-Broker-J-Checks/834/display/redirect?page=changes>

Changes:

[kwall] QPID-8133: [Broker-J] Refresh Commons-CLI dependency (1.4)

[kwall] QPID-7567 : [Broker-J] Delegate consistently to underlying KeyManager

------------------------------------------
[...truncated 1.68 MB...]
main:
     [echo] Qpid Test Profile Properties
     [echo] [profile] java-mms.1-0
     [echo] [profile.broker.language] java
     [echo] [profile.broker.type] internal
     [echo] [profile.broker.command] "<https://builds.apache.org/job/Qpid-Broker-J-Checks/ws/doc/java-perftests/bin/qpid-server">
-sp "@STORE_PATH" -st @STORE_TYPE -prop test.port=@PORT -prop "qpid.work_dir=@QPID_WORK"
     [echo] [profile.specific.excludes] JavaTransientExcludes Java010Excludes
     [echo] [profile.test.excludes] Excludes JavaExcludes java-mms.1-0.excludes JavaTransientExcludes
Java010Excludes
     [echo] [profile.broker.version] 1.0
     [echo] [profile.test.amqp_port_protocols] ["AMQP_0_8","AMQP_0_9","AMQP_0_9_1","AMQP_0_10"]
     [echo] [profile.broker.persistent] false
     [echo] [profile.virtualhostnode.type] Memory
     [echo] [profile.virtualhostnode.context.blueprint] ${profile.virtualhostnode.context.blueprint}
     [echo] [profile.test_receive_timeout] 1000
[INFO] Executed tasks
[INFO] 
[INFO] --- maven-enforcer-plugin:1.4.1:enforce (enforce-minimum-versions) @ qpid-java-doc-perftests
---
[INFO] Skipping Rule Enforcement.
[INFO] 
[INFO] --- maven-enforcer-plugin:1.4.1:enforce (enforce-versions-standard-properties) @ qpid-java-doc-perftests
---
[INFO] Skipping Rule Enforcement.
[INFO] 
[INFO] --- maven-enforcer-plugin:1.4.1:enforce (enforce-enableAmqp0x) @ qpid-java-doc-perftests
---
[INFO] Skipping Rule Enforcement.
[INFO] 
[INFO] --- jacoco-maven-plugin:0.7.5.201505241946:prepare-agent (default-prepare-agent) @
qpid-java-doc-perftests ---
[INFO] argLine set to -javaagent:/home/jenkins/jenkins-slave/maven-repositories/1/org/jacoco/org.jacoco.agent/0.7.5.201505241946/org.jacoco.agent-0.7.5.201505241946-runtime.jar=destfile=<https://builds.apache.org/job/Qpid-Broker-J-Checks/ws/doc/java-perftests/target/jacoco.exec>
-Xmx512m
[INFO] 
[INFO] --- maven-resources-plugin:2.7:copy-resources (filter-docbook-sources) @ qpid-java-doc-perftests
---
[INFO] Using 'UTF-8' encoding to copy filtered resources.
[INFO] Copying 1 resource
[INFO] 
[INFO] --- maven-remote-resources-plugin:1.5:process (process-resource-bundles) @ qpid-java-doc-perftests
---
[INFO] 
[INFO] --- maven-resources-plugin:2.7:resources (default-resources) @ qpid-java-doc-perftests
---
[INFO] Using 'UTF-8' encoding to copy filtered resources.
[INFO] Copying 1 resource
[INFO] 
[INFO] --- maven-compiler-plugin:3.5.1:compile (default-compile) @ qpid-java-doc-perftests
---
[INFO] No sources to compile
[INFO] 
[INFO] --- maven-resources-plugin:2.7:testResources (default-testResources) @ qpid-java-doc-perftests
---
[INFO] Using 'UTF-8' encoding to copy filtered resources.
[INFO] Copying 1 resource
[INFO] 
[INFO] --- maven-compiler-plugin:3.5.1:testCompile (default-testCompile) @ qpid-java-doc-perftests
---
[INFO] No sources to compile
[INFO] 
[INFO] --- maven-surefire-plugin:2.19.1:test (default-test) @ qpid-java-doc-perftests ---
[INFO] Tests are skipped.
[INFO] 
[INFO] --- license-maven-plugin:1.6:add-third-party (check-third-party-licensing) @ qpid-java-doc-perftests
---
[INFO] Included licenses (whitelist): [Apache Software License, Version 2.0, The MIT License,
BSD License, Eclipse Public License - Version 1.0, Common Public License Version 1.0, Academic
Free License v2.1, COMMON DEVELOPMENT AND DISTRIBUTION LICENSE (CDDL) Version 1.0, Public
Domain]
[INFO] Writing third-party file to <https://builds.apache.org/job/Qpid-Broker-J-Checks/ws/doc/java-perftests/target/license-maven-plugin/THIRD-PARTY.txt>
[INFO] 
[INFO] --- maven-antrun-plugin:1.8:run (dependency-change-verification) @ qpid-java-doc-perftests
---
[INFO] Executing tasks

main:
[INFO] Executed tasks
[INFO] 
[INFO] --- maven-jar-plugin:3.0.0:jar (default-jar) @ qpid-java-doc-perftests ---
[WARNING] JAR will be empty - no content was marked for inclusion!
[INFO] Building jar: <https://builds.apache.org/job/Qpid-Broker-J-Checks/ws/doc/java-perftests/target/qpid-java-doc-perftests-7.1.0-SNAPSHOT.jar>
[INFO] 
[INFO] --- maven-site-plugin:3.5.1:attach-descriptor (attach-descriptor) @ qpid-java-doc-perftests
---
[INFO] 
[INFO] --- maven-assembly-plugin:2.6:single (default) @ qpid-java-doc-perftests ---
[INFO] Assemblies have been skipped per configuration of the skipAssembly parameter.
[INFO] 
[INFO] --- maven-assembly-plugin:2.6:single (source-release-assembly) @ qpid-java-doc-perftests
---
[INFO] Assemblies have been skipped per configuration of the skipAssembly parameter.
[INFO] 
[INFO] --- maven-source-plugin:3.0.0:jar-no-fork (attach-sources) @ qpid-java-doc-perftests
---
[INFO] Building jar: <https://builds.apache.org/job/Qpid-Broker-J-Checks/ws/doc/java-perftests/target/qpid-java-doc-perftests-7.1.0-SNAPSHOT-sources.jar>
[INFO] 
[INFO] --- maven-javadoc-plugin:2.10.3:jar (attach-javadocs) @ qpid-java-doc-perftests ---
[INFO] 
[INFO] --- maven-gpg-plugin:1.6:sign (sign-release-artifacts) @ qpid-java-doc-perftests ---
[JENKINS] Archiving disabled
[JENKINS] Archiving disabled
[JENKINS] Archiving disabled
[JENKINS] Archiving disabled
[JENKINS] Archiving disabled
[JENKINS] Archiving disabled
[JENKINS] Archiving disabled
[JENKINS] Archiving disabled
[JENKINS] Archiving disabled
[JENKINS] Archiving disabled
[JENKINS] Archiving disabled
[JENKINS] Archiving disabled
[JENKINS] Archiving disabled
[JENKINS] Archiving disabled
[JENKINS] Archiving disabled
[JENKINS] Archiving disabled
[JENKINS] Archiving disabled
[JENKINS] Archiving disabled
[JENKINS] Archiving disabled
[JENKINS] Archiving disabled
[JENKINS] Archiving disabled
[JENKINS] Archiving disabled
[JENKINS] Archiving disabled
[JENKINS] Archiving disabled
[JENKINS] Archiving disabled
[JENKINS] Archiving disabled
[JENKINS] Archiving disabled
[JENKINS] Archiving disabled
[JENKINS] Archiving disabled
[JENKINS] Archiving disabled
[JENKINS] Archiving disabled
[JENKINS] Archiving disabled
[JENKINS] Archiving disabled
[JENKINS] Archiving disabled
[JENKINS] Archiving disabled
[JENKINS] Archiving disabled
[JENKINS] Archiving disabled
[JENKINS] Archiving disabled
[JENKINS] Archiving disabled
[JENKINS] Archiving disabled
[JENKINS] Archiving disabled
[JENKINS] Archiving disabled
[JENKINS] Archiving disabled
[JENKINS] Archiving disabled
[JENKINS] Archiving disabled
[JENKINS] Archiving disabled
[JENKINS] Archiving disabled
[INFO] ------------------------------------------------------------------------
[INFO] Reactor Summary:
[INFO] 
[INFO] Apache Qpid Broker-J Parent ........................ SUCCESS [ 13.205 s]
[INFO] Apache Qpid Broker-J Code Generation ............... SUCCESS [ 10.931 s]
[INFO] Apache Qpid Broker-J Test Utilities ................ SUCCESS [  7.653 s]
[INFO] Apache Qpid Broker-J Core .......................... SUCCESS [ 49.817 s]
[INFO] Apache Qpid Broker-J LogBack Logging Plug-in ....... SUCCESS [ 10.887 s]
[INFO] Apache Qpid Broker-J Access Control Plug-in ........ SUCCESS [  8.825 s]
[INFO] Apache Qpid Broker-J AMQP 0-10 Protocol Plug-in .... SUCCESS [ 13.838 s]
[INFO] Apache Qpid Broker-J AMQP 0-8 Protocol Plug-in ..... SUCCESS [ 12.394 s]
[INFO] Apache Qpid Broker-J AMQP 1-0 Protocol Plug-in ..... SUCCESS [ 15.618 s]
[INFO] Apache Qpid Broker-J AMQP 0-8 to 0-10 Message Conversion Plug-in SUCCESS [  6.617 s]
[INFO] Apache Qpid Broker-J AMQP 0-8 to 1-0 Message Conversion Plug-in SUCCESS [  6.780 s]
[INFO] Apache Qpid Broker-J AMQP 0-10 to 1-0 Message Conversion Plug-in SUCCESS [  6.517 s]
[INFO] Apache Qpid Broker-J JDBC Message Store Plug-in .... SUCCESS [  9.581 s]
[INFO] Apache Qpid Broker-J Derby Message Store Plug-in ... SUCCESS [  9.059 s]
[INFO] Apache Qpid Broker-J JDBC Message Store Connection Pooling Plug-in SUCCESS [  6.590
s]
[INFO] Apache Qpid AMQP 1.0 JDBC Link Store Plug-in ....... SUCCESS [  6.431 s]
[INFO] Apache Qpid Broker-J HTTP Management Plug-in ....... SUCCESS [ 13.037 s]
[INFO] Apache Qpid Broker-J AMQP Management Protocol Plug-in SUCCESS [  6.635 s]
[INFO] Apache Qpid Broker-J Memory Message Store Plug-in .. SUCCESS [  7.475 s]
[INFO] Apache Qpid Broker-J WebSocket Plug-in ............. SUCCESS [  7.664 s]
[INFO] Apache Qpid Broker-J BDB Message Store Plug-in ..... SUCCESS [ 13.381 s]
[INFO] Apache Qpid AMQP 1.0 BDB Link Store Plug-in ........ SUCCESS [  6.928 s]
[INFO] Apache Qpid Broker-J ............................... SUCCESS [  7.628 s]
[INFO] Apache Qpid Broker-J Bundles ....................... FAILURE [  3.028 s]
[INFO] Apache Qpid Broker-J Tools ......................... SUCCESS [  6.557 s]
[INFO] Apache Qpid Broker-J System Test Parent ............ SUCCESS [  8.069 s]
[INFO] Apache Qpid Broker-J System Test Utils ............. SUCCESS [  6.193 s]
[INFO] Apache Qpid Broker-J JMS System Tests Core ......... SUCCESS [  6.633 s]
[INFO] Apache Qpid Broker-J System Tests .................. SUCCESS [ 13.152 s]
[INFO] Apache Qpid Broker-J JMS 1.1 System Tests .......... SUCCESS [  8.488 s]
[INFO] Apache Qpid Broker-J JMS 2.0 System Tests .......... SUCCESS [  7.023 s]
[INFO] Apache Qpid Broker-J HTTP system tests ............. SUCCESS [  7.958 s]
[INFO] Apache Qpid Broker-J Protocol Tests Core ........... SUCCESS [  6.466 s]
[INFO] Apache Qpid Protocol Tests for AMQP 0-8,0-9,0-9-1 .. SUCCESS [  7.389 s]
[INFO] Apache Qpid Protocol Tests for AMQP 0-10 ........... SUCCESS [  7.372 s]
[INFO] Apache Qpid Protocol Tests for AMQP 1.0 ............ SUCCESS [  9.369 s]
[INFO] Apache Qpid Broker-J End to End Conversion Tests ... SUCCESS [ 10.878 s]
[INFO] Apache Qpid Broker-J Performance Tests ............. SUCCESS [ 11.734 s]
[INFO] Apache Qpid Broker-J Performance Test System Tests . SUCCESS [  7.972 s]
[INFO] Apache Qpid Broker-J Performance Tests Visualisation JFC SUCCESS [  9.696 s]
[INFO] Apache Qpid Broker-J BDB Store System Tests ........ SUCCESS [  7.852 s]
[INFO] Apache Qpid Joram JMS Tests ........................ SUCCESS [  6.697 s]
[INFO] Apache Qpid Broker-J JMS TCK Configuration ......... SUCCESS [  5.969 s]
[INFO] Apache Qpid Broker-J Docbook ....................... SUCCESS [  3.072 s]
[INFO] Apache Qpid Broker-J Docbook ....................... SUCCESS [  4.995 s]
[INFO] Apache Qpid Broker-J Performance Test Docbook ...... SUCCESS [  4.465 s]
[INFO] ------------------------------------------------------------------------
[INFO] BUILD FAILURE
[INFO] ------------------------------------------------------------------------
[INFO] Total time: 09:11 min
[INFO] Finished at: 2018-03-19T12:53:02+00:00
[INFO] Final Memory: 212M/1660M
[INFO] ------------------------------------------------------------------------
[ERROR] Failed to execute goal org.apache.maven.plugins:maven-antrun-plugin:1.8:run (dependency-change-verification)
on project apache-qpid-broker-j: An Ant BuildException has occured: Generated dependency info
does not match the reference. Ensure LICENCE and NOTICE files are correct and then update
the reference by running again with -Dupdate-dependency-reference. Generated file: '<https://builds.apache.org/job/Qpid-Broker-J-Checks/ws/apache-qpid-broker-j/target/dependency-change-verification/PROCESSED_DEPENDENCIES_INFO'.>
Reference file: '<https://builds.apache.org/job/Qpid-Broker-J-Checks/ws/apache-qpid-broker-j/src/main/assembly/dependency-verification/DEPENDENCIES_REFERENCE'.>
[ERROR] around Ant part ...<fail message="Generated dependency info does not match the
reference. Ensure LICENCE and NOTICE files are correct and then update the reference by running
again with -Dupdate-dependency-reference. Generated file: &apos;${dependency-verification-output-file}&apos;.
Reference file: &apos;<https://builds.apache.org/job/Qpid-Broker-J-Checks/ws/apache-qpid-broker-j/src/main/assembly/dependency-verification/DEPENDENCIES_REFERENCE&apos;.">...>
@ 48:444 in <https://builds.apache.org/job/Qpid-Broker-J-Checks/ws/apache-qpid-broker-j/target/antrun/build-main.xml>
[ERROR] -> [Help 1]
org.apache.maven.lifecycle.LifecycleExecutionException: Failed to execute goal org.apache.maven.plugins:maven-antrun-plugin:1.8:run
(dependency-change-verification) on project apache-qpid-broker-j: An Ant BuildException has
occured: Generated dependency info does not match the reference. Ensure LICENCE and NOTICE
files are correct and then update the reference by running again with -Dupdate-dependency-reference.
Generated file: '<https://builds.apache.org/job/Qpid-Broker-J-Checks/ws/apache-qpid-broker-j/target/dependency-change-verification/PROCESSED_DEPENDENCIES_INFO'.>
Reference file: '<https://builds.apache.org/job/Qpid-Broker-J-Checks/ws/apache-qpid-broker-j/src/main/assembly/dependency-verification/DEPENDENCIES_REFERENCE'.>
around Ant part ...<fail message="Generated dependency info does not match the reference.
Ensure LICENCE and NOTICE files are correct and then update the reference by running again
with -Dupdate-dependency-reference. Generated file: &apos;${dependency-verification-output-file}&apos;.
Reference file: &apos;<https://builds.apache.org/job/Qpid-Broker-J-Checks/ws/apache-qpid-broker-j/src/main/assembly/dependency-verification/DEPENDENCIES_REFERENCE&apos;.">...>
@ 48:444 in <https://builds.apache.org/job/Qpid-Broker-J-Checks/ws/apache-qpid-broker-j/target/antrun/build-main.xml>
	at org.apache.maven.lifecycle.internal.MojoExecutor.execute(MojoExecutor.java:212)
	at org.apache.maven.lifecycle.internal.MojoExecutor.execute(MojoExecutor.java:153)
	at org.apache.maven.lifecycle.internal.MojoExecutor.execute(MojoExecutor.java:145)
	at org.apache.maven.lifecycle.internal.LifecycleModuleBuilder.buildProject(LifecycleModuleBuilder.java:116)
	at org.apache.maven.lifecycle.internal.LifecycleModuleBuilder.buildProject(LifecycleModuleBuilder.java:80)
	at org.apache.maven.lifecycle.internal.builder.singlethreaded.SingleThreadedBuilder.build(SingleThreadedBuilder.java:51)
	at org.apache.maven.lifecycle.internal.LifecycleStarter.execute(LifecycleStarter.java:128)
	at org.apache.maven.DefaultMaven.doExecute(DefaultMaven.java:307)
	at org.apache.maven.DefaultMaven.doExecute(DefaultMaven.java:193)
	at org.apache.maven.DefaultMaven.execute(DefaultMaven.java:106)
	at org.jvnet.hudson.maven3.launcher.Maven33Launcher.main(Maven33Launcher.java:129)
	at sun.reflect.NativeMethodAccessorImpl.invoke0(Native Method)
	at sun.reflect.NativeMethodAccessorImpl.invoke(NativeMethodAccessorImpl.java:62)
	at sun.reflect.DelegatingMethodAccessorImpl.invoke(DelegatingMethodAccessorImpl.java:43)
	at java.lang.reflect.Method.invoke(Method.java:498)
	at org.codehaus.plexus.classworlds.launcher.Launcher.launchStandard(Launcher.java:330)
	at org.codehaus.plexus.classworlds.launcher.Launcher.launch(Launcher.java:238)
	at jenkins.maven3.agent.Maven33Main.launch(Maven33Main.java:176)
	at sun.reflect.NativeMethodAccessorImpl.invoke0(Native Method)
	at sun.reflect.NativeMethodAccessorImpl.invoke(NativeMethodAccessorImpl.java:62)
	at sun.reflect.DelegatingMethodAccessorImpl.invoke(DelegatingMethodAccessorImpl.java:43)
	at java.lang.reflect.Method.invoke(Method.java:498)
	at hudson.maven.Maven3Builder.call(Maven3Builder.java:139)
	at hudson.maven.Maven3Builder.call(Maven3Builder.java:70)
	at hudson.remoting.UserRequest.perform(UserRequest.java:207)
	at hudson.remoting.UserRequest.perform(UserRequest.java:53)
	at hudson.remoting.Request$2.run(Request.java:358)
	at hudson.remoting.InterceptingExecutorService$1.call(InterceptingExecutorService.java:72)
	at java.util.concurrent.FutureTask.run(FutureTask.java:266)
	at java.util.concurrent.ThreadPoolExecutor.runWorker(ThreadPoolExecutor.java:1149)
	at java.util.concurrent.ThreadPoolExecutor$Worker.run(ThreadPoolExecutor.java:624)
	at java.lang.Thread.run(Thread.java:748)
Caused by: org.apache.maven.plugin.MojoExecutionException: An Ant BuildException has occured:
Generated dependency info does not match the reference. Ensure LICENCE and NOTICE files are
correct and then update the reference by running again with -Dupdate-dependency-reference.
Generated file: '<https://builds.apache.org/job/Qpid-Broker-J-Checks/ws/apache-qpid-broker-j/target/dependency-change-verification/PROCESSED_DEPENDENCIES_INFO'.>
Reference file: '<https://builds.apache.org/job/Qpid-Broker-J-Checks/ws/apache-qpid-broker-j/src/main/assembly/dependency-verification/DEPENDENCIES_REFERENCE'.>
around Ant part ...<fail message="Generated dependency info does not match the reference.
Ensure LICENCE and NOTICE files are correct and then update the reference by running again
with -Dupdate-dependency-reference. Generated file: &apos;${dependency-verification-output-file}&apos;.
Reference file: &apos;<https://builds.apache.org/job/Qpid-Broker-J-Checks/ws/apache-qpid-broker-j/src/main/assembly/dependency-verification/DEPENDENCIES_REFERENCE&apos;.">...>
@ 48:444 in <https://builds.apache.org/job/Qpid-Broker-J-Checks/ws/apache-qpid-broker-j/target/antrun/build-main.xml>
	at org.apache.maven.plugin.antrun.AntRunMojo.execute(AntRunMojo.java:342)
	at org.apache.maven.plugin.DefaultBuildPluginManager.executeMojo(DefaultBuildPluginManager.java:134)
	at org.apache.maven.lifecycle.internal.MojoExecutor.execute(MojoExecutor.java:207)
	... 31 more
Caused by: <https://builds.apache.org/job/Qpid-Broker-J-Checks/ws/apache-qpid-broker-j/target/antrun/build-main.xml>:48:
Generated dependency info does not match the reference. Ensure LICENCE and NOTICE files are
correct and then update the reference by running again with -Dupdate-dependency-reference.
Generated file: '<https://builds.apache.org/job/Qpid-Broker-J-Checks/ws/apache-qpid-broker-j/target/dependency-change-verification/PROCESSED_DEPENDENCIES_INFO'.>
Reference file: '<https://builds.apache.org/job/Qpid-Broker-J-Checks/ws/apache-qpid-broker-j/src/main/assembly/dependency-verification/DEPENDENCIES_REFERENCE'.>
	at org.apache.tools.ant.taskdefs.Exit.execute(Exit.java:164)
	at org.apache.tools.ant.UnknownElement.execute(UnknownElement.java:292)
	at sun.reflect.GeneratedMethodAccessor35.invoke(Unknown Source)
	at sun.reflect.DelegatingMethodAccessorImpl.invoke(DelegatingMethodAccessorImpl.java:43)
	at java.lang.reflect.Method.invoke(Method.java:498)
	at org.apache.tools.ant.dispatch.DispatchUtils.execute(DispatchUtils.java:106)
	at org.apache.tools.ant.Task.perform(Task.java:348)
	at org.apache.tools.ant.Target.execute(Target.java:435)
	at org.apache.tools.ant.Target.performTasks(Target.java:456)
	at org.apache.tools.ant.Project.executeSortedTargets(Project.java:1393)
	at org.apache.tools.ant.Project.executeTarget(Project.java:1364)
	at org.apache.maven.plugin.antrun.AntRunMojo.execute(AntRunMojo.java:313)
	... 33 more
[ERROR] 
[ERROR] Re-run Maven using the -X switch to enable full debug logging.
[ERROR] 
[ERROR] For more information about the errors and possible solutions, please read the following
articles:
[ERROR] [Help 1] http://cwiki.apache.org/confluence/display/MAVEN/MojoExecutionException
[ERROR] 
[ERROR] After correcting the problems, you can resume the build with the command
[ERROR]   mvn <goals> -rf :apache-qpid-broker-j
channel stopped
Archiving artifacts

Mime
View raw message