qpid-notifications mailing list archives

Site index · List index
Message view « Date » · « Thread »
Top « Date » · « Thread »
From Apache Jenkins Server <jenk...@builds.apache.org>
Subject Build failed in Jenkins: Qpid-Broker-J-Checks #851
Date Wed, 28 Mar 2018 22:01:04 GMT
See <https://builds.apache.org/job/Qpid-Broker-J-Checks/851/display/redirect?page=changes>

Changes:

[orudyy] QPID-8064: [Broker-J] Improve validation for file keystore and file

[orudyy] QPID-7925: [Broker-J] [WMC] Emit 'hide' event on hiding of load form

------------------------------------------
[...truncated 213.94 KB...]
[INFO] ------------------------------------------------------------------------
[INFO] 
[INFO] --- maven-clean-plugin:3.0.0:clean (default-clean) @ qpid-java-doc-perftests ---
[INFO] 
[INFO] --- apache-rat-plugin:0.11:check (default-cli) @ qpid-java-doc-perftests ---
[INFO] 51 implicit excludes (use -debug for more details).
[INFO] Exclude: test-profiles/test_resources/ssl/**
[INFO] Exclude: specs/**
[INFO] Exclude: **/*.md
[INFO] Exclude: DEPENDENCIES
[INFO] Exclude: .travis.yml
[INFO] 2 resources included (use -debug for more details)
[INFO] Rat check: Summary of files. Unapproved: 0 unknown: 0 generated: 0 approved: 2 licence.
[INFO] 
[INFO] --- maven-antrun-plugin:1.8:run (output-test-properties) @ qpid-java-doc-perftests
---
[INFO] Executing tasks

main:
     [echo] Qpid Test Profile Properties
     [echo] [profile] java-mms.1-0
     [echo] [profile.broker.language] java
     [echo] [profile.broker.type] internal
     [echo] [profile.broker.command] "<https://builds.apache.org/job/Qpid-Broker-J-Checks/ws/doc/java-perftests/bin/qpid-server">
-sp "@STORE_PATH" -st @STORE_TYPE -prop test.port=@PORT -prop "qpid.work_dir=@QPID_WORK"
     [echo] [profile.specific.excludes] JavaTransientExcludes Java010Excludes
     [echo] [profile.test.excludes] Excludes JavaExcludes java-mms.1-0.excludes JavaTransientExcludes
Java010Excludes
     [echo] [profile.broker.version] 1.0
     [echo] [profile.test.amqp_port_protocols] ["AMQP_0_8","AMQP_0_9","AMQP_0_9_1","AMQP_0_10"]
     [echo] [profile.broker.persistent] false
     [echo] [profile.virtualhostnode.type] Memory
     [echo] [profile.virtualhostnode.context.blueprint] ${profile.virtualhostnode.context.blueprint}
     [echo] [profile.test_receive_timeout] 1000
[INFO] Executed tasks
[INFO] 
[INFO] --- maven-enforcer-plugin:1.4.1:enforce (enforce-minimum-versions) @ qpid-java-doc-perftests
---
[INFO] Skipping Rule Enforcement.
[INFO] 
[INFO] --- maven-enforcer-plugin:1.4.1:enforce (enforce-versions-standard-properties) @ qpid-java-doc-perftests
---
[INFO] Skipping Rule Enforcement.
[INFO] 
[INFO] --- maven-enforcer-plugin:1.4.1:enforce (enforce-enableAmqp0x) @ qpid-java-doc-perftests
---
[INFO] Skipping Rule Enforcement.
[INFO] 
[INFO] --- jacoco-maven-plugin:0.7.5.201505241946:prepare-agent (default-prepare-agent) @
qpid-java-doc-perftests ---
[INFO] argLine set to -javaagent:/home/jenkins/jenkins-slave/maven-repositories/1/org/jacoco/org.jacoco.agent/0.7.5.201505241946/org.jacoco.agent-0.7.5.201505241946-runtime.jar=destfile=<https://builds.apache.org/job/Qpid-Broker-J-Checks/ws/doc/java-perftests/target/jacoco.exec>
-Xmx512m
[INFO] 
[INFO] --- maven-resources-plugin:2.7:copy-resources (filter-docbook-sources) @ qpid-java-doc-perftests
---
[INFO] Using 'UTF-8' encoding to copy filtered resources.
[INFO] Copying 1 resource
[INFO] 
[INFO] --- maven-remote-resources-plugin:1.5:process (process-resource-bundles) @ qpid-java-doc-perftests
---
[INFO] 
[INFO] --- maven-resources-plugin:2.7:resources (default-resources) @ qpid-java-doc-perftests
---
[INFO] Using 'UTF-8' encoding to copy filtered resources.
[INFO] Copying 1 resource
[INFO] 
[INFO] --- maven-compiler-plugin:3.5.1:compile (default-compile) @ qpid-java-doc-perftests
---
[INFO] No sources to compile
[INFO] 
[INFO] --- maven-resources-plugin:2.7:testResources (default-testResources) @ qpid-java-doc-perftests
---
[INFO] Using 'UTF-8' encoding to copy filtered resources.
[INFO] Copying 1 resource
[INFO] 
[INFO] --- maven-compiler-plugin:3.5.1:testCompile (default-testCompile) @ qpid-java-doc-perftests
---
[INFO] No sources to compile
[INFO] 
[INFO] --- maven-surefire-plugin:2.19.1:test (default-test) @ qpid-java-doc-perftests ---
[INFO] Tests are skipped.
[INFO] 
[INFO] --- license-maven-plugin:1.6:add-third-party (check-third-party-licensing) @ qpid-java-doc-perftests
---
[INFO] Included licenses (whitelist): [Apache Software License, Version 2.0, The MIT License,
BSD License, Eclipse Public License - Version 1.0, Common Public License Version 1.0, Academic
Free License v2.1, COMMON DEVELOPMENT AND DISTRIBUTION LICENSE (CDDL) Version 1.0, Public
Domain]
[INFO] Writing third-party file to <https://builds.apache.org/job/Qpid-Broker-J-Checks/ws/doc/java-perftests/target/license-maven-plugin/THIRD-PARTY.txt>
[INFO] 
[INFO] --- maven-antrun-plugin:1.8:run (dependency-change-verification) @ qpid-java-doc-perftests
---
[INFO] Executing tasks

main:
[INFO] Executed tasks
[INFO] 
[INFO] --- maven-jar-plugin:3.0.0:jar (default-jar) @ qpid-java-doc-perftests ---
[WARNING] JAR will be empty - no content was marked for inclusion!
[INFO] Building jar: <https://builds.apache.org/job/Qpid-Broker-J-Checks/ws/doc/java-perftests/target/qpid-java-doc-perftests-7.1.0-SNAPSHOT.jar>
[INFO] 
[INFO] --- maven-site-plugin:3.5.1:attach-descriptor (attach-descriptor) @ qpid-java-doc-perftests
---
[INFO] 
[INFO] --- maven-assembly-plugin:2.6:single (default) @ qpid-java-doc-perftests ---
[INFO] Assemblies have been skipped per configuration of the skipAssembly parameter.
[INFO] 
[INFO] --- maven-assembly-plugin:2.6:single (source-release-assembly) @ qpid-java-doc-perftests
---
[INFO] Assemblies have been skipped per configuration of the skipAssembly parameter.
[INFO] 
[INFO] --- maven-source-plugin:3.0.0:jar-no-fork (attach-sources) @ qpid-java-doc-perftests
---
[INFO] Building jar: <https://builds.apache.org/job/Qpid-Broker-J-Checks/ws/doc/java-perftests/target/qpid-java-doc-perftests-7.1.0-SNAPSHOT-sources.jar>
[INFO] 
[INFO] --- maven-javadoc-plugin:2.10.3:jar (attach-javadocs) @ qpid-java-doc-perftests ---
[INFO] 
[INFO] --- maven-gpg-plugin:1.6:sign (sign-release-artifacts) @ qpid-java-doc-perftests ---
[JENKINS] Archiving disabled
[JENKINS] Archiving disabled
[JENKINS] Archiving disabled
[JENKINS] Archiving disabled
[JENKINS] Archiving disabled
[JENKINS] Archiving disabled
[JENKINS] Archiving disabled
[JENKINS] Archiving disabled
[JENKINS] Archiving disabled
[JENKINS] Archiving disabled
[JENKINS] Archiving disabled
[JENKINS] Archiving disabled
[JENKINS] Archiving disabled
[JENKINS] Archiving disabled
[JENKINS] Archiving disabled
[JENKINS] Archiving disabled
[JENKINS] Archiving disabled
[JENKINS] Archiving disabled
[JENKINS] Archiving disabled
[JENKINS] Archiving disabled
[JENKINS] Archiving disabled
[JENKINS] Archiving disabled
[JENKINS] Archiving disabled
[JENKINS] Archiving disabled
[JENKINS] Archiving disabled
[JENKINS] Archiving disabled
[JENKINS] Archiving disabled
[JENKINS] Archiving disabled
[JENKINS] Archiving disabled
[JENKINS] Archiving disabled
[JENKINS] Archiving disabled
[JENKINS] Archiving disabled
[JENKINS] Archiving disabled
[JENKINS] Archiving disabled
[JENKINS] Archiving disabled
[JENKINS] Archiving disabled
[JENKINS] Archiving disabled
[JENKINS] Archiving disabled
[JENKINS] Archiving disabled
[JENKINS] Archiving disabled
[JENKINS] Archiving disabled
[JENKINS] Archiving disabled
[JENKINS] Archiving disabled
[JENKINS] Archiving disabled
[JENKINS] Archiving disabled
[JENKINS] Archiving disabled
[JENKINS] Archiving disabled
[INFO] ------------------------------------------------------------------------
[INFO] Reactor Summary:
[INFO] 
[INFO] Apache Qpid Broker-J Parent ........................ SUCCESS [ 12.561 s]
[INFO] Apache Qpid Broker-J Code Generation ............... SUCCESS [ 12.410 s]
[INFO] Apache Qpid Broker-J Test Utilities ................ SUCCESS [  7.593 s]
[INFO] Apache Qpid Broker-J Core .......................... FAILURE [  3.535 s]
[INFO] Apache Qpid Broker-J LogBack Logging Plug-in ....... SKIPPED
[INFO] Apache Qpid Broker-J Access Control Plug-in ........ SKIPPED
[INFO] Apache Qpid Broker-J AMQP 0-10 Protocol Plug-in .... SKIPPED
[INFO] Apache Qpid Broker-J AMQP 0-8 Protocol Plug-in ..... SKIPPED
[INFO] Apache Qpid Broker-J AMQP 1-0 Protocol Plug-in ..... SKIPPED
[INFO] Apache Qpid Broker-J AMQP 0-8 to 0-10 Message Conversion Plug-in SKIPPED
[INFO] Apache Qpid Broker-J AMQP 0-8 to 1-0 Message Conversion Plug-in SKIPPED
[INFO] Apache Qpid Broker-J AMQP 0-10 to 1-0 Message Conversion Plug-in SKIPPED
[INFO] Apache Qpid Broker-J JDBC Message Store Plug-in .... SKIPPED
[INFO] Apache Qpid Broker-J Derby Message Store Plug-in ... SKIPPED
[INFO] Apache Qpid Broker-J JDBC Message Store Connection Pooling Plug-in SKIPPED
[INFO] Apache Qpid AMQP 1.0 JDBC Link Store Plug-in ....... SKIPPED
[INFO] Apache Qpid Broker-J HTTP Management Plug-in ....... SKIPPED
[INFO] Apache Qpid Broker-J AMQP Management Protocol Plug-in SKIPPED
[INFO] Apache Qpid Broker-J Memory Message Store Plug-in .. SKIPPED
[INFO] Apache Qpid Broker-J WebSocket Plug-in ............. SKIPPED
[INFO] Apache Qpid Broker-J BDB Message Store Plug-in ..... SKIPPED
[INFO] Apache Qpid AMQP 1.0 BDB Link Store Plug-in ........ SKIPPED
[INFO] Apache Qpid Broker-J ............................... SKIPPED
[INFO] Apache Qpid Broker-J Bundles ....................... SKIPPED
[INFO] Apache Qpid Broker-J Tools ......................... SUCCESS [  7.423 s]
[INFO] Apache Qpid Broker-J System Test Parent ............ SUCCESS [ 10.451 s]
[INFO] Apache Qpid Broker-J System Test Utils ............. SKIPPED
[INFO] Apache Qpid Broker-J JMS System Tests Core ......... SKIPPED
[INFO] Apache Qpid Broker-J System Tests .................. SKIPPED
[INFO] Apache Qpid Broker-J JMS 1.1 System Tests .......... SKIPPED
[INFO] Apache Qpid Broker-J JMS 2.0 System Tests .......... SKIPPED
[INFO] Apache Qpid Broker-J HTTP system tests ............. SKIPPED
[INFO] Apache Qpid Broker-J Protocol Tests Core ........... SUCCESS [ 10.124 s]
[INFO] Apache Qpid Protocol Tests for AMQP 0-8,0-9,0-9-1 .. SKIPPED
[INFO] Apache Qpid Protocol Tests for AMQP 0-10 ........... SKIPPED
[INFO] Apache Qpid Protocol Tests for AMQP 1.0 ............ SKIPPED
[INFO] Apache Qpid Broker-J End to End Conversion Tests ... SKIPPED
[INFO] Apache Qpid Broker-J Performance Tests ............. SUCCESS [ 12.048 s]
[INFO] Apache Qpid Broker-J Performance Test System Tests . SKIPPED
[INFO] Apache Qpid Broker-J Performance Tests Visualisation JFC SKIPPED
[INFO] Apache Qpid Broker-J BDB Store System Tests ........ SKIPPED
[INFO] Apache Qpid Joram JMS Tests ........................ SUCCESS [  7.602 s]
[INFO] Apache Qpid Broker-J JMS TCK Configuration ......... SUCCESS [  6.991 s]
[INFO] Apache Qpid Broker-J Docbook ....................... SUCCESS [  3.933 s]
[INFO] Apache Qpid Broker-J Docbook ....................... SUCCESS [  6.172 s]
[INFO] Apache Qpid Broker-J Performance Test Docbook ...... SUCCESS [  5.555 s]
[INFO] ------------------------------------------------------------------------
[INFO] BUILD FAILURE
[INFO] ------------------------------------------------------------------------
[INFO] Total time: 02:51 min
[INFO] Finished at: 2018-03-28T22:00:37+00:00
[INFO] Final Memory: 78M/1272M
[INFO] ------------------------------------------------------------------------
[ERROR] Failed to execute goal org.apache.rat:apache-rat-plugin:0.11:check (default-cli) on
project qpid-broker-core: Too many files with unapproved license: 1 See RAT report in: <https://builds.apache.org/job/Qpid-Broker-J-Checks/ws/broker-core/target/rat.txt>
-> [Help 1]
org.apache.maven.lifecycle.LifecycleExecutionException: Failed to execute goal org.apache.rat:apache-rat-plugin:0.11:check
(default-cli) on project qpid-broker-core: Too many files with unapproved license: 1 See RAT
report in: <https://builds.apache.org/job/Qpid-Broker-J-Checks/ws/broker-core/target/rat.txt>
	at org.apache.maven.lifecycle.internal.MojoExecutor.execute(MojoExecutor.java:212)
	at org.apache.maven.lifecycle.internal.MojoExecutor.execute(MojoExecutor.java:153)
	at org.apache.maven.lifecycle.internal.MojoExecutor.execute(MojoExecutor.java:145)
	at org.apache.maven.lifecycle.internal.LifecycleModuleBuilder.buildProject(LifecycleModuleBuilder.java:116)
	at org.apache.maven.lifecycle.internal.LifecycleModuleBuilder.buildProject(LifecycleModuleBuilder.java:80)
	at org.apache.maven.lifecycle.internal.builder.singlethreaded.SingleThreadedBuilder.build(SingleThreadedBuilder.java:51)
	at org.apache.maven.lifecycle.internal.LifecycleStarter.execute(LifecycleStarter.java:128)
	at org.apache.maven.DefaultMaven.doExecute(DefaultMaven.java:307)
	at org.apache.maven.DefaultMaven.doExecute(DefaultMaven.java:193)
	at org.apache.maven.DefaultMaven.execute(DefaultMaven.java:106)
	at org.jvnet.hudson.maven3.launcher.Maven33Launcher.main(Maven33Launcher.java:129)
	at sun.reflect.NativeMethodAccessorImpl.invoke0(Native Method)
	at sun.reflect.NativeMethodAccessorImpl.invoke(NativeMethodAccessorImpl.java:62)
	at sun.reflect.DelegatingMethodAccessorImpl.invoke(DelegatingMethodAccessorImpl.java:43)
	at java.lang.reflect.Method.invoke(Method.java:498)
	at org.codehaus.plexus.classworlds.launcher.Launcher.launchStandard(Launcher.java:330)
	at org.codehaus.plexus.classworlds.launcher.Launcher.launch(Launcher.java:238)
	at jenkins.maven3.agent.Maven33Main.launch(Maven33Main.java:176)
	at sun.reflect.NativeMethodAccessorImpl.invoke0(Native Method)
	at sun.reflect.NativeMethodAccessorImpl.invoke(NativeMethodAccessorImpl.java:62)
	at sun.reflect.DelegatingMethodAccessorImpl.invoke(DelegatingMethodAccessorImpl.java:43)
	at java.lang.reflect.Method.invoke(Method.java:498)
	at hudson.maven.Maven3Builder.call(Maven3Builder.java:139)
	at hudson.maven.Maven3Builder.call(Maven3Builder.java:70)
	at hudson.remoting.UserRequest.perform(UserRequest.java:207)
	at hudson.remoting.UserRequest.perform(UserRequest.java:53)
	at hudson.remoting.Request$2.run(Request.java:358)
	at hudson.remoting.InterceptingExecutorService$1.call(InterceptingExecutorService.java:72)
	at java.util.concurrent.FutureTask.run(FutureTask.java:266)
	at java.util.concurrent.ThreadPoolExecutor.runWorker(ThreadPoolExecutor.java:1149)
	at java.util.concurrent.ThreadPoolExecutor$Worker.run(ThreadPoolExecutor.java:624)
	at java.lang.Thread.run(Thread.java:748)
Caused by: org.apache.rat.mp.RatCheckException: Too many files with unapproved license: 1
See RAT report in: <https://builds.apache.org/job/Qpid-Broker-J-Checks/ws/broker-core/target/rat.txt>
	at org.apache.rat.mp.RatCheckMojo.check(RatCheckMojo.java:194)
	at org.apache.rat.mp.RatCheckMojo.execute(RatCheckMojo.java:182)
	at org.apache.maven.plugin.DefaultBuildPluginManager.executeMojo(DefaultBuildPluginManager.java:134)
	at org.apache.maven.lifecycle.internal.MojoExecutor.execute(MojoExecutor.java:207)
	... 31 more
[ERROR] 
[ERROR] Re-run Maven using the -X switch to enable full debug logging.
[ERROR] 
[ERROR] For more information about the errors and possible solutions, please read the following
articles:
[ERROR] [Help 1] http://cwiki.apache.org/confluence/display/MAVEN/MojoFailureException
[ERROR] 
[ERROR] After correcting the problems, you can resume the build with the command
[ERROR]   mvn <goals> -rf :qpid-broker-core
channel stopped
Archiving artifacts

Mime
View raw message