qpid-notifications mailing list archives

Site index · List index
Message view « Date » · « Thread »
Top « Date » · « Thread »
From Apache Jenkins Server <jenk...@builds.apache.org>
Subject Build failed in Jenkins: Qpid-Broker-J-TestMatrix » ubuntu,JDK 1.8 (latest),java-dby.0-9-1 #4131
Date Sat, 17 Feb 2018 09:22:24 GMT
See <https://builds.apache.org/job/Qpid-Broker-J-TestMatrix/Ubuntu%20Slaves=ubuntu,jdk=JDK%201.8%20(latest),profile=java-dby.0-9-1/4131/display/redirect?page=changes>

Changes:

[kwall] QPID-8038: [Broker-J] Refactor FileKeyStoreTest as SNITest

[kwall] QPID-8083 [System Tests] [REST/HTTP] Refactor

[kwall] QPID-8083 [System Tests] [REST/HTTP] Remove some repetitious tests

[kwall] QPID-8083 [System Tests] [REST/HTTP] Remove keystores/trusts stores left

[kwall] QPID-8098: [Broker-J] [AMQP 0-10] No longer unconditionally increment

[kwall] QPID-8038: [Broker-J] [AMQP 0-10] Add a protocol test supporting

[kwall] QPID-8099: [Broker-J] Make MessageInfo and LogRecord implement

[kwall] QPID-8098: [Broker-J] Add supporting test case relating to browsing and

[kwall] QPID-8100: [Broker-J] [AMQP 0-10] Ensure that in error cases,

[kwall]  QPID-8083 [System Tests] [REST/HTTP] Fix test failure that would occur

[kwall] QPID-8083: [System Tests] [REST/HTTP] Fix defect in test defect fix

------------------------------------------
[...truncated 479.45 KB...]
[INFO] Executing tasks

main:
     [echo] Qpid Test Profile Properties
     [echo] [profile] java-dby.0-9-1
     [echo] [profile.broker.language] java
     [echo] [profile.broker.type] internal
     [echo] [profile.broker.command] "<https://builds.apache.org/job/Qpid-Broker-J-TestMatrix/Ubuntu%20Slaves=ubuntu,jdk=JDK%201.8%20(latest),profile=java-dby.0-9-1/ws/doc/bin/qpid-server">
-sp "@STORE_PATH" -st @STORE_TYPE -prop test.port=@PORT -prop "qpid.work_dir=@QPID_WORK"
     [echo] [profile.specific.excludes] JavaPersistentExcludes JavaDerbyExcludes XAExcludes
JavaPre010Excludes
     [echo] [profile.test.excludes] Excludes JavaExcludes java-dby.0-9-1.excludes JavaPersistentExcludes
JavaDerbyExcludes XAExcludes JavaPre010Excludes
     [echo] [profile.broker.version] 0-9-1
     [echo] [profile.test.amqp_port_protocols] ["AMQP_0_8","AMQP_0_9","AMQP_0_9_1"]
     [echo] [profile.broker.persistent] true
     [echo] [profile.virtualhostnode.type] DERBY
     [echo] [profile.virtualhostnode.context.blueprint] {"type":"ProvidedStore","globalAddressDomains":"${qpid.globalAddressDomains}"}
     [echo] [profile.test_receive_timeout] 3000
[INFO] Executed tasks
[INFO] 
[INFO] --- maven-enforcer-plugin:1.4.1:enforce (enforce-minimum-versions) @ qpid-java-doc
---
[INFO] 
[INFO] --- maven-enforcer-plugin:1.4.1:enforce (enforce-versions-standard-properties) @ qpid-java-doc
---
[INFO] 
[INFO] --- maven-enforcer-plugin:1.4.1:enforce (enforce-enableAmqp0x) @ qpid-java-doc ---
[INFO] 
[INFO] --- jacoco-maven-plugin:0.7.5.201505241946:prepare-agent (default-prepare-agent) @
qpid-java-doc ---
[INFO] argLine set to "-javaagent:/home/jenkins/.m2/repository/org/jacoco/org.jacoco.agent/0.7.5.201505241946/org.jacoco.agent-0.7.5.201505241946-runtime.jar=destfile=<https://builds.apache.org/job/Qpid-Broker-J-TestMatrix/Ubuntu%20Slaves=ubuntu,jdk=JDK%201.8%20(latest),profile=java-dby.0-9-1/ws/doc/target/jacoco.exec">
-Xmx512m
[INFO] 
[INFO] --- maven-remote-resources-plugin:1.5:process (process-resource-bundles) @ qpid-java-doc
---
[INFO] 
[INFO] --- maven-site-plugin:3.5.1:attach-descriptor (attach-descriptor) @ qpid-java-doc ---
[INFO] 
[INFO] --- maven-assembly-plugin:2.6:single (default) @ qpid-java-doc ---
[INFO] Assemblies have been skipped per configuration of the skipAssembly parameter.
[INFO] 
[INFO] ------------------------------------------------------------------------
[INFO] Building Apache Qpid Broker-J Docbook 7.1.0-SNAPSHOT
[INFO] ------------------------------------------------------------------------
[INFO] 
[INFO] --- maven-clean-plugin:3.0.0:clean (default-clean) @ qpid-java-doc-broker ---
[INFO] 
[INFO] --- maven-antrun-plugin:1.8:run (output-test-properties) @ qpid-java-doc-broker ---
[INFO] Executing tasks

main:
     [echo] Qpid Test Profile Properties
     [echo] [profile] java-dby.0-9-1
     [echo] [profile.broker.language] java
     [echo] [profile.broker.type] internal
     [echo] [profile.broker.command] "<https://builds.apache.org/job/Qpid-Broker-J-TestMatrix/Ubuntu%20Slaves=ubuntu,jdk=JDK%201.8%20(latest),profile=java-dby.0-9-1/ws/doc/java-broker/bin/qpid-server">
-sp "@STORE_PATH" -st @STORE_TYPE -prop test.port=@PORT -prop "qpid.work_dir=@QPID_WORK"
     [echo] [profile.specific.excludes] JavaPersistentExcludes JavaDerbyExcludes XAExcludes
JavaPre010Excludes
     [echo] [profile.test.excludes] Excludes JavaExcludes java-dby.0-9-1.excludes JavaPersistentExcludes
JavaDerbyExcludes XAExcludes JavaPre010Excludes
     [echo] [profile.broker.version] 0-9-1
     [echo] [profile.test.amqp_port_protocols] ["AMQP_0_8","AMQP_0_9","AMQP_0_9_1"]
     [echo] [profile.broker.persistent] true
     [echo] [profile.virtualhostnode.type] DERBY
     [echo] [profile.virtualhostnode.context.blueprint] {"type":"ProvidedStore","globalAddressDomains":"${qpid.globalAddressDomains}"}
     [echo] [profile.test_receive_timeout] 3000
[INFO] Executed tasks
[INFO] 
[INFO] --- maven-enforcer-plugin:1.4.1:enforce (enforce-minimum-versions) @ qpid-java-doc-broker
---
[INFO] 
[INFO] --- maven-enforcer-plugin:1.4.1:enforce (enforce-versions-standard-properties) @ qpid-java-doc-broker
---
[INFO] 
[INFO] --- maven-enforcer-plugin:1.4.1:enforce (enforce-enableAmqp0x) @ qpid-java-doc-broker
---
[INFO] 
[INFO] --- jacoco-maven-plugin:0.7.5.201505241946:prepare-agent (default-prepare-agent) @
qpid-java-doc-broker ---
[INFO] argLine set to "-javaagent:/home/jenkins/.m2/repository/org/jacoco/org.jacoco.agent/0.7.5.201505241946/org.jacoco.agent-0.7.5.201505241946-runtime.jar=destfile=<https://builds.apache.org/job/Qpid-Broker-J-TestMatrix/Ubuntu%20Slaves=ubuntu,jdk=JDK%201.8%20(latest),profile=java-dby.0-9-1/ws/doc/java-broker/target/jacoco.exec">
-Xmx512m
[INFO] 
[INFO] --- maven-resources-plugin:2.7:copy-resources (filter-docbook-sources) @ qpid-java-doc-broker
---
[INFO] Using 'UTF-8' encoding to copy filtered resources.
[INFO] Copying 76 resources
[INFO] 
[INFO] --- maven-remote-resources-plugin:1.5:process (process-resource-bundles) @ qpid-java-doc-broker
---
[INFO] 
[INFO] --- maven-resources-plugin:2.7:resources (default-resources) @ qpid-java-doc-broker
---
[INFO] Using 'UTF-8' encoding to copy filtered resources.
[INFO] Copying 76 resources
[INFO] 
[INFO] --- maven-compiler-plugin:3.5.1:compile (default-compile) @ qpid-java-doc-broker ---
[INFO] No sources to compile
[INFO] 
[INFO] --- maven-resources-plugin:2.7:testResources (default-testResources) @ qpid-java-doc-broker
---
[INFO] Using 'UTF-8' encoding to copy filtered resources.
[INFO] Copying 76 resources
[INFO] 
[INFO] --- maven-compiler-plugin:3.5.1:testCompile (default-testCompile) @ qpid-java-doc-broker
---
[INFO] No sources to compile
[INFO] 
[INFO] --- maven-surefire-plugin:2.19.1:test (default-test) @ qpid-java-doc-broker ---
[INFO] Tests are skipped.
[INFO] 
[INFO] --- maven-jar-plugin:3.0.0:jar (default-jar) @ qpid-java-doc-broker ---
[WARNING] JAR will be empty - no content was marked for inclusion!
[INFO] Building jar: <https://builds.apache.org/job/Qpid-Broker-J-TestMatrix/Ubuntu%20Slaves=ubuntu,jdk=JDK%201.8%20(latest),profile=java-dby.0-9-1/ws/doc/java-broker/target/qpid-java-doc-broker-7.1.0-SNAPSHOT.jar>
[INFO] 
[INFO] --- maven-site-plugin:3.5.1:attach-descriptor (attach-descriptor) @ qpid-java-doc-broker
---
[INFO] 
[INFO] --- maven-assembly-plugin:2.6:single (default) @ qpid-java-doc-broker ---
[INFO] Assemblies have been skipped per configuration of the skipAssembly parameter.
[INFO] 
[INFO] ------------------------------------------------------------------------
[INFO] Building Apache Qpid Broker-J Performance Test Docbook 7.1.0-SNAPSHOT
[INFO] ------------------------------------------------------------------------
[INFO] 
[INFO] --- maven-clean-plugin:3.0.0:clean (default-clean) @ qpid-java-doc-perftests ---
[INFO] 
[INFO] --- maven-antrun-plugin:1.8:run (output-test-properties) @ qpid-java-doc-perftests
---
[INFO] Executing tasks

main:
     [echo] Qpid Test Profile Properties
     [echo] [profile] java-dby.0-9-1
     [echo] [profile.broker.language] java
     [echo] [profile.broker.type] internal
     [echo] [profile.broker.command] "<https://builds.apache.org/job/Qpid-Broker-J-TestMatrix/Ubuntu%20Slaves=ubuntu,jdk=JDK%201.8%20(latest),profile=java-dby.0-9-1/ws/doc/java-perftests/bin/qpid-server">
-sp "@STORE_PATH" -st @STORE_TYPE -prop test.port=@PORT -prop "qpid.work_dir=@QPID_WORK"
     [echo] [profile.specific.excludes] JavaPersistentExcludes JavaDerbyExcludes XAExcludes
JavaPre010Excludes
     [echo] [profile.test.excludes] Excludes JavaExcludes java-dby.0-9-1.excludes JavaPersistentExcludes
JavaDerbyExcludes XAExcludes JavaPre010Excludes
     [echo] [profile.broker.version] 0-9-1
     [echo] [profile.test.amqp_port_protocols] ["AMQP_0_8","AMQP_0_9","AMQP_0_9_1"]
     [echo] [profile.broker.persistent] true
     [echo] [profile.virtualhostnode.type] DERBY
     [echo] [profile.virtualhostnode.context.blueprint] {"type":"ProvidedStore","globalAddressDomains":"${qpid.globalAddressDomains}"}
     [echo] [profile.test_receive_timeout] 3000
[INFO] Executed tasks
[INFO] 
[INFO] --- maven-enforcer-plugin:1.4.1:enforce (enforce-minimum-versions) @ qpid-java-doc-perftests
---
[INFO] 
[INFO] --- maven-enforcer-plugin:1.4.1:enforce (enforce-versions-standard-properties) @ qpid-java-doc-perftests
---
[INFO] 
[INFO] --- maven-enforcer-plugin:1.4.1:enforce (enforce-enableAmqp0x) @ qpid-java-doc-perftests
---
[INFO] 
[INFO] --- jacoco-maven-plugin:0.7.5.201505241946:prepare-agent (default-prepare-agent) @
qpid-java-doc-perftests ---
[INFO] argLine set to "-javaagent:/home/jenkins/.m2/repository/org/jacoco/org.jacoco.agent/0.7.5.201505241946/org.jacoco.agent-0.7.5.201505241946-runtime.jar=destfile=<https://builds.apache.org/job/Qpid-Broker-J-TestMatrix/Ubuntu%20Slaves=ubuntu,jdk=JDK%201.8%20(latest),profile=java-dby.0-9-1/ws/doc/java-perftests/target/jacoco.exec">
-Xmx512m
[INFO] 
[INFO] --- maven-resources-plugin:2.7:copy-resources (filter-docbook-sources) @ qpid-java-doc-perftests
---
[INFO] Using 'UTF-8' encoding to copy filtered resources.
[INFO] Copying 1 resource
[INFO] 
[INFO] --- maven-remote-resources-plugin:1.5:process (process-resource-bundles) @ qpid-java-doc-perftests
---
[INFO] 
[INFO] --- maven-resources-plugin:2.7:resources (default-resources) @ qpid-java-doc-perftests
---
[INFO] Using 'UTF-8' encoding to copy filtered resources.
[INFO] Copying 1 resource
[INFO] 
[INFO] --- maven-compiler-plugin:3.5.1:compile (default-compile) @ qpid-java-doc-perftests
---
[INFO] No sources to compile
[INFO] 
[INFO] --- maven-resources-plugin:2.7:testResources (default-testResources) @ qpid-java-doc-perftests
---
[INFO] Using 'UTF-8' encoding to copy filtered resources.
[INFO] Copying 1 resource
[INFO] 
[INFO] --- maven-compiler-plugin:3.5.1:testCompile (default-testCompile) @ qpid-java-doc-perftests
---
[INFO] No sources to compile
[INFO] 
[INFO] --- maven-surefire-plugin:2.19.1:test (default-test) @ qpid-java-doc-perftests ---
[INFO] Tests are skipped.
[INFO] 
[INFO] --- maven-jar-plugin:3.0.0:jar (default-jar) @ qpid-java-doc-perftests ---
[WARNING] JAR will be empty - no content was marked for inclusion!
[INFO] Building jar: <https://builds.apache.org/job/Qpid-Broker-J-TestMatrix/Ubuntu%20Slaves=ubuntu,jdk=JDK%201.8%20(latest),profile=java-dby.0-9-1/ws/doc/java-perftests/target/qpid-java-doc-perftests-7.1.0-SNAPSHOT.jar>
[INFO] 
[INFO] --- maven-site-plugin:3.5.1:attach-descriptor (attach-descriptor) @ qpid-java-doc-perftests
---
[INFO] 
[INFO] --- maven-assembly-plugin:2.6:single (default) @ qpid-java-doc-perftests ---
[INFO] Assemblies have been skipped per configuration of the skipAssembly parameter.
[INFO] ------------------------------------------------------------------------
[INFO] Reactor Summary:
[INFO] 
[INFO] Apache Qpid Broker-J Parent ........................ SUCCESS [  3.036 s]
[INFO] Apache Qpid Broker-J Code Generation ............... SUCCESS [  2.589 s]
[INFO] Apache Qpid Broker-J Test Utilities ................ SUCCESS [  0.815 s]
[INFO] Apache Qpid Broker-J Core .......................... SUCCESS [ 17.701 s]
[INFO] Apache Qpid Broker-J LogBack Logging Plug-in ....... SUCCESS [  2.073 s]
[INFO] Apache Qpid Broker-J Access Control Plug-in ........ SUCCESS [  0.933 s]
[INFO] Apache Qpid Broker-J AMQP 0-10 Protocol Plug-in .... SUCCESS [  1.724 s]
[INFO] Apache Qpid Broker-J AMQP 0-8 Protocol Plug-in ..... SUCCESS [  1.500 s]
[INFO] Apache Qpid Broker-J AMQP 1-0 Protocol Plug-in ..... SUCCESS [  2.733 s]
[INFO] Apache Qpid Broker-J AMQP 0-8 to 0-10 Message Conversion Plug-in SUCCESS [  0.408 s]
[INFO] Apache Qpid Broker-J AMQP 0-8 to 1-0 Message Conversion Plug-in SUCCESS [  0.603 s]
[INFO] Apache Qpid Broker-J AMQP 0-10 to 1-0 Message Conversion Plug-in SUCCESS [  0.467 s]
[INFO] Apache Qpid Broker-J JDBC Message Store Plug-in .... SUCCESS [  1.146 s]
[INFO] Apache Qpid Broker-J Derby Message Store Plug-in ... SUCCESS [  0.729 s]
[INFO] Apache Qpid Broker-J JDBC Message Store Connection Pooling Plug-in SUCCESS [  0.369
s]
[INFO] Apache Qpid AMQP 1.0 JDBC Link Store Plug-in ....... SUCCESS [  0.418 s]
[INFO] Apache Qpid Broker-J HTTP Management Plug-in ....... SUCCESS [  2.190 s]
[INFO] Apache Qpid Broker-J AMQP Management Protocol Plug-in SUCCESS [  0.481 s]
[INFO] Apache Qpid Broker-J Memory Message Store Plug-in .. SUCCESS [  0.383 s]
[INFO] Apache Qpid Broker-J WebSocket Plug-in ............. SUCCESS [  0.660 s]
[INFO] Apache Qpid Broker-J BDB Message Store Plug-in ..... SUCCESS [  2.245 s]
[INFO] Apache Qpid AMQP 1.0 BDB Link Store Plug-in ........ SUCCESS [  0.367 s]
[INFO] Apache Qpid Broker-J ............................... SUCCESS [  1.084 s]
[INFO] Apache Qpid Broker-J Bundles ....................... SUCCESS [  6.636 s]
[INFO] Apache Qpid Broker-J Tools ......................... SUCCESS [  0.267 s]
[INFO] Apache Qpid Broker-J System Test Parent ............ SUCCESS [  1.679 s]
[INFO] Apache Qpid Broker-J System Test Utils ............. SUCCESS [  1.368 s]
[INFO] Apache Qpid Broker-J JMS System Tests Core ......... SUCCESS [  1.403 s]
[INFO] Apache Qpid Broker-J System Tests .................. SUCCESS [  01:36 h]
[INFO] Apache Qpid Broker-J JMS 1.1 System Tests .......... FAILURE [  01:05 h]
[INFO] Apache Qpid Broker-J JMS 2.0 System Tests .......... SUCCESS [  1.905 s]
[INFO] Apache Qpid Broker-J HTTP system tests ............. SUCCESS [16:23 min]
[INFO] Apache Qpid Broker-J Protocol Tests Core ........... SUCCESS [  1.362 s]
[INFO] Apache Qpid Protocol Tests for AMQP 0-8,0-9,0-9-1 .. SUCCESS [16:01 min]
[INFO] Apache Qpid Protocol Tests for AMQP 0-10 ........... SUCCESS [08:20 min]
[INFO] Apache Qpid Protocol Tests for AMQP 1.0 ............ SUCCESS [19:58 min]
[INFO] Apache Qpid Broker-J End to End Conversion Tests ... SUCCESS [  3.236 s]
[INFO] Apache Qpid Broker-J Performance Tests ............. SUCCESS [  1.616 s]
[INFO] Apache Qpid Broker-J Performance Test System Tests . SUCCESS [01:08 min]
[INFO] Apache Qpid Broker-J Performance Tests Visualisation JFC SUCCESS [  1.802 s]
[INFO] Apache Qpid Broker-J BDB Store System Tests ........ SUCCESS [  3.258 s]
[INFO] Apache Qpid Joram JMS Tests ........................ SUCCESS [  0.409 s]
[INFO] Apache Qpid Broker-J JMS TCK Configuration ......... SUCCESS [  0.261 s]
[INFO] Apache Qpid Broker-J Docbook ....................... SUCCESS [  0.044 s]
[INFO] Apache Qpid Broker-J Docbook ....................... SUCCESS [  0.501 s]
[INFO] Apache Qpid Broker-J Performance Test Docbook ...... SUCCESS [  0.071 s]
[INFO] ------------------------------------------------------------------------
[INFO] BUILD FAILURE
[INFO] ------------------------------------------------------------------------
[INFO] Total time: 03:45 h
[INFO] Finished at: 2018-02-17T09:20:55Z
[INFO] Final Memory: 157M/5035M
[INFO] ------------------------------------------------------------------------
[ERROR] Failed to execute goal org.apache.maven.plugins:maven-surefire-plugin:2.19.1:test
(integration-test) on project qpid-systests-jms_1.1: There are test failures.
[ERROR] 
[ERROR] Please refer to <https://builds.apache.org/job/Qpid-Broker-J-TestMatrix/Ubuntu%20Slaves=ubuntu,jdk=JDK%201.8%20(latest),profile=java-dby.0-9-1/4131/artifact/systests/qpid-systests-jms_1.1/target/surefire-reports/java-dby.0-9-1>
for the individual test results.
[ERROR] -> [Help 1]
[ERROR] 
[ERROR] To see the full stack trace of the errors, re-run Maven with the -e switch.
[ERROR] Re-run Maven using the -X switch to enable full debug logging.
[ERROR] 
[ERROR] For more information about the errors and possible solutions, please read the following
articles:
[ERROR] [Help 1] http://cwiki.apache.org/confluence/display/MAVEN/MojoFailureException
[ERROR] 
[ERROR] After correcting the problems, you can resume the build with the command
[ERROR]   mvn <goals> -rf :qpid-systests-jms_1.1
Build step 'Invoke top-level Maven targets' marked build as failure
Archiving artifacts
Performing Post build task...
Match found for : : True
Logical operation result is TRUE
Running script  : echo Finishing build
date
[java-dby.0-9-1] $ /bin/bash -xe /tmp/jenkins2006059744813003065.sh
+ echo Finishing build
Finishing build
+ date
Sat Feb 17 09:22:23 UTC 2018
POST BUILD TASK : SUCCESS
END OF POST BUILD TASK : 0
Recording test results

Mime
View raw message