qpid-notifications mailing list archives

Site index · List index
Message view « Date » · « Thread »
Top « Date » · « Thread »
From Apache Jenkins Server <jenk...@builds.apache.org>
Subject Build failed in Jenkins: Qpid-Broker-J-TestMatrix » ubuntu,JDK 1.8 (latest),java-dby.1-0 #4116
Date Tue, 06 Feb 2018 03:22:01 GMT
See <https://builds.apache.org/job/Qpid-Broker-J-TestMatrix/Ubuntu%20Slaves=ubuntu,jdk=JDK%201.8%20(latest),profile=java-dby.1-0/4116/display/redirect?page=changes>

Changes:

[kwall] QPID-8081: [Broker-J] [Logback] Defensive guard against null activeFile

[kwall] QPID-8083 [System Tests] [REST/HTTP] Add operations test

[kwall] QPID-8083 [System Tests] [REST/HTTP] Move UserPreferencesRestTest to new

[kwall] QPID-8083 [System Tests] [REST/HTTP] Add end to end message test

------------------------------------------
[...truncated 319.24 KB...]
[INFO] Copying 54 resources
[INFO] 
[INFO] ------------------------------------------------------------------------
[INFO] Building Apache Qpid Broker-J JMS 2.0 System Tests 7.1.0-SNAPSHOT
[INFO] ------------------------------------------------------------------------
[INFO] 
[INFO] --- maven-clean-plugin:3.0.0:clean (default-clean) @ qpid-systests-jms_2.0 ---
[INFO] 
[INFO] --- maven-antrun-plugin:1.8:run (output-test-properties) @ qpid-systests-jms_2.0 ---
[INFO] 
[INFO] ------------------------------------------------------------------------
[INFO] Building Apache Qpid Broker-J HTTP system tests 7.1.0-SNAPSHOT
[INFO] ------------------------------------------------------------------------
[INFO] 
[INFO] --- maven-clean-plugin:3.0.0:clean (default-clean) @ qpid-systests-http ---
[INFO] 
[INFO] --- maven-antrun-plugin:1.8:run (output-test-properties) @ qpid-systests-http ---
[INFO] 
[INFO] ------------------------------------------------------------------------
[INFO] Building Apache Qpid Broker-J Protocol Tests Core 7.1.0-SNAPSHOT
[INFO] ------------------------------------------------------------------------
[INFO] 
[INFO] --- maven-clean-plugin:3.0.0:clean (default-clean) @ protocol-tests-core ---
[INFO] 
[INFO] --- maven-antrun-plugin:1.8:run (output-test-properties) @ protocol-tests-core ---
[INFO] 
[INFO] ------------------------------------------------------------------------
[INFO] Skipping Apache Qpid Protocol Tests for AMQP 0-8,0-9,0-9-1
[INFO] This project has been banned from the build due to previous failures.
[INFO] ------------------------------------------------------------------------
[INFO] 
[INFO] ------------------------------------------------------------------------
[INFO] Skipping Apache Qpid Protocol Tests for AMQP 0-10
[INFO] This project has been banned from the build due to previous failures.
[INFO] ------------------------------------------------------------------------
[INFO] 
[INFO] ------------------------------------------------------------------------
[INFO] Skipping Apache Qpid Protocol Tests for AMQP 1.0
[INFO] This project has been banned from the build due to previous failures.
[INFO] ------------------------------------------------------------------------
[INFO] 
[INFO] ------------------------------------------------------------------------
[INFO] Building Apache Qpid Broker-J End to End Conversion Tests 7.1.0-SNAPSHOT
[INFO] ------------------------------------------------------------------------
[INFO] 
[INFO] --- maven-clean-plugin:3.0.0:clean (default-clean) @ qpid-systests-end-to-end-conversion-tests
---
[INFO] 
[INFO] --- maven-antrun-plugin:1.8:run (output-test-properties) @ qpid-systests-end-to-end-conversion-tests
---
[INFO] 
[INFO] ------------------------------------------------------------------------
[INFO] Building Apache Qpid Broker-J Performance Tests 7.1.0-SNAPSHOT
[INFO] ------------------------------------------------------------------------
[INFO] 
[INFO] --- maven-clean-plugin:3.0.0:clean (default-clean) @ qpid-perftests ---
[INFO] 
[INFO] --- maven-antrun-plugin:1.8:run (output-test-properties) @ qpid-perftests ---
[INFO] 
[INFO] ------------------------------------------------------------------------
[INFO] Skipping Apache Qpid Broker-J Performance Test System Tests
[INFO] This project has been banned from the build due to previous failures.
[INFO] ------------------------------------------------------------------------
[INFO] 
[INFO] ------------------------------------------------------------------------
[INFO] Skipping Apache Qpid Broker-J Performance Tests Visualisation JFC
[INFO] This project has been banned from the build due to previous failures.
[INFO] ------------------------------------------------------------------------
[INFO] 
[INFO] ------------------------------------------------------------------------
[INFO] Skipping Apache Qpid Broker-J BDB Store System Tests
[INFO] This project has been banned from the build due to previous failures.
[INFO] ------------------------------------------------------------------------
[INFO] 
[INFO] ------------------------------------------------------------------------
[INFO] Building Apache Qpid Joram JMS Tests 7.1.0-SNAPSHOT
[INFO] ------------------------------------------------------------------------
[INFO] 
[INFO] --- maven-clean-plugin:3.0.0:clean (default-clean) @ joramtests ---
[INFO] 
[INFO] --- maven-antrun-plugin:1.8:run (output-test-properties) @ joramtests ---
[INFO] 
[INFO] ------------------------------------------------------------------------
[INFO] Building Apache Qpid Broker-J JMS TCK Configuration 7.1.0-SNAPSHOT
[INFO] ------------------------------------------------------------------------
[INFO] 
[INFO] --- maven-clean-plugin:3.0.0:clean (default-clean) @ qpid-tck ---
[INFO] 
[INFO] --- maven-antrun-plugin:1.8:run (output-test-properties) @ qpid-tck ---
[INFO] 
[INFO] ------------------------------------------------------------------------
[INFO] Building Apache Qpid Broker-J Docbook 7.1.0-SNAPSHOT
[INFO] ------------------------------------------------------------------------
[INFO] 
[INFO] --- maven-clean-plugin:3.0.0:clean (default-clean) @ qpid-java-doc ---
[INFO] 
[INFO] --- maven-antrun-plugin:1.8:run (output-test-properties) @ qpid-java-doc ---
[INFO] 
[INFO] ------------------------------------------------------------------------
[INFO] Skipping Apache Qpid Broker-J Docbook
[INFO] This project has been banned from the build due to previous failures.
[INFO] ------------------------------------------------------------------------
[INFO] 
[INFO] ------------------------------------------------------------------------
[INFO] Skipping Apache Qpid Broker-J Performance Test Docbook
[INFO] This project has been banned from the build due to previous failures.
[INFO] ------------------------------------------------------------------------
[INFO] ------------------------------------------------------------------------
[INFO] Reactor Summary:
[INFO] 
[INFO] Apache Qpid Broker-J Parent ........................ SUCCESS [  2.314 s]
[INFO] Apache Qpid Broker-J Code Generation ............... SUCCESS [  1.881 s]
[INFO] Apache Qpid Broker-J Test Utilities ................ SUCCESS [  0.615 s]
[INFO] Apache Qpid Broker-J Core .......................... SUCCESS [ 12.526 s]
[INFO] Apache Qpid Broker-J LogBack Logging Plug-in ....... SUCCESS [  1.527 s]
[INFO] Apache Qpid Broker-J Access Control Plug-in ........ SUCCESS [  0.737 s]
[INFO] Apache Qpid Broker-J AMQP 0-10 Protocol Plug-in .... SUCCESS [  1.418 s]
[INFO] Apache Qpid Broker-J AMQP 0-8 Protocol Plug-in ..... SUCCESS [  1.071 s]
[INFO] Apache Qpid Broker-J AMQP 1-0 Protocol Plug-in ..... SUCCESS [  2.119 s]
[INFO] Apache Qpid Broker-J AMQP 0-8 to 0-10 Message Conversion Plug-in SUCCESS [  0.366 s]
[INFO] Apache Qpid Broker-J AMQP 0-8 to 1-0 Message Conversion Plug-in SUCCESS [  0.514 s]
[INFO] Apache Qpid Broker-J AMQP 0-10 to 1-0 Message Conversion Plug-in SUCCESS [  0.460 s]
[INFO] Apache Qpid Broker-J JDBC Message Store Plug-in .... SUCCESS [  0.790 s]
[INFO] Apache Qpid Broker-J Derby Message Store Plug-in ... SUCCESS [  0.704 s]
[INFO] Apache Qpid Broker-J JDBC Message Store Connection Pooling Plug-in SUCCESS [  0.295
s]
[INFO] Apache Qpid AMQP 1.0 JDBC Link Store Plug-in ....... SUCCESS [  0.327 s]
[INFO] Apache Qpid Broker-J HTTP Management Plug-in ....... SUCCESS [  1.709 s]
[INFO] Apache Qpid Broker-J AMQP Management Protocol Plug-in SUCCESS [  0.367 s]
[INFO] Apache Qpid Broker-J Memory Message Store Plug-in .. SUCCESS [  0.375 s]
[INFO] Apache Qpid Broker-J WebSocket Plug-in ............. SUCCESS [  0.538 s]
[INFO] Apache Qpid Broker-J BDB Message Store Plug-in ..... SUCCESS [  1.639 s]
[INFO] Apache Qpid AMQP 1.0 BDB Link Store Plug-in ........ SUCCESS [  0.320 s]
[INFO] Apache Qpid Broker-J ............................... SUCCESS [  0.889 s]
[INFO] Apache Qpid Broker-J Bundles ....................... SUCCESS [  6.027 s]
[INFO] Apache Qpid Broker-J Tools ......................... SUCCESS [  0.239 s]
[INFO] Apache Qpid Broker-J System Test Parent ............ SUCCESS [  1.655 s]
[INFO] Apache Qpid Broker-J System Test Utils ............. SUCCESS [  1.184 s]
[INFO] Apache Qpid Broker-J JMS System Tests Core ......... SUCCESS [  1.254 s]
[INFO] Apache Qpid Broker-J System Tests .................. FAILURE [04:13 min]
[INFO] Apache Qpid Broker-J JMS 1.1 System Tests .......... FAILURE [  0.737 s]
[INFO] Apache Qpid Broker-J JMS 2.0 System Tests .......... FAILURE [  0.011 s]
[INFO] Apache Qpid Broker-J HTTP system tests ............. FAILURE [  0.014 s]
[INFO] Apache Qpid Broker-J Protocol Tests Core ........... FAILURE [  0.006 s]
[INFO] Apache Qpid Protocol Tests for AMQP 0-8,0-9,0-9-1 .. SKIPPED
[INFO] Apache Qpid Protocol Tests for AMQP 0-10 ........... SKIPPED
[INFO] Apache Qpid Protocol Tests for AMQP 1.0 ............ SKIPPED
[INFO] Apache Qpid Broker-J End to End Conversion Tests ... FAILURE [  0.148 s]
[INFO] Apache Qpid Broker-J Performance Tests ............. FAILURE [  0.008 s]
[INFO] Apache Qpid Broker-J Performance Test System Tests . SKIPPED
[INFO] Apache Qpid Broker-J Performance Tests Visualisation JFC SKIPPED
[INFO] Apache Qpid Broker-J BDB Store System Tests ........ SKIPPED
[INFO] Apache Qpid Joram JMS Tests ........................ FAILURE [  0.038 s]
[INFO] Apache Qpid Broker-J JMS TCK Configuration ......... FAILURE [  0.005 s]
[INFO] Apache Qpid Broker-J Docbook ....................... FAILURE [  0.003 s]
[INFO] Apache Qpid Broker-J Docbook ....................... SKIPPED
[INFO] Apache Qpid Broker-J Performance Test Docbook ...... SKIPPED
[INFO] ------------------------------------------------------------------------
[INFO] BUILD FAILURE
[INFO] ------------------------------------------------------------------------
[INFO] Total time: 04:59 min
[INFO] Finished at: 2018-02-06T03:20:58Z
[INFO] Final Memory: 134M/5149M
[INFO] ------------------------------------------------------------------------
[ERROR] Failed to execute goal org.apache.maven.plugins:maven-surefire-plugin:2.19.1:test
(integration-test) on project qpid-systests: Execution integration-test of goal org.apache.maven.plugins:maven-surefire-plugin:2.19.1:test
failed: java.lang.RuntimeException: java.io.IOException: No space left on device -> [Help
1]
[ERROR] Failed to execute goal org.apache.maven.plugins:maven-resources-plugin:2.7:copy-resources
(copy-test-profile-resources) on project qpid-systests-jms_1.1: <https://builds.apache.org/job/Qpid-Broker-J-TestMatrix/Ubuntu%20Slaves=ubuntu,jdk=JDK%201.8%20(latest),profile=java-dby.1-0/ws/tmp/test-profiles/python_tests/JavaPre010PythonExcludes>
(No such file or directory) -> [Help 2]
[ERROR] Failed to execute goal org.apache.maven.plugins:maven-antrun-plugin:1.8:run (output-test-properties)
on project qpid-systests-jms_2.0: Error executing Ant tasks: <https://builds.apache.org/job/Qpid-Broker-J-TestMatrix/Ubuntu%20Slaves=ubuntu,jdk=JDK%201.8%20(latest),profile=java-dby.1-0/ws/systests/qpid-systests-jms_2.0/target/antrun/build-main.xml>
(No such file or directory) -> [Help 2]
[ERROR] Failed to execute goal org.apache.maven.plugins:maven-antrun-plugin:1.8:run (output-test-properties)
on project qpid-systests-http: Error executing Ant tasks: <https://builds.apache.org/job/Qpid-Broker-J-TestMatrix/Ubuntu%20Slaves=ubuntu,jdk=JDK%201.8%20(latest),profile=java-dby.1-0/ws/systests/qpid-systests-http-management/target/antrun/build-main.xml>
(No such file or directory) -> [Help 2]
[ERROR] Failed to execute goal org.apache.maven.plugins:maven-antrun-plugin:1.8:run (output-test-properties)
on project protocol-tests-core: Error executing Ant tasks: <https://builds.apache.org/job/Qpid-Broker-J-TestMatrix/Ubuntu%20Slaves=ubuntu,jdk=JDK%201.8%20(latest),profile=java-dby.1-0/ws/systests/protocol-tests-core/target/antrun/build-main.xml>
(No such file or directory) -> [Help 2]
[ERROR] Failed to execute goal org.apache.maven.plugins:maven-antrun-plugin:1.8:run (output-test-properties)
on project qpid-systests-end-to-end-conversion-tests: Error executing Ant tasks: <https://builds.apache.org/job/Qpid-Broker-J-TestMatrix/Ubuntu%20Slaves=ubuntu,jdk=JDK%201.8%20(latest),profile=java-dby.1-0/ws/systests/end-to-end-conversion-tests/target/antrun/build-main.xml>
(No such file or directory) -> [Help 2]
[ERROR] Failed to execute goal org.apache.maven.plugins:maven-antrun-plugin:1.8:run (output-test-properties)
on project qpid-perftests: Error executing Ant tasks: <https://builds.apache.org/job/Qpid-Broker-J-TestMatrix/Ubuntu%20Slaves=ubuntu,jdk=JDK%201.8%20(latest),profile=java-dby.1-0/ws/perftests/target/antrun/build-main.xml>
(No such file or directory) -> [Help 2]
[ERROR] Failed to execute goal org.apache.maven.plugins:maven-antrun-plugin:1.8:run (output-test-properties)
on project joramtests: Error executing Ant tasks: <https://builds.apache.org/job/Qpid-Broker-J-TestMatrix/Ubuntu%20Slaves=ubuntu,jdk=JDK%201.8%20(latest),profile=java-dby.1-0/ws/joramtests/target/antrun/build-main.xml>
(No such file or directory) -> [Help 2]
[ERROR] Failed to execute goal org.apache.maven.plugins:maven-antrun-plugin:1.8:run (output-test-properties)
on project qpid-tck: Error executing Ant tasks: <https://builds.apache.org/job/Qpid-Broker-J-TestMatrix/Ubuntu%20Slaves=ubuntu,jdk=JDK%201.8%20(latest),profile=java-dby.1-0/ws/tck/target/antrun/build-main.xml>
(No such file or directory) -> [Help 2]
[ERROR] Failed to execute goal org.apache.maven.plugins:maven-antrun-plugin:1.8:run (output-test-properties)
on project qpid-java-doc: Error executing Ant tasks: <https://builds.apache.org/job/Qpid-Broker-J-TestMatrix/Ubuntu%20Slaves=ubuntu,jdk=JDK%201.8%20(latest),profile=java-dby.1-0/ws/doc/target/antrun/build-main.xml>
(No such file or directory) -> [Help 2]
[ERROR] 
[ERROR] To see the full stack trace of the errors, re-run Maven with the -e switch.
[ERROR] Re-run Maven using the -X switch to enable full debug logging.
[ERROR] 
[ERROR] For more information about the errors and possible solutions, please read the following
articles:
[ERROR] [Help 1] http://cwiki.apache.org/confluence/display/MAVEN/PluginExecutionException
[ERROR] [Help 2] http://cwiki.apache.org/confluence/display/MAVEN/MojoExecutionException
[ERROR] 
[ERROR] After correcting the problems, you can resume the build with the command
[ERROR]   mvn <goals> -rf :qpid-systests
Build step 'Invoke top-level Maven targets' marked build as failure
Archiving artifacts
Performing Post build task...
Match found for : : True
Logical operation result is TRUE
Running script  : echo Finishing build
date
FATAL: Unable to produce a script file
Also:   hudson.remoting.Channel$CallSiteStackTrace: Remote call to H22
		at hudson.remoting.Channel.attachCallSiteStackTrace(Channel.java:1693)
		at hudson.remoting.UserResponse.retrieve(UserRequest.java:310)
		at hudson.remoting.Channel.call(Channel.java:908)
		at hudson.FilePath.act(FilePath.java:986)
		at hudson.FilePath.act(FilePath.java:975)
		at hudson.FilePath.createTextTempFile(FilePath.java:1363)
		at hudson.tasks.CommandInterpreter.createScriptFile(CommandInterpreter.java:162)
		at hudson.tasks.CommandInterpreter.perform(CommandInterpreter.java:94)
		at hudson.tasks.CommandInterpreter.perform(CommandInterpreter.java:66)
		at hudson.plugins.postbuildtask.PostbuildTask.perform(PostbuildTask.java:123)
		at hudson.tasks.BuildStepMonitor$1.perform(BuildStepMonitor.java:20)
		at hudson.model.AbstractBuild$AbstractBuildExecution.perform(AbstractBuild.java:744)
		at hudson.model.AbstractBuild$AbstractBuildExecution.performAllBuildSteps(AbstractBuild.java:690)
		at hudson.model.Build$BuildExecution.post2(Build.java:186)
		at hudson.model.AbstractBuild$AbstractBuildExecution.post(AbstractBuild.java:635)
		at hudson.model.Run.execute(Run.java:1749)
		at hudson.matrix.MatrixRun.run(MatrixRun.java:146)
		at hudson.model.ResourceController.execute(ResourceController.java:97)
		at hudson.model.Executor.run(Executor.java:421)
java.io.IOException: No space left on device
	at java.io.FileOutputStream.writeBytes(Native Method)
	at java.io.FileOutputStream.write(FileOutputStream.java:326)
	at sun.nio.cs.StreamEncoder.writeBytes(StreamEncoder.java:221)
	at sun.nio.cs.StreamEncoder.implClose(StreamEncoder.java:316)
	at sun.nio.cs.StreamEncoder.close(StreamEncoder.java:149)
	at java.io.OutputStreamWriter.close(OutputStreamWriter.java:233)
	at hudson.FilePath$17.invoke(FilePath.java:1380)
	at hudson.FilePath$17.invoke(FilePath.java:1363)
	at hudson.FilePath$FileCallableWrapper.call(FilePath.java:2760)
	at hudson.remoting.UserRequest.perform(UserRequest.java:207)
	at hudson.remoting.UserRequest.perform(UserRequest.java:53)
	at hudson.remoting.Request$2.run(Request.java:358)
	at hudson.remoting.InterceptingExecutorService$1.call(InterceptingExecutorService.java:72)
	at java.util.concurrent.FutureTask.run(FutureTask.java:266)
	at java.util.concurrent.ThreadPoolExecutor.runWorker(ThreadPoolExecutor.java:1142)
	at java.util.concurrent.ThreadPoolExecutor$Worker.run(ThreadPoolExecutor.java:617)
	at java.lang.Thread.run(Thread.java:748)
Caused: java.io.IOException: remote file operation failed: <https://builds.apache.org/job/Qpid-Broker-J-TestMatrix/Ubuntu%20Slaves=ubuntu,jdk=JDK%201.8%20(latest),profile=java-dby.1-0/ws/>
at hudson.remoting.Channel@42bcb45c:H22
	at hudson.FilePath.act(FilePath.java:993)
	at hudson.FilePath.act(FilePath.java:975)
	at hudson.FilePath.createTextTempFile(FilePath.java:1363)
Caused: java.io.IOException: Failed to create a temp file on <https://builds.apache.org/job/Qpid-Broker-J-TestMatrix/Ubuntu%20Slaves=ubuntu,jdk=JDK%201.8%20(latest),profile=java-dby.1-0/ws/>
	at hudson.FilePath.createTextTempFile(FilePath.java:1386)
	at hudson.tasks.CommandInterpreter.createScriptFile(CommandInterpreter.java:162)
	at hudson.tasks.CommandInterpreter.perform(CommandInterpreter.java:94)
	at hudson.tasks.CommandInterpreter.perform(CommandInterpreter.java:66)
	at hudson.plugins.postbuildtask.PostbuildTask.perform(PostbuildTask.java:123)
	at hudson.tasks.BuildStepMonitor$1.perform(BuildStepMonitor.java:20)
	at hudson.model.AbstractBuild$AbstractBuildExecution.perform(AbstractBuild.java:744)
	at hudson.model.AbstractBuild$AbstractBuildExecution.performAllBuildSteps(AbstractBuild.java:690)
	at hudson.model.Build$BuildExecution.post2(Build.java:186)
	at hudson.model.AbstractBuild$AbstractBuildExecution.post(AbstractBuild.java:635)
	at hudson.model.Run.execute(Run.java:1749)
	at hudson.matrix.MatrixRun.run(MatrixRun.java:146)
	at hudson.model.ResourceController.execute(ResourceController.java:97)
	at hudson.model.Executor.run(Executor.java:421)
POST BUILD TASK : FAILURE
END OF POST BUILD TASK : 0
Recording test results

Mime
View raw message