qpid-notifications mailing list archives

Site index · List index
Message view « Date » · « Thread »
Top « Date » · « Thread »
From Apache Jenkins Server <jenk...@builds.apache.org>
Subject Build failed in Jenkins: Qpid-JMS-AMQP-0-x-Broker-J-TestMatrix » JDK 1.8 (latest),0-10 #3
Date Wed, 17 Jan 2018 10:49:26 GMT
See <https://builds.apache.org/job/Qpid-JMS-AMQP-0-x-Broker-J-TestMatrix/jdk=JDK%201.8%20(latest),qpid.amqp.version=0-10/3/display/redirect?page=changes>

Changes:

[robbie] NO-JIRA: update year in NOTICE files

------------------------------------------
[...truncated 42.24 KB...]
[INFO] 
[INFO] ------------------------------------------------------------------------
[INFO] Building Apache Qpid JMS AMQP 0-10 Docbook 6.4.0-SNAPSHOT
[INFO] ------------------------------------------------------------------------
[INFO] 
[INFO] --- maven-clean-plugin:3.0.0:clean (default-clean) @ qpid-java-doc-jms-client-0-10
---
[INFO] Deleting <https://builds.apache.org/job/Qpid-JMS-AMQP-0-x-Broker-J-TestMatrix/jdk=JDK%201.8%20(latest),qpid.amqp.version=0-10/ws/doc/jms-client-0-10/target>
[INFO] 
[INFO] --- maven-enforcer-plugin:1.4.1:enforce (enforce-minimum-versions) @ qpid-java-doc-jms-client-0-10
---
[INFO] 
[INFO] --- jacoco-maven-plugin:0.7.5.201505241946:prepare-agent (default-prepare-agent) @
qpid-java-doc-jms-client-0-10 ---
[INFO] argLine set to "-javaagent:/home/jenkins/.m2/repository/org/jacoco/org.jacoco.agent/0.7.5.201505241946/org.jacoco.agent-0.7.5.201505241946-runtime.jar=destfile=<https://builds.apache.org/job/Qpid-JMS-AMQP-0-x-Broker-J-TestMatrix/jdk=JDK%201.8%20(latest),qpid.amqp.version=0-10/ws/doc/jms-client-0-10/target/jacoco.exec">
[INFO] 
[INFO] --- maven-resources-plugin:2.7:copy-resources (filter-docbook-sources) @ qpid-java-doc-jms-client-0-10
---
[INFO] Using 'UTF-8' encoding to copy filtered resources.
[INFO] Copying 1 resource
[INFO] 
[INFO] --- maven-remote-resources-plugin:1.5:process (process-resource-bundles) @ qpid-java-doc-jms-client-0-10
---
[INFO] 
[INFO] --- maven-resources-plugin:2.7:resources (default-resources) @ qpid-java-doc-jms-client-0-10
---
[INFO] Using 'UTF-8' encoding to copy filtered resources.
[INFO] Copying 1 resource
[INFO] 
[INFO] --- maven-compiler-plugin:3.5.1:compile (default-compile) @ qpid-java-doc-jms-client-0-10
---
[INFO] No sources to compile
[INFO] 
[INFO] --- maven-resources-plugin:2.7:testResources (default-testResources) @ qpid-java-doc-jms-client-0-10
---
[INFO] Using 'UTF-8' encoding to copy filtered resources.
[INFO] Copying 1 resource
[INFO] 
[INFO] --- maven-compiler-plugin:3.5.1:testCompile (default-testCompile) @ qpid-java-doc-jms-client-0-10
---
[INFO] No sources to compile
[INFO] 
[INFO] --- maven-surefire-plugin:2.19.1:test (default-test) @ qpid-java-doc-jms-client-0-10
---
[INFO] No tests to run.
[INFO] 
[INFO] --- maven-jar-plugin:3.0.0:jar (default-jar) @ qpid-java-doc-jms-client-0-10 ---
[WARNING] JAR will be empty - no content was marked for inclusion!
[INFO] Building jar: <https://builds.apache.org/job/Qpid-JMS-AMQP-0-x-Broker-J-TestMatrix/jdk=JDK%201.8%20(latest),qpid.amqp.version=0-10/ws/doc/jms-client-0-10/target/qpid-java-doc-jms-client-0-10-6.4.0-SNAPSHOT.jar>
[INFO] 
[INFO] --- maven-site-plugin:3.5.1:attach-descriptor (attach-descriptor) @ qpid-java-doc-jms-client-0-10
---
[INFO] 
[INFO] --- maven-assembly-plugin:2.6:single (default) @ qpid-java-doc-jms-client-0-10 ---
[INFO] Assemblies have been skipped per configuration of the skipAssembly parameter.
[INFO] 
[INFO] ------------------------------------------------------------------------
[INFO] Building Apache Qpid JMS AMQP 0-x System Tests 6.4.0-SNAPSHOT
[INFO] ------------------------------------------------------------------------
[INFO] 
[INFO] --- maven-clean-plugin:3.0.0:clean (default-clean) @ qpid-client-systests ---
[INFO] Deleting <https://builds.apache.org/job/Qpid-JMS-AMQP-0-x-Broker-J-TestMatrix/jdk=JDK%201.8%20(latest),qpid.amqp.version=0-10/ws/systests/target>
[INFO] 
[INFO] --- maven-enforcer-plugin:1.4.1:enforce (enforce-minimum-versions) @ qpid-client-systests
---
[INFO] 
[INFO] --- jacoco-maven-plugin:0.7.5.201505241946:prepare-agent (default-prepare-agent) @
qpid-client-systests ---
[INFO] argLine set to "-javaagent:/home/jenkins/.m2/repository/org/jacoco/org.jacoco.agent/0.7.5.201505241946/org.jacoco.agent-0.7.5.201505241946-runtime.jar=destfile=<https://builds.apache.org/job/Qpid-JMS-AMQP-0-x-Broker-J-TestMatrix/jdk=JDK%201.8%20(latest),qpid.amqp.version=0-10/ws/systests/target/jacoco.exec">
[INFO] 
[INFO] --- maven-remote-resources-plugin:1.5:process (process-resource-bundles) @ qpid-client-systests
---
[INFO] 
[INFO] --- maven-resources-plugin:2.7:resources (default-resources) @ qpid-client-systests
---
[INFO] Using 'UTF-8' encoding to copy filtered resources.
[INFO] Copying 1 resource
[INFO] Copying 3 resources
[INFO] 
[INFO] --- maven-compiler-plugin:3.5.1:compile (default-compile) @ qpid-client-systests ---
[INFO] Compiling 22 source files to <https://builds.apache.org/job/Qpid-JMS-AMQP-0-x-Broker-J-TestMatrix/jdk=JDK%201.8%20(latest),qpid.amqp.version=0-10/ws/systests/target/classes>
[WARNING] bootstrap class path not set in conjunction with -source 1.7
[INFO] 
[INFO] --- maven-resources-plugin:2.7:testResources (default-testResources) @ qpid-client-systests
---
[INFO] Using 'UTF-8' encoding to copy filtered resources.
[INFO] Copying 1 resource
[INFO] Copying 3 resources
[INFO] 
[INFO] --- maven-compiler-plugin:3.5.1:testCompile (default-testCompile) @ qpid-client-systests
---
[INFO] Compiling 14 source files to <https://builds.apache.org/job/Qpid-JMS-AMQP-0-x-Broker-J-TestMatrix/jdk=JDK%201.8%20(latest),qpid.amqp.version=0-10/ws/systests/target/test-classes>
[WARNING] bootstrap class path not set in conjunction with -source 1.7
[INFO] <https://builds.apache.org/job/Qpid-JMS-AMQP-0-x-Broker-J-TestMatrix/jdk=JDK%201.8%20(latest),qpid.amqp.version=0-10/ws/systests/src/test/java/org/apache/qpid/systest/destination/AddressBasedDestinationTest.java>:
Some input files use unchecked or unsafe operations.
[INFO] <https://builds.apache.org/job/Qpid-JMS-AMQP-0-x-Broker-J-TestMatrix/jdk=JDK%201.8%20(latest),qpid.amqp.version=0-10/ws/systests/src/test/java/org/apache/qpid/systest/destination/AddressBasedDestinationTest.java>:
Recompile with -Xlint:unchecked for details.
[INFO] 
[INFO] --- maven-surefire-plugin:2.19.1:test (default-test) @ qpid-client-systests ---
[INFO] Tests are skipped.
[INFO] 
[INFO] --- maven-jar-plugin:3.0.0:jar (default-jar) @ qpid-client-systests ---
[INFO] Building jar: <https://builds.apache.org/job/Qpid-JMS-AMQP-0-x-Broker-J-TestMatrix/jdk=JDK%201.8%20(latest),qpid.amqp.version=0-10/ws/systests/target/qpid-client-systests-6.4.0-SNAPSHOT.jar>
[INFO] 
[INFO] --- maven-site-plugin:3.5.1:attach-descriptor (attach-descriptor) @ qpid-client-systests
---
[INFO] 
[INFO] --- maven-surefire-plugin:2.19.1:test (integration-test) @ qpid-client-systests ---

-------------------------------------------------------
 T E S T S
-------------------------------------------------------
Running org.apache.qpid.systest.producer.ImmediateAndMandatoryPublishingTest
Tests run: 11, Failures: 0, Errors: 0, Skipped: 11, Time elapsed: 24.803 sec - in org.apache.qpid.systest.producer.ImmediateAndMandatoryPublishingTest
Running org.apache.qpid.systest.producer.CloseOnNoRouteForMandatoryMessageTest
Tests run: 4, Failures: 0, Errors: 0, Skipped: 4, Time elapsed: 5.013 sec - in org.apache.qpid.systest.producer.CloseOnNoRouteForMandatoryMessageTest
Running org.apache.qpid.systest.producer.ReturnUnroutableMandatoryMessageTest
Tests run: 3, Failures: 0, Errors: 0, Skipped: 3, Time elapsed: 5.754 sec - in org.apache.qpid.systest.producer.ReturnUnroutableMandatoryMessageTest
Running org.apache.qpid.systest.connection.ExistingSocketTest
Tests run: 2, Failures: 0, Errors: 0, Skipped: 0, Time elapsed: 4.857 sec - in org.apache.qpid.systest.connection.ExistingSocketTest
Running org.apache.qpid.systest.connection.ConnectionTest
Tests run: 7, Failures: 2, Errors: 4, Skipped: 0, Time elapsed: 187.792 sec <<< FAILURE!
- in org.apache.qpid.systest.connection.ConnectionTest
testDefaultExchanges(org.apache.qpid.systest.connection.ConnectionTest)  Time elapsed: 30.023
sec  <<< ERROR!
org.apache.qpid.AMQConnectionFailureException: connect timed out
	at org.apache.qpid.systest.connection.ConnectionTest.testDefaultExchanges(ConnectionTest.java:83)
Caused by: org.apache.qpid.transport.TransportException: Error connecting to broker
	at org.apache.qpid.systest.connection.ConnectionTest.testDefaultExchanges(ConnectionTest.java:83)
Caused by: java.net.SocketTimeoutException: connect timed out
	at org.apache.qpid.systest.connection.ConnectionTest.testDefaultExchanges(ConnectionTest.java:83)

testExceptionWhenUserPassIsRequired(org.apache.qpid.systest.connection.ConnectionTest)  Time
elapsed: 30.041 sec  <<< FAILURE!
java.lang.AssertionError: Incorrect Exception thrown! The exception thrown is : connect timed
out
	at org.apache.qpid.systest.connection.ConnectionTest.testExceptionWhenUserPassIsRequired(ConnectionTest.java:304)

testClientIDVerificationForSameUser(org.apache.qpid.systest.connection.ConnectionTest)  Time
elapsed: 30.019 sec  <<< ERROR!
org.apache.qpid.QpidException: Unable to create session, the maximum number of sessions per
connection is 0. You must either close one or more sessions or increase the maximum number
of sessions available per connection.
	at org.apache.qpid.systest.connection.ConnectionTest.testClientIDVerificationForSameUser(ConnectionTest.java:206)
Caused by: org.apache.qpid.jms.ChannelLimitReachedException: Unable to create session, the
maximum number of sessions per connection is 0. You must either close one or more sessions
or increase the maximum number of sessions available per connection.
	at org.apache.qpid.systest.connection.ConnectionTest.testClientIDVerificationForSameUser(ConnectionTest.java:206)

testClientIDVerificationForDifferentUsers(org.apache.qpid.systest.connection.ConnectionTest)
 Time elapsed: 30.018 sec  <<< ERROR!
org.apache.qpid.QpidException: Unable to create session, the maximum number of sessions per
connection is 0. You must either close one or more sessions or increase the maximum number
of sessions available per connection.
	at org.apache.qpid.systest.connection.ConnectionTest.testClientIDVerificationForDifferentUsers(ConnectionTest.java:253)
Caused by: org.apache.qpid.jms.ChannelLimitReachedException: Unable to create session, the
maximum number of sessions per connection is 0. You must either close one or more sessions
or increase the maximum number of sessions available per connection.
	at org.apache.qpid.systest.connection.ConnectionTest.testClientIDVerificationForDifferentUsers(ConnectionTest.java:253)

testUnsupportedSASLMechanism(org.apache.qpid.systest.connection.ConnectionTest)  Time elapsed:
30.019 sec  <<< FAILURE!
java.lang.AssertionError: Unexpected exception message : connect timed out
	at org.apache.qpid.systest.connection.ConnectionTest.testUnsupportedSASLMechanism(ConnectionTest.java:171)

testClientIdIsPopulatedAutomatically(org.apache.qpid.systest.connection.ConnectionTest)  Time
elapsed: 30.034 sec  <<< ERROR!
org.apache.qpid.AMQConnectionFailureException: connect timed out
	at org.apache.qpid.systest.connection.ConnectionTest.testClientIdIsPopulatedAutomatically(ConnectionTest.java:137)
Caused by: org.apache.qpid.transport.TransportException: Error connecting to broker
	at org.apache.qpid.systest.connection.ConnectionTest.testClientIdIsPopulatedAutomatically(ConnectionTest.java:137)
Caused by: java.net.SocketTimeoutException: connect timed out
	at org.apache.qpid.systest.connection.ConnectionTest.testClientIdIsPopulatedAutomatically(ConnectionTest.java:137)

Running org.apache.qpid.systest.connection.HeartbeatTest
Tests run: 7, Failures: 0, Errors: 0, Skipped: 0, Time elapsed: 23.483 sec - in org.apache.qpid.systest.connection.HeartbeatTest
Running org.apache.qpid.systest.connection.ConnectionFactoryTest
Tests run: 2, Failures: 0, Errors: 2, Skipped: 0, Time elapsed: 64.437 sec <<< FAILURE!
- in org.apache.qpid.systest.connection.ConnectionFactoryTest
testCreateConnectionWithUsernamePassword(org.apache.qpid.systest.connection.ConnectionFactoryTest)
 Time elapsed: 30.008 sec  <<< ERROR!
javax.jms.JMSException: Error creating connection: connect timed out
	at org.apache.qpid.systest.connection.ConnectionFactoryTest.testCreateConnectionWithUsernamePassword(ConnectionFactoryTest.java:62)
Caused by: org.apache.qpid.AMQConnectionFailureException: connect timed out
	at org.apache.qpid.systest.connection.ConnectionFactoryTest.testCreateConnectionWithUsernamePassword(ConnectionFactoryTest.java:62)
Caused by: org.apache.qpid.transport.TransportException: Error connecting to broker
	at org.apache.qpid.systest.connection.ConnectionFactoryTest.testCreateConnectionWithUsernamePassword(ConnectionFactoryTest.java:62)
Caused by: java.net.SocketTimeoutException: connect timed out
	at org.apache.qpid.systest.connection.ConnectionFactoryTest.testCreateConnectionWithUsernamePassword(ConnectionFactoryTest.java:62)

testCreatingConnectionWithInstanceMadeUsingDefaultConstructor(org.apache.qpid.systest.connection.ConnectionFactoryTest)
 Time elapsed: 30.023 sec  <<< ERROR!
javax.jms.JMSException: Error creating connection: connect timed out
	at org.apache.qpid.systest.connection.ConnectionFactoryTest.testCreatingConnectionWithInstanceMadeUsingDefaultConstructor(ConnectionFactoryTest.java:122)
Caused by: org.apache.qpid.AMQConnectionFailureException: connect timed out
	at org.apache.qpid.systest.connection.ConnectionFactoryTest.testCreatingConnectionWithInstanceMadeUsingDefaultConstructor(ConnectionFactoryTest.java:122)
Caused by: org.apache.qpid.transport.TransportException: Error connecting to broker
	at org.apache.qpid.systest.connection.ConnectionFactoryTest.testCreatingConnectionWithInstanceMadeUsingDefaultConstructor(ConnectionFactoryTest.java:122)
Caused by: java.net.SocketTimeoutException: connect timed out
	at org.apache.qpid.systest.connection.ConnectionFactoryTest.testCreatingConnectionWithInstanceMadeUsingDefaultConstructor(ConnectionFactoryTest.java:122)

Running org.apache.qpid.systest.connection.ExceptionListenerTest
Tests run: 1, Failures: 0, Errors: 0, Skipped: 1, Time elapsed: 3.482 sec - in org.apache.qpid.systest.connection.ExceptionListenerTest
Running org.apache.qpid.systest.core.brokerj.SpawnQpidBrokerAdminTest
Tests run: 5, Failures: 0, Errors: 0, Skipped: 0, Time elapsed: 17.728 sec - in org.apache.qpid.systest.core.brokerj.SpawnQpidBrokerAdminTest
Running org.apache.qpid.systest.message.MessageCompressionTest
Tests run: 5, Failures: 0, Errors: 1, Skipped: 0, Time elapsed: 37.768 sec <<< FAILURE!
- in org.apache.qpid.systest.message.MessageCompressionTest
testDisablingCompressionAtBroker(org.apache.qpid.systest.message.MessageCompressionTest) 
Time elapsed: 30.015 sec  <<< ERROR!
org.apache.qpid.AMQConnectionFailureException: connect timed out
	at org.apache.qpid.systest.message.MessageCompressionTest.enableMessageCompression(MessageCompressionTest.java:251)
	at org.apache.qpid.systest.message.MessageCompressionTest.testDisablingCompressionAtBroker(MessageCompressionTest.java:96)
Caused by: org.apache.qpid.transport.TransportException: Error connecting to broker
	at org.apache.qpid.systest.message.MessageCompressionTest.enableMessageCompression(MessageCompressionTest.java:251)
	at org.apache.qpid.systest.message.MessageCompressionTest.testDisablingCompressionAtBroker(MessageCompressionTest.java:96)
Caused by: java.net.SocketTimeoutException: connect timed out
	at org.apache.qpid.systest.message.MessageCompressionTest.enableMessageCompression(MessageCompressionTest.java:251)
	at org.apache.qpid.systest.message.MessageCompressionTest.testDisablingCompressionAtBroker(MessageCompressionTest.java:96)

Running org.apache.qpid.systest.message.AMQPEncodedMapMessageTest
Tests run: 5, Failures: 0, Errors: 0, Skipped: 0, Time elapsed: 6.383 sec - in org.apache.qpid.systest.message.AMQPEncodedMapMessageTest
Running org.apache.qpid.systest.message.JMSXUserIDTest
Tests run: 2, Failures: 0, Errors: 0, Skipped: 0, Time elapsed: 4.751 sec - in org.apache.qpid.systest.message.JMSXUserIDTest
Running org.apache.qpid.systest.destination.AddressBasedDestinationTest
Tests run: 45, Failures: 0, Errors: 0, Skipped: 2, Time elapsed: 32.76 sec - in org.apache.qpid.systest.destination.AddressBasedDestinationTest

Results :

Failed tests: 
  ConnectionTest.testExceptionWhenUserPassIsRequired:304 Incorrect Exception thrown! The exception
thrown is : connect timed out
  ConnectionTest.testUnsupportedSASLMechanism:171 Unexpected exception message : connect timed
out
Tests in error: 
  ConnectionFactoryTest.testCreateConnectionWithUsernamePassword:62 » JMS Error ...
  ConnectionFactoryTest.testCreatingConnectionWithInstanceMadeUsingDefaultConstructor:122
» JMS
  ConnectionTest.testClientIDVerificationForDifferentUsers:253 » Qpid Unable to ...
  ConnectionTest.testClientIDVerificationForSameUser:206 » Qpid Unable to create...
  ConnectionTest.testClientIdIsPopulatedAutomatically:137 » AMQConnectionFailure
  ConnectionTest.testDefaultExchanges:83 » AMQConnectionFailure connect timed ou...
  MessageCompressionTest.testDisablingCompressionAtBroker:96->enableMessageCompression:251
» AMQConnectionFailure

Tests run: 99, Failures: 2, Errors: 7, Skipped: 21

[INFO] ------------------------------------------------------------------------
[INFO] Reactor Summary:
[INFO] 
[INFO] Apache Qpid JMS AMQP 0-x Parent .................... SUCCESS [  5.606 s]
[INFO] Apache Qpid JMS AMQP 0-x ........................... SUCCESS [ 29.920 s]
[INFO] Apache Qpid JMS AMQP 0-x Bundles ................... SUCCESS [  1.947 s]
[INFO] Apache Qpid JMS AMQP 0-x Examples .................. SUCCESS [  0.175 s]
[INFO] Apache Qpid JMS AMQP 0-x Docbook ................... SUCCESS [  0.022 s]
[INFO] Apache Qpid JMS AMQP 0-8, 0-9 and 0-9-1 Docbook .... SUCCESS [  0.241 s]
[INFO] Apache Qpid JMS AMQP 0-10 Docbook .................. SUCCESS [  0.188 s]
[INFO] Apache Qpid JMS AMQP 0-x System Tests .............. FAILURE [07:05 min]
[INFO] ------------------------------------------------------------------------
[INFO] BUILD FAILURE
[INFO] ------------------------------------------------------------------------
[INFO] Total time: 07:43 min
[INFO] Finished at: 2018-01-17T10:47:52Z
[INFO] Final Memory: 42M/640M
[INFO] ------------------------------------------------------------------------
[ERROR] Failed to execute goal org.apache.maven.plugins:maven-surefire-plugin:2.19.1:test
(integration-test) on project qpid-client-systests: There are test failures.
[ERROR] 
[ERROR] Please refer to <https://builds.apache.org/job/Qpid-JMS-AMQP-0-x-Broker-J-TestMatrix/jdk=JDK%201.8%20(latest),qpid.amqp.version=0-10/3/artifact/systests/target/surefire-reports/junit>
for the individual test results.
[ERROR] -> [Help 1]
[ERROR] 
[ERROR] To see the full stack trace of the errors, re-run Maven with the -e switch.
[ERROR] Re-run Maven using the -X switch to enable full debug logging.
[ERROR] 
[ERROR] For more information about the errors and possible solutions, please read the following
articles:
[ERROR] [Help 1] http://cwiki.apache.org/confluence/display/MAVEN/MojoFailureException
[ERROR] 
[ERROR] After correcting the problems, you can resume the build with the command
[ERROR]   mvn <goals> -rf :qpid-client-systests
Build step 'Invoke top-level Maven targets' marked build as failure
Archiving artifacts
[Fast Archiver] Compressed 86.38 MB of artifacts by 17.7% relative to #2
Performing Post build task...
Match found for : : True
Logical operation result is TRUE
Running script  : echo Finishing build
date
[0-10] $ /bin/bash -xe /tmp/jenkins8839420204657393936.sh
+ echo Finishing build
Finishing build
+ date
Wed Jan 17 10:49:25 UTC 2018
POST BUILD TASK : SUCCESS
END OF POST BUILD TASK : 0
Recording test results

Mime
View raw message