qpid-notifications mailing list archives

Site index · List index
Message view « Date » · « Thread »
Top « Date » · « Thread »
From Apache Jenkins Server <jenk...@builds.apache.org>
Subject Build failed in Jenkins: Qpid-JMS-AMQP-0-x-Broker-J-TestMatrix » JDK 1.8 (latest),0-10 #1
Date Mon, 15 Jan 2018 22:22:27 GMT
See <https://builds.apache.org/job/Qpid-JMS-AMQP-0-x-Broker-J-TestMatrix/jdk=JDK%201.8%20(latest),qpid.amqp.version=0-10/1/display/redirect>

------------------------------------------
[...truncated 84.24 KB...]
Progress (1): 2.1/2.5 kBProgress (1): 2.5 kB                        Downloaded from central: https://repo.maven.apache.org/maven2/org/slf4j/jcl-over-slf4j/1.6.2/jcl-over-slf4j-1.6.2.pom (2.5 kB at 95 kB/s)
Downloading from central: https://repo.maven.apache.org/maven2/org/slf4j/slf4j-parent/1.6.2/slf4j-parent-1.6.2.pom
Progress (1): 2.1/9.7 kBProgress (1): 4.9/9.7 kBProgress (1): 7.7/9.7 kBProgress (1): 9.7 kB                        Downloaded from central: https://repo.maven.apache.org/maven2/org/slf4j/slf4j-parent/1.6.2/slf4j-parent-1.6.2.pom (9.7 kB at 360 kB/s)
Downloading from central: https://repo.maven.apache.org/maven2/org/hamcrest/hamcrest-integration/1.3/hamcrest-integration-1.3.pom
Progress (1): 1.3 kB                    Downloaded from central: https://repo.maven.apache.org/maven2/org/hamcrest/hamcrest-integration/1.3/hamcrest-integration-1.3.pom (1.3 kB at 49 kB/s)
Downloading from central: https://repo.maven.apache.org/maven2/org/apache/maven/maven-core/3.5.0/maven-core-3.5.0.jar
Downloading from central: https://repo.maven.apache.org/maven2/org/apache/maven/maven-model/3.5.0/maven-model-3.5.0.jar
Downloading from central: https://repo.maven.apache.org/maven2/org/apache/maven/maven-settings/3.5.0/maven-settings-3.5.0.jar
Downloading from central: https://repo.maven.apache.org/maven2/org/apache/maven/maven-settings-builder/3.5.0/maven-settings-builder-3.5.0.jar
Downloading from central: https://repo.maven.apache.org/maven2/org/apache/maven/maven-builder-support/3.5.0/maven-builder-support-3.5.0.jar
Progress (1): 2.1/45 kBProgress (1): 4.9/45 kBProgress (1): 7.7/45 kBProgress (1): 10/45 kB Progress (1): 13/45 kBProgress (1): 16/45 kBProgress (1): 19/45 kBProgress (2): 19/45 kB | 2.1/15 kBProgress (2): 19/45 kB | 4.9/15 kBProgress (2): 19/45 kB | 7.7/15 kBProgress (2): 21/45 kB | 7.7/15 kBProgress (2): 24/45 kB | 7.7/15 kBProgress (2): 24/45 kB | 10/15 kB Progress (2): 27/45 kB | 10/15 kBProgress (2): 30/45 kB | 10/15 kBProgress (2): 32/45 kB | 10/15 kBProgress (3): 32/45 kB | 10/15 kB | 2.1/43 kBProgress (3): 32/45 kB | 10/15 kB | 4.9/43 kBProgress (3): 32/45 kB | 10/15 kB | 7.7/43 kBProgress (4): 32/45 kB | 10/15 kB | 7.7/43 kB | 2.1/625 kBProgress (4): 32/45 kB | 10/15 kB | 10/43 kB | 2.1/625 kB Progress (5): 32/45 kB | 10/15 kB | 10/43 kB | 2.1/625 kB | 2.1/165 kBProgress (5): 32/45 kB | 10/15 kB | 10/43 kB | 2.1/625 kB | 4.9/165 kBProgress (5): 32/45 kB | 10/15 kB | 10/43 kB | 2.1/625 kB | 7.7/165 kBProgress (5): 32/45 kB | 10/15 kB | 10/43 kB | 4.9/625 kB | 7.7/165 kBProgress (5): 32/45 kB | 10/15 kB | 10/43 kB | 7.7/625 kB | 7.7/165 kBProgress (5): 32/45 kB | 10/15 kB | 10/43 kB | 10/625 kB | 7.7/165 kB Progress (5): 32/45 kB | 10/15 kB | 10/43 kB | 13/625 kB | 7.7/165 kBProgress (5): 32/45 kB | 10/15 kB | 10/43 kB | 16/625 kB | 7.7/165 kBProgress (5): 32/45 kB | 13/15 kB | 10/43 kB | 16/625 kB | 7.7/165 kBProgress (5): 32/45 kB | 15 kB | 10/43 kB | 16/625 kB | 7.7/165 kB   Progress (5): 32/45 kB | 15 kB | 10/43 kB | 16/625 kB | 10/165 kB Progress (5): 32/45 kB | 15 kB | 10/43 kB | 16/625 kB | 13/165 kBProgress (5): 36/45 kB | 15 kB | 10/43 kB | 16/625 kB | 13/165 kBProgress (5): 40/45 kB | 15 kB | 10/43 kB | 16/625 kB | 13/165 kBProgress (5): 44/45 kB | 15 kB | 10/43 kB | 16/625 kB | 13/165 kBProgress (5): 44/45 kB | 15 kB | 10/43 kB | 19/625 kB | 13/165 kBProgress (5): 45 kB | 15 kB | 10/43 kB | 19/625 kB | 13/165 kB   Progress (5): 45 kB | 15 kB | 10/43 kB | 21/625 kB | 13/165 kBProgress (5): 45 kB | 15 kB | 10/43 kB | 24/625 kB | 13/165 kBProgress (5): 45 kB | 15 kB | 10/43 kB | 27/625 kB | 13/165 kBProgress (5): 45 kB | 15 kB | 10/43 kB | 30/625 kB | 13/165 kBProgress (5): 45 kB | 15 kB | 10/43 kB | 32/625 kB | 13/165 kBProgress (5): 45 kB | 15 kB | 10/43 kB | 36/625 kB | 13/165 kBProgress (5): 45 kB | 15 kB | 10/43 kB | 40/625 kB | 13/165 kBProgress (5): 45 kB | 15 kB | 10/43 kB | 44/625 kB | 13/165 kBProgress (5): 45 kB | 15 kB | 10/43 kB | 49/625 kB | 13/165 kBProgress (5): 45 kB | 15 kB | 13/43 kB | 49/625 kB | 13/165 kBProgress (5): 45 kB | 15 kB | 13/43 kB | 49/625 kB | 16/165 kBProgress (5): 45 kB | 15 kB | 16/43 kB | 49/625 kB | 16/165 kBProgress (5): 45 kB | 15 kB | 16/43 kB | 49/625 kB | 19/165 kBProgress (5): 45 kB | 15 kB | 19/43 kB | 49/625 kB | 19/165 kBProgress (5): 45 kB | 15 kB | 19/43 kB | 49/625 kB | 21/165 kBProgress (5): 45 kB | 15 kB | 21/43 kB | 49/625 kB | 21/165 kBProgress (5): 45 kB | 15 kB | 21/43 kB | 49/625 kB | 24/165 kBProgress (5): 45 kB | 15 kB | 24/43 kB | 49/625 kB | 24/165 kBProgress (5): 45 kB | 15 kB | 24/43 kB | 49/625 kB | 27/165 kBProgress (5): 45 kB | 15 kB | 27/43 kB | 49/625 kB | 27/165 kBProgress (5): 45 kB | 15 kB | 27/43 kB | 49/625 kB | 30/165 kBProgress (5): 45 kB | 15 kB | 30/43 kB | 49/625 kB | 30/165 kBProgress (5): 45 kB | 15 kB | 30/43 kB | 49/625 kB | 32/165 kBProgress (5): 45 kB | 15 kB | 32/43 kB | 49/625 kB | 32/165 kBProgress (5): 45 kB | 15 kB | 36/43 kB | 49/625 kB | 32/165 kBProgress (5): 45 kB | 15 kB | 40/43 kB | 49/625 kB | 32/165 kBProgress (5): 45 kB | 15 kB | 43 kB | 49/625 kB | 32/165 kB   Progress (5): 45 kB | 15 kB | 43 kB | 53/625 kB | 32/165 kBProgress (5): 45 kB | 15 kB | 43 kB | 57/625 kB | 32/165 kBProgress (5): 45 kB | 15 kB | 43 kB | 57/625 kB | 36/165 kBProgress (5): 45 kB | 15 kB | 43 kB | 57/625 kB | 40/165 kBProgress (5): 45 kB | 15 kB | 43 kB | 61/625 kB | 40/165 kBProgress (5): 45 kB | 15 kB | 43 kB | 61/625 kB | 44/165 kBProgress (5): 45 kB | 15 kB | 43 kB | 61/625 kB | 49/165 kBProgress (5): 45 kB | 15 kB | 43 kB | 65/625 kB | 49/165 kBProgress (5): 45 kB | 15 kB | 43 kB | 69/625 kB | 49/165 kBProgress (5): 45 kB | 15 kB | 43 kB | 73/625 kB | 49/165 kBProgress (5): 45 kB | 15 kB | 43 kB | 77/625 kB | 49/165 kBProgress (5): 45 kB | 15 kB | 43 kB | 81/625 kB | 49/165 kBProgress (5): 45 kB | 15 kB | 43 kB | 81/625 kB | 53/165 kBProgress (5): 45 kB | 15 kB | 43 kB | 85/625 kB | 53/165 kBProgress (5): 45 kB | 15 kB | 43 kB | 85/625 kB | 57/165 kBProgress (5): 45 kB | 15 kB | 43 kB | 89/625 kB | 57/165 kBProgress (5): 45 kB | 15 kB | 43 kB | 89/625 kB | 61/165 kBProgress (5): 45 kB | 15 kB | 43 kB | 94/625 kB | 61/165 kBProgress (5): 45 kB | 15 kB | 43 kB | 98/625 kB | 61/165 kBProgress (5): 45 kB | 15 kB | 43 kB | 98/625 kB | 65/165 kBProgress (5): 45 kB | 15 kB | 43 kB | 102/625 kB | 65/165 kBProgress (5): 45 kB | 15 kB | 43 kB | 106/625 kB | 65/165 kB                                                            Downloaded from central: https://repo.maven.apache.org/maven2/org/apache/maven/maven-settings/3.5.0/maven-settings-3.5.0.jar (45 kB at 1.1 MB/s)
Downloading from central: https://repo.maven.apache.org/maven2/org/apache/maven/maven-repository-metadata/3.5.0/maven-repository-metadata-3.5.0.jar
Progress (4): 15 kB | 43 kB | 106/625 kB | 69/165 kBProgress (4): 15 kB | 43 kB | 106/625 kB | 73/165 kBProgress (4): 15 kB | 43 kB | 106/625 kB | 77/165 kBProgress (4): 15 kB | 43 kB | 106/625 kB | 81/165 kB                                                    Downloaded from central: https://repo.maven.apache.org/maven2/org/apache/maven/maven-builder-support/3.5.0/maven-builder-support-3.5.0.jar (15 kB at 363 kB/s)
Downloading from central: https://repo.maven.apache.org/maven2/org/apache/maven/maven-artifact/3.5.0/maven-artifact-3.5.0.jar
Progress (3): 43 kB | 110/625 kB | 81/165 kBProgress (3): 43 kB | 114/625 kB | 81/165 kBProgress (3): 43 kB | 118/625 kB | 81/165 kBProgress (3): 43 kB | 122/625 kB | 81/165 kBProgress (3): 43 kB | 126/625 kB | 81/165 kBProgress (3): 43 kB | 130/625 kB | 81/165 kBProgress (3): 43 kB | 130/625 kB | 85/165 kBProgress (3): 43 kB | 130/625 kB | 89/165 kBProgress (3): 43 kB | 130/625 kB | 94/165 kBProgress (3): 43 kB | 130/625 kB | 98/165 kBProgress (3): 43 kB | 135/625 kB | 98/165 kBProgress (3): 43 kB | 139/625 kB | 98/165 kBProgress (3): 43 kB | 143/625 kB | 98/165 kBProgress (3): 43 kB | 147/625 kB | 98/165 kBProgress (3): 43 kB | 151/625 kB | 98/165 kBProgress (3): 43 kB | 155/625 kB | 98/165 kBProgress (3): 43 kB | 159/625 kB | 98/165 kBProgress (3): 43 kB | 163/625 kB | 98/165 kBProgress (3): 43 kB | 167/625 kB | 98/165 kBProgress (3): 43 kB | 171/625 kB | 98/165 kBProgress (3): 43 kB | 171/625 kB | 102/165 kBProgress (3): 43 kB | 171/625 kB | 106/165 kBProgress (3): 43 kB | 171/625 kB | 110/165 kBProgress (3): 43 kB | 171/625 kB | 114/165 kB                                             Downloaded from central: https://repo.maven.apache.org/maven2/org/apache/maven/maven-settings-builder/3.5.0/maven-settings-builder-3.5.0.jar (43 kB at 901 kB/s)
Progress (2): 176/625 kB | 114/165 kBProgress (2): 180/625 kB | 114/165 kBProgress (2): 184/625 kB | 114/165 kBProgress (2): 188/625 kB | 114/165 kBProgress (2): 192/625 kB | 114/165 kBProgress (2): 196/625 kB | 114/165 kBProgress (2): 200/625 kB | 114/165 kBProgress (2): 204/625 kB | 114/165 kBProgress (2): 208/625 kB | 114/165 kBProgress (2): 212/625 kB | 114/165 kBProgress (2): 212/625 kB | 118/165 kBProgress (2): 212/625 kB | 122/165 kB                                     Downloading from central: https://repo.maven.apache.org/maven2/org/apache/maven/maven-plugin-api/3.5.0/maven-plugin-api-3.5.0.jar
Progress (2): 212/625 kB | 126/165 kBProgress (2): 212/625 kB | 130/165 kBProgress (2): 216/625 kB | 130/165 kBProgress (2): 219/625 kB | 130/165 kBProgress (2): 223/625 kB | 130/165 kBProgress (2): 227/625 kB | 130/165 kBProgress (2): 231/625 kB | 130/165 kBProgress (2): 235/625 kB | 130/165 kBProgress (2): 239/625 kB | 130/165 kBProgress (2): 239/625 kB | 135/165 kBProgress (2): 243/625 kB | 135/165 kBProgress (2): 243/625 kB | 139/165 kBProgress (2): 247/625 kB | 139/165 kBProgress (2): 247/625 kB | 143/165 kBProgress (2): 251/625 kB | 143/165 kBProgress (2): 251/625 kB | 147/165 kBProgress (3): 251/625 kB | 147/165 kB | 2.1/55 kBProgress (3): 251/625 kB | 147/165 kB | 4.9/55 kBProgress (3): 251/625 kB | 147/165 kB | 7.7/55 kBProgress (3): 251/625 kB | 147/165 kB | 10/55 kB Progress (3): 251/625 kB | 147/165 kB | 13/55 kBProgress (3): 251/625 kB | 147/165 kB | 16/55 kBProgress (3): 256/625 kB | 147/165 kB | 16/55 kBProgress (3): 260/625 kB | 147/165 kB | 16/55 kBProgress (4): 260/625 kB | 147/165 kB | 16/55 kB | 4.1/27 kBProgress (4): 264/625 kB | 147/165 kB | 16/55 kB | 4.1/27 kBProgress (4): 268/625 kB | 147/165 kB | 16/55 kB | 4.1/27 kBProgress (4): 268/625 kB | 151/165 kB | 16/55 kB | 4.1/27 kBProgress (4): 268/625 kB | 155/165 kB | 16/55 kB | 4.1/27 kBProgress (4): 272/625 kB | 155/165 kB | 16/55 kB | 4.1/27 kBProgress (4): 272/625 kB | 155/165 kB | 16/55 kB | 7.6/27 kBProgress (4): 276/625 kB | 155/165 kB | 16/55 kB | 7.6/27 kBProgress (4): 276/625 kB | 159/165 kB | 16/55 kB | 7.6/27 kBProgress (4): 276/625 kB | 163/165 kB | 16/55 kB | 7.6/27 kBProgress (4): 276/625 kB | 165 kB | 16/55 kB | 7.6/27 kB    Progress (4): 276/625 kB | 165 kB | 19/55 kB | 7.6/27 kBProgress (4): 276/625 kB | 165 kB | 21/55 kB | 7.6/27 kBProgress (4): 276/625 kB | 165 kB | 24/55 kB | 7.6/27 kBProgress (4): 280/625 kB | 165 kB | 24/55 kB | 7.6/27 kBProgress (4): 280/625 kB | 165 kB | 24/55 kB | 12/27 kB Progress (4): 280/625 kB | 165 kB | 24/55 kB | 16/27 kBProgress (4): 280/625 kB | 165 kB | 24/55 kB | 20/27 kBProgress (4): 280/625 kB | 165 kB | 24/55 kB | 24/27 kBProgress (4): 280/625 kB | 165 kB | 24/55 kB | 27 kB   Progress (4): 284/625 kB | 165 kB | 24/55 kB | 27 kBProgress (4): 284/625 kB | 165 kB | 27/55 kB | 27 kBProgress (4): 284/625 kB | 165 kB | 30/55 kB | 27 kBProgress (4): 288/625 kB | 165 kB | 30/55 kB | 27 kBProgress (4): 292/625 kB | 165 kB | 30/55 kB | 27 kBProgress (4): 296/625 kB | 165 kB | 30/55 kB | 27 kBProgress (4): 301/625 kB | 165 kB | 30/55 kB | 27 kBProgress (4): 301/625 kB | 165 kB | 32/55 kB | 27 kBProgress (4): 305/625 kB | 165 kB | 32/55 kB | 27 kBProgress (4): 309/625 kB | 165 kB | 32/55 kB | 27 kBProgress (4): 313/625 kB | 165 kB | 32/55 kB | 27 kBProgress (4): 317/625 kB | 165 kB | 32/55 kB | 27 kBProgress (4): 317/625 kB | 165 kB | 36/55 kB | 27 kBProgress (4): 317/625 kB | 165 kB | 40/55 kB | 27 kBProgress (4): 317/625 kB | 165 kB | 44/55 kB | 27 kBProgress (4): 321/625 kB | 165 kB | 44/55 kB | 27 kBProgress (4): 321/625 kB | 165 kB | 49/55 kB | 27 kBProgress (4): 325/625 kB | 165 kB | 49/55 kB | 27 kBProgress (4): 329/625 kB | 165 kB | 49/55 kB | 27 kBProgress (4): 333/625 kB | 165 kB | 49/55 kB | 27 kBProgress (4): 333/625 kB | 165 kB | 53/55 kB | 27 kBProgress (4): 333/625 kB | 165 kB | 55 kB | 27 kB   Progress (4): 337/625 kB | 165 kB | 55 kB | 27 kBProgress (4): 342/625 kB | 165 kB | 55 kB | 27 kBProgress (4): 346/625 kB | 165 kB | 55 kB | 27 kBProgress (4): 350/625 kB | 165 kB | 55 kB | 27 kBProgress (5): 350/625 kB | 165 kB | 55 kB | 27 kB | 4.1/48 kBProgress (5): 354/625 kB | 165 kB | 55 kB | 27 kB | 4.1/48 kBProgress (5): 354/625 kB | 165 kB | 55 kB | 27 kB | 7.6/48 kBProgress (5): 358/625 kB | 165 kB | 55 kB | 27 kB | 7.6/48 kBProgress (5): 358/625 kB | 165 kB | 55 kB | 27 kB | 12/48 kB Progress (5): 362/625 kB | 165 kB | 55 kB | 27 kB | 12/48 kBProgress (5): 362/625 kB | 165 kB | 55 kB | 27 kB | 16/48 kBProgress (5): 366/625 kB | 165 kB | 55 kB | 27 kB | 16/48 kBProgress (5): 370/625 kB | 165 kB | 55 kB | 27 kB | 16/48 kBProgress (5): 374/625 kB | 165 kB | 55 kB | 27 kB | 16/48 kBProgress (5): 378/625 kB | 165 kB | 55 kB | 27 kB | 16/48 kBProgress (5): 382/625 kB | 165 kB | 55 kB | 27 kB | 16/48 kBProgress (5): 382/625 kB | 165 kB | 55 kB | 27 kB | 20/48 kBProgress (5): 382/625 kB | 165 kB | 55 kB | 27 kB | 24/48 kBProgress (5): 387/625 kB | 165 kB | 55 kB | 27 kB | 24/48 kBProgress (5): 387/625 kB | 165 kB | 55 kB | 27 kB | 28/48 kBProgress (5): 391/625 kB | 165 kB | 55 kB | 27 kB | 28/48 kBProgress (5): 391/625 kB | 165 kB | 55 kB | 27 kB | 32/48 kBProgress (5): 395/625 kB | 165 kB | 55 kB | 27 kB | 32/48 kBProgress (5): 399/625 kB | 165 kB | 55 kB | 27 kB | 32/48 kBProgress (5): 403/625 kB | 165 kB | 55 kB | 27 kB | 32/48 kBProgress (5): 407/625 kB | 165 kB | 55 kB | 27 kB | 32/48 kB                                                            Downloaded from central: https://repo.maven.apache.org/maven2/org/apache/maven/maven-model/3.5.0/maven-model-3.5.0.jar (165 kB at 2.3 MB/s)
Progress (4): 411/625 kB | 55 kB | 27 kB | 32/48 kB                                                   Downloading from central: https://repo.maven.apache.org/maven2/org/apache/maven/maven-model-builder/3.5.0/maven-model-builder-3.5.0.jar
Progress (4): 411/625 kB | 55 kB | 27 kB | 36/48 kBProgress (4): 411/625 kB | 55 kB | 27 kB | 40/48 kBProgress (4): 411/625 kB | 55 kB | 27 kB | 44/48 kBProgress (4): 411/625 kB | 55 kB | 27 kB | 48 kB                                                   Downloaded from central: https://repo.maven.apache.org/maven2/org/apache/maven/maven-repository-metadata/3.5.0/maven-repository-metadata-3.5.0.jar (27 kB at 382 kB/s)
Downloading from central: https://repo.maven.apache.org/maven2/org/apache/maven/maven-resolver-provider/3.5.0/maven-resolver-provider-3.5.0.jar
Progress (3): 415/625 kB | 55 kB | 48 kBProgress (3): 419/625 kB | 55 kB | 48 kBProgress (3): 423/625 kB | 55 kB | 48 kBProgress (3): 428/625 kB | 55 kB | 48 kBProgress (3): 432/625 kB | 55 kB | 48 kBProgress (3): 436/625 kB | 55 kB | 48 kBProgress (3): 440/625 kB | 55 kB | 48 kBProgress (3): 444/625 kB | 55 kB | 48 kBProgress (3): 448/625 kB | 55 kB | 48 kBProgress (3): 452/625 kB | 55 kB | 48 kBProgress (3): 456/625 kB | 55 kB | 48 kBProgress (3): 460/625 kB | 55 kB | 48 kBProgress (3): 464/625 kB | 55 kB | 48 kBProgress (3): 468/625 kB | 55 kB | 48 kBProgress (3): 473/625 kB | 55 kB | 48 kBProgress (3): 477/625 kB | 55 kB | 48 kBProgress (3): 481/625 kB | 55 kB | 48 kBProgress (3): 485/625 kB | 55 kB | 48 kBProgress (3): 489/625 kB | 55 kB | 48 kBProgress (3): 493/625 kB | 55 kB | 48 kBProgress (3): 497/625 kB | 55 kB | 48 kBProgress (3): 501/625 kB | 55 kB | 48 kBProgress (3): 505/625 kB | 55 kB | 48 kBProgress (3): 509/625 kB | 55 kB | 48 kBProgress (3): 514/625 kB | 55 kB | 48 kBProgress (3): 518/625 kB | 55 kB | 48 kBProgress (3): 522/625 kB | 55 kB | 48 kBProgress (3): 526/625 kB | 55 kB | 48 kBProgress (3): 530/625 kB | 55 kB | 48 kBProgress (3): 534/625 kB | 55 kB | 48 kBProgress (3): 538/625 kB | 55 kB | 48 kBProgress (3): 542/625 kB | 55 kB | 48 kBProgress (3): 546/625 kB | 55 kB | 48 kBProgress (3): 550/625 kB | 55 kB | 48 kBProgress (3): 555/625 kB | 55 kB | 48 kBProgress (3): 559/625 kB | 55 kB | 48 kB                                        Downloaded from central: https://repo.maven.apache.org/maven2/org/apache/maven/maven-artifact/3.5.0/maven-artifact-3.5.0.jar (55 kB at 696 kB/s)
Progress (2): 563/625 kB | 48 kB                                Downloading from central: https://repo.maven.apache.org/maven2/org/apache/maven/resolver/maven-resolver-impl/1.0.3/maven-resolver-impl-1.0.3.jar
Progress (2): 567/625 kB | 48 kBProgress (2): 571/625 kB | 48 kBProgress (2): 575/625 kB | 48 kBProgress (2): 579/625 kB | 48 kBProgress (2): 583/625 kB | 48 kBProgress (2): 587/625 kB | 48 kBProgress (2): 591/625 kB | 48 kBProgress (2): 595/625 kB | 48 kBProgress (2): 600/625 kB | 48 kBProgress (2): 604/625 kB | 48 kBProgress (2): 608/625 kB | 48 kBProgress (2): 612/625 kB | 48 kBProgress (2): 616/625 kB | 48 kBProgress (2): 620/625 kB | 48 kBProgress (2): 624/625 kB | 48 kBProgress (2): 625 kB | 48 kB                                Downloaded from central: https://repo.maven.apache.org/maven2/org/apache/maven/maven-plugin-api/3.5.0/maven-plugin-api-3.5.0.jar (48 kB at 576 kB/s)
Downloading from central: https://repo.maven.apache.org/maven2/org/apache/maven/resolver/maven-resolver-spi/1.0.3/maven-resolver-spi-1.0.3.jar
Progress (2): 625 kB | 3.3/68 kBProgress (2): 625 kB | 6.1/68 kBProgress (2): 625 kB | 7.4/68 kBProgress (2): 625 kB | 10/68 kB Progress (2): 625 kB | 12/68 kBProgress (2): 625 kB | 14/68 kBProgress (3): 625 kB | 14/68 kB | 4.1/179 kBProgress (3): 625 kB | 16/68 kB | 4.1/179 kBProgress (3): 625 kB | 16/68 kB | 7.6/179 kBProgress (3): 625 kB | 16/68 kB | 12/179 kB Progress (3): 625 kB | 16/68 kB | 16/179 kBProgress (3): 625 kB | 18/68 kB | 16/179 kBProgress (3): 625 kB | 20/68 kB | 16/179 kBProgress (3): 625 kB | 22/68 kB | 16/179 kBProgress (3): 625 kB | 22/68 kB | 20/179 kBProgress (3): 625 kB | 22/68 kB | 24/179 kBProgress (3): 625 kB | 22/68 kB | 28/179 kBProgress (3): 625 kB | 22/68 kB | 32/179 kBProgress (3): 625 kB | 24/68 kB | 32/179 kBProgress (3): 625 kB | 27/68 kB | 32/179 kBProgress (3): 625 kB | 28/68 kB | 32/179 kBProgress (3): 625 kB | 31/68 kB | 32/179 kBProgress (3): 625 kB | 32/68 kB | 32/179 kBProgress (3): 625 kB | 35/68 kB | 32/179 kBProgress (3): 625 kB | 36/68 kB | 32/179 kBProgress (3): 625 kB | 39/68 kB | 32/179 kBProgress (3): 625 kB | 39/68 kB | 36/179 kBProgress (3): 625 kB | 39/68 kB | 40/179 kBProgress (3): 625 kB | 40/68 kB | 40/179 kBProgress (3): 625 kB | 40/68 kB | 44/179 kBProgress (3): 625 kB | 40/68 kB | 49/179 kBProgress (3): 625 kB | 43/68 kB | 49/179 kBProgress (3): 625 kB | 44/68 kB | 49/179 kBProgress (3): 625 kB | 47/68 kB | 49/179 kBProgress (3): 625 kB | 48/68 kB | 49/179 kBProgress (3): 625 kB | 51/68 kB | 49/179 kBProgress (3): 625 kB | 52/68 kB | 49/179 kBProgress (3): 625 kB | 55/68 kB | 49/179 kB                                           Downloaded from central: https://repo.maven.apache.org/maven2/org/apache/maven/maven-core/3.5.0/maven-core-3.5.0.jar (625 kB at 6.3 MB/s)
Downloading from central: https://repo.maven.apache.org/maven2/org/apache/maven/resolver/maven-resolver-util/1.0.3/maven-resolver-util-1.0.3.jar
Progress (2): 55/68 kB | 53/179 kBProgress (2): 55/68 kB | 57/179 kBProgress (2): 55/68 kB | 61/179 kBProgress (2): 55/68 kB | 65/179 kBProgress (3): 55/68 kB | 65/179 kB | 4.1/36 kBProgress (3): 55/68 kB | 65/179 kB | 7.6/36 kBProgress (3): 55/68 kB | 65/179 kB | 12/36 kB Progress (3): 55/68 kB | 65/179 kB | 16/36 kBProgress (3): 55/68 kB | 65/179 kB | 20/36 kBProgress (3): 55/68 kB | 65/179 kB | 24/36 kBProgress (3): 55/68 kB | 65/179 kB | 28/36 kBProgress (4): 55/68 kB | 65/179 kB | 28/36 kB | 4.1/184 kBProgress (4): 55/68 kB | 65/179 kB | 32/36 kB | 4.1/184 kBProgress (4): 55/68 kB | 65/179 kB | 32/36 kB | 7.6/184 kBProgress (4): 55/68 kB | 65/179 kB | 32/36 kB | 12/184 kB Progress (4): 55/68 kB | 65/179 kB | 36 kB | 12/184 kB   Progress (4): 55/68 kB | 65/179 kB | 36 kB | 16/184 kBProgress (4): 55/68 kB | 69/179 kB | 36 kB | 16/184 kBProgress (4): 55/68 kB | 73/179 kB | 36 kB | 16/184 kBProgress (4): 55/68 kB | 77/179 kB | 36 kB | 16/184 kBProgress (4): 55/68 kB | 81/179 kB | 36 kB | 16/184 kBProgress (4): 57/68 kB | 81/179 kB | 36 kB | 16/184 kBProgress (4): 59/68 kB | 81/179 kB | 36 kB | 16/184 kBProgress (4): 59/68 kB | 81/179 kB | 36 kB | 20/184 kBProgress (4): 59/68 kB | 81/179 kB | 36 kB | 24/184 kBProgress (4): 61/68 kB | 81/179 kB | 36 kB | 24/184 kBProgress (4): 61/68 kB | 81/179 kB | 36 kB | 28/184 kBProgress (4): 61/68 kB | 81/179 kB | 36 kB | 32/184 kBProgress (4): 63/68 kB | 81/179 kB | 36 kB | 32/184 kBProgress (4): 66/68 kB | 81/179 kB | 36 kB | 32/184 kBProgress (4): 66/68 kB | 81/179 kB | 36 kB | 36/184 kBProgress (4): 68 kB | 81/179 kB | 36 kB | 36/184 kB   Progress (4): 68 kB | 85/179 kB | 36 kB | 36/184 kBProgress (4): 68 kB | 89/179 kB | 36 kB | 36/184 kBProgress (4): 68 kB | 94/179 kB | 36 kB | 36/184 kBProgress (4): 68 kB | 98/179 kB | 36 kB | 36/184 kBProgress (4): 68 kB | 102/179 kB | 36 kB | 36/184 kBProgress (4): 68 kB | 106/179 kB | 36 kB | 36/184 kBProgress (4): 68 kB | 110/179 kB | 36 kB | 36/184 kBProgress (4): 68 kB | 114/179 kB | 36 kB | 36/184 kBProgress (4): 68 kB | 114/179 kB | 36 kB | 40/184 kBProgress (4): 68 kB | 114/179 kB | 36 kB | 44/184 kBProgress (4): 68 kB | 114/179 kB | 36 kB | 49/184 kBProgress (4): 68 kB | 114/179 kB | 36 kB | 53/184 kBProgress (4): 68 kB | 114/179 kB | 36 kB | 57/184 kBProgress (4): 68 kB | 114/179 kB | 36 kB | 61/184 kBProgress (4): 68 kB | 114/179 kB | 36 kB | 65/184 kBProgress (4): 68 kB | 114/179 kB | 36 kB | 69/184 kBProgress (4): 68 kB | 114/179 kB | 36 kB | 73/184 kBProgress (4): 68 kB | 114/179 kB | 36 kB | 77/184 kBProgress (4): 68 kB | 114/179 kB | 36 kB | 81/184 kBProgress (4): 68 kB | 118/179 kB | 36 kB | 81/184 kBProgress (4): 68 kB | 122/179 kB | 36 kB | 81/184 kBProgress (4): 68 kB | 126/179 kB | 36 kB | 81/184 kBProgress (4): 68 kB | 130/179 kB | 36 kB | 81/184 kBProgress (4): 68 kB | 130/179 kB | 36 kB | 85/184 kBProgress (4): 68 kB | 130/179 kB | 36 kB | 89/184 kBProgress (4): 68 kB | 130/179 kB | 36 kB | 94/184 kBProgress (4): 68 kB | 130/179 kB | 36 kB | 98/184 kBProgress (4): 68 kB | 135/179 kB | 36 kB | 98/184 kBProgress (4): 68 kB | 139/179 kB | 36 kB | 98/184 kBProgress (4): 68 kB | 143/179 kB | 36 kB | 98/184 kBProgress (4): 68 kB | 147/179 kB | 36 kB | 98/184 kBProgress (4): 68 kB | 147/179 kB | 36 kB | 102/184 kBProgress (4): 68 kB | 147/179 kB | 36 kB | 106/184 kBProgress (4): 68 kB | 147/179 kB | 36 kB | 110/184 kBProgress (4): 68 kB | 147/179 kB | 36 kB | 114/184 kB                                                     Downloaded from central: https://repo.maven.apache.org/maven2/org/apache/maven/resolver/maven-resolver-spi/1.0.3/maven-resolver-spi-1.0.3.jar (36 kB at 321 kB/s)
Downloading from central: https://repo.maven.apache.org/maven2/org/eclipse/sisu/org.eclipse.sisu.plexus/0.3.3/org.eclipse.sisu.plexus-0.3.3.jar
Progress (3): 68 kB | 151/179 kB | 114/184 kBProgress (3): 68 kB | 155/179 kB | 114/184 kBProgress (3): 68 kB | 159/179 kB | 114/184 kBProgress (3): 68 kB | 163/179 kB | 114/184 kBProgress (3): 68 kB | 163/179 kB | 118/184 kBProgress (3): 68 kB | 163/179 kB | 122/184 kBProgress (3): 68 kB | 163/179 kB | 126/184 kBProgress (3): 68 kB | 163/179 kB | 130/184 kBProgress (3): 68 kB | 167/179 kB | 130/184 kBProgress (3): 68 kB | 171/179 kB | 130/184 kBProgress (3): 68 kB | 175/179 kB | 130/184 kBProgress (3): 68 kB | 179 kB | 130/184 kB    Progress (3): 68 kB | 179 kB | 135/184 kBProgress (3): 68 kB | 179 kB | 139/184 kBProgress (3): 68 kB | 179 kB | 143/184 kBProgress (3): 68 kB | 179 kB | 147/184 kBProgress (3): 68 kB | 179 kB | 151/184 kBProgress (3): 68 kB | 179 kB | 155/184 kBProgress (3): 68 kB | 179 kB | 159/184 kB                                         Downloaded from central: https://repo.maven.apache.org/maven2/org/apache/maven/maven-resolver-provider/3.5.0/maven-resolver-provider-3.5.0.jar (68 kB at 584 kB/s)
Progress (2): 179 kB | 163/184 kBProgress (3): 179 kB | 163/184 kB | 2.1/159 kBProgress (3): 179 kB | 163/184 kB | 4.9/159 kB                                              Downloading from central: https://repo.maven.apache.org/maven2/org/eclipse/sisu/org.eclipse.sisu.inject/0.3.3/org.eclipse.sisu.inject-0.3.3.jar
Progress (3): 179 kB | 163/184 kB | 7.7/159 kBProgress (3): 179 kB | 163/184 kB | 10/159 kB Progress (3): 179 kB | 163/184 kB | 13/159 kBProgress (3): 179 kB | 163/184 kB | 16/159 kBProgress (3): 179 kB | 163/184 kB | 19/159 kBProgress (3): 179 kB | 163/184 kB | 21/159 kBProgress (3): 179 kB | 163/184 kB | 24/159 kBProgress (3): 179 kB | 163/184 kB | 27/159 kBProgress (3): 179 kB | 163/184 kB | 30/159 kBProgress (3): 179 kB | 163/184 kB | 32/159 kBProgress (3): 179 kB | 167/184 kB | 32/159 kBProgress (3): 179 kB | 171/184 kB | 32/159 kBProgress (3): 179 kB | 176/184 kB | 32/159 kBProgress (3): 179 kB | 180/184 kB | 32/159 kBProgress (3): 179 kB | 184/184 kB | 32/159 kBProgress (3): 179 kB | 184 kB | 32/159 kB    Progress (3): 179 kB | 184 kB | 36/159 kBProgress (3): 179 kB | 184 kB | 40/159 kBProgress (3): 179 kB | 184 kB | 44/159 kBProgress (3): 179 kB | 184 kB | 49/159 kBProgress (4): 179 kB | 184 kB | 49/159 kB | 4.1/205 kBProgress (4): 179 kB | 184 kB | 49/159 kB | 7.6/205 kBProgress (4): 179 kB | 184 kB | 49/159 kB | 12/205 kB Progress (4): 179 kB | 184 kB | 49/159 kB | 16/205 kBProgress (4): 179 kB | 184 kB | 49/159 kB | 20/205 kBProgress (4): 179 kB | 184 kB | 49/159 kB | 24/205 kBProgress (4): 179 kB | 184 kB | 49/159 kB | 28/205 kBProgress (4): 179 kB | 184 kB | 49/159 kB | 32/205 kB                                                     Downloaded from central: https://repo.maven.apache.org/maven2/org/apache/maven/maven-model-builder/3.5.0/maven-model-builder-3.5.0.jar (179 kB at 1.4 MB/s)
Downloading from central: https://repo.maven.apache.org/maven2/org/codehaus/plexus/plexus-component-annotations/1.7.1/plexus-component-annotations-1.7.1.jar
Progress (3): 184 kB | 49/159 kB | 36/205 kBProgress (3): 184 kB | 49/159 kB | 40/205 kBProgress (3): 184 kB | 49/159 kB | 44/205 kBProgress (3): 184 kB | 49/159 kB | 49/205 kBProgress (3): 184 kB | 49/159 kB | 53/205 kBProgress (3): 184 kB | 49/159 kB | 57/205 kBProgress (3): 184 kB | 49/159 kB | 61/205 kBProgress (3): 184 kB | 49/159 kB | 65/205 kBProgress (3): 184 kB | 49/159 kB | 69/205 kBProgress (3): 184 kB | 49/159 kB | 73/205 kBProgress (3): 184 kB | 49/159 kB | 77/205 kBProgress (3): 184 kB | 49/159 kB | 81/205 kBProgress (3): 184 kB | 49/159 kB | 85/205 kBProgress (3): 184 kB | 49/159 kB | 89/205 kBProgress (3): 184 kB | 49/159 kB | 94/205 kBProgress (3): 184 kB | 49/159 kB | 98/205 kBProgress (3): 184 kB | 49/159 kB | 102/205 kBProgress (3): 184 kB | 49/159 kB | 106/205 kBProgress (3): 184 kB | 49/159 kB | 110/205 kBProgress (3): 184 kB | 49/159 kB | 114/205 kBProgress (3): 184 kB | 53/159 kB | 114/205 kBProgress (3): 184 kB | 57/159 kB | 114/205 kBProgress (3): 184 kB | 61/159 kB | 114/205 kBProgress (3): 184 kB | 65/159 kB | 114/205 kBProgress (3): 184 kB | 69/159 kB | 114/205 kBProgress (3): 184 kB | 73/159 kB | 114/205 kBProgress (4): 184 kB | 73/159 kB | 114/205 kB | 2.1/379 kB                                                          Downloaded from central: https://repo.maven.apache.org/maven2/org/apache/maven/resolver/maven-resolver-impl/1.0.3/maven-resolver-impl-1.0.3.jar (184 kB at 1.3 MB/s)
Downloading from central: https://repo.maven.apache.org/maven2/org/apache/maven/resolver/maven-resolver-api/1.0.3/maven-resolver-api-1.0.3.jar
Progress (3): 73/159 kB | 114/205 kB | 4.9/379 kBProgress (3): 73/159 kB | 114/205 kB | 7.6/379 kBProgress (3): 73/159 kB | 114/205 kB | 10/379 kB Progress (3): 73/159 kB | 114/205 kB | 13/379 kBProgress (3): 73/159 kB | 114/205 kB | 16/379 kBProgress (3): 73/159 kB | 114/205 kB | 19/379 kBProgress (3): 73/159 kB | 114/205 kB | 21/379 kBProgress (3): 73/159 kB | 114/205 kB | 24/379 kBProgress (3): 73/159 kB | 114/205 kB | 27/379 kBProgress (3): 73/159 kB | 114/205 kB | 30/379 kBProgress (3): 73/159 kB | 114/205 kB | 32/379 kBProgress (3): 77/159 kB | 114/205 kB | 32/379 kBProgress (3): 81/159 kB | 114/205 kB | 32/379 kBProgress (3): 85/159 kB | 114/205 kB | 32/379 kBProgress (3): 89/159 kB | 114/205 kB | 32/379 kBProgress (3): 94/159 kB | 114/205 kB | 32/379 kBProgress (3): 98/159 kB | 114/205 kB | 32/379 kBProgress (3): 98/159 kB | 118/205 kB | 32/379 kBProgress (3): 98/159 kB | 122/205 kB | 32/379 kBProgress (3): 98/159 kB | 126/205 kB | 32/379 kBProgress (3): 98/159 kB | 130/205 kB | 32/379 kBProgress (3): 102/159 kB | 130/205 kB | 32/379 kBProgress (3): 106/159 kB | 130/205 kB | 32/379 kBProgress (3): 110/159 kB | 130/205 kB | 32/379 kBProgress (3): 114/159 kB | 130/205 kB | 32/379 kBProgress (4): 114/159 kB | 130/205 kB | 32/379 kB | 4.1/4.3 kBProgress (4): 114/159 kB | 130/205 kB | 32/379 kB | 4.3 kB    Progress (4): 114/159 kB | 130/205 kB | 36/379 kB | 4.3 kBProgress (4): 114/159 kB | 130/205 kB | 40/379 kB | 4.3 kBProgress (4): 114/159 kB | 130/205 kB | 44/379 kB | 4.3 kBProgress (4): 114/159 kB | 130/205 kB | 49/379 kB | 4.3 kBProgress (4): 114/159 kB | 130/205 kB | 53/379 kB | 4.3 kBProgress (4): 114/159 kB | 130/205 kB | 57/379 kB | 4.3 kBProgress (4): 114/159 kB | 130/205 kB | 61/379 kB | 4.3 kBProgress (4): 114/159 kB | 130/205 kB | 65/379 kB | 4.3 kBProgress (4): 114/159 kB | 130/205 kB | 69/379 kB | 4.3 kBProgress (4): 114/159 kB | 130/205 kB | 73/379 kB | 4.3 kBProgress (4): 114/159 kB | 130/205 kB | 77/379 kB | 4.3 kBProgress (4): 114/159 kB | 130/205 kB | 81/379 kB | 4.3 kBProgress (4): 114/159 kB | 130/205 kB | 85/379 kB | 4.3 kBProgress (4): 114/159 kB | 130/205 kB | 89/379 kB | 4.3 kBProgress (4): 114/159 kB | 130/205 kB | 94/379 kB | 4.3 kBProgress (4): 114/159 kB | 130/205 kB | 98/379 kB | 4.3 kBProgress (4): 114/159 kB | 130/205 kB | 102/379 kB | 4.3 kBProgress (4): 114/159 kB | 130/205 kB | 106/379 kB | 4.3 kBProgress (4): 114/159 kB | 130/205 kB | 110/379 kB | 4.3 kBProgress (4): 114/159 kB | 130/205 kB | 114/379 kB | 4.3 kBProgress (4): 114/159 kB | 130/205 kB | 118/379 kB | 4.3 kBProgress (4): 114/159 kB | 130/205 kB | 122/379 kB | 4.3 kBProgress (4): 114/159 kB | 130/205 kB | 126/379 kB | 4.3 kBProgress (4): 114/159 kB | 130/205 kB | 130/379 kB | 4.3 kBProgress (5): 114/159 kB | 130/205 kB | 130/379 kB | 4.3 kB | 4.1/146 kBProgress (5): 114/159 kB | 130/205 kB | 130/379 kB | 4.3 kB | 7.6/146 kBProgress (5): 114/159 kB | 130/205 kB | 130/379 kB | 4.3 kB | 12/146 kB Progress (5): 114/159 kB | 130/205 kB | 130/379 kB | 4.3 kB | 16/146 kBProgress (5): 114/159 kB | 130/205 kB | 130/379 kB | 4.3 kB | 20/146 kBProgress (5): 114/159 kB | 130/205 kB | 130/379 kB | 4.3 kB | 24/146 kBProgress (5): 114/159 kB | 130/205 kB | 130/379 kB | 4.3 kB | 28/146 kBProgress (5): 114/159 kB | 130/205 kB | 130/379 kB | 4.3 kB | 32/146 kBProgress (5): 114/159 kB | 130/205 kB | 130/379 kB | 4.3 kB | 36/146 kBProgress (5): 114/159 kB | 130/205 kB | 130/379 kB | 4.3 kB | 40/146 kBProgress (5): 114/159 kB | 130/205 kB | 130/379 kB | 4.3 kB | 44/146 kBProgress (5): 114/159 kB | 130/205 kB | 130/379 kB | 4.3 kB | 49/146 kBProgress (5): 114/159 kB | 135/205 kB | 130/379 kB | 4.3 kB | 49/146 kB                                                                       Downloaded from central: https://repo.maven.apache.org/maven2/org/codehaus/plexus/plexus-component-annotations/1.7.1/plexus-component-annotations-1.7.1.jar (4.3 kB at 27 kB/s)
Downloading from central: https://repo.maven.apache.org/maven2/org/apache/maven/resolver/maven-resolver-connector-basic/1.0.3/maven-resolver-connector-basic-1.0.3.jar
Progress (4): 114/159 kB | 135/205 kB | 135/379 kB | 49/146 kBProgress (4): 114/159 kB | 135/205 kB | 139/379 kB | 49/146 kBProgress (4): 114/159 kB | 135/205 kB | 143/379 kB | 49/146 kBProgress (4): 114/159 kB | 135/205 kB | 147/379 kB | 49/146 kBProgress (4): 114/159 kB | 135/205 kB | 151/379 kB | 49/146 kBProgress (4): 114/159 kB | 135/205 kB | 155/379 kB | 49/146 kBProgress (4): 114/159 kB | 135/205 kB | 159/379 kB | 49/146 kBProgress (4): 114/159 kB | 135/205 kB | 159/379 kB | 53/146 kBProgress (4): 118/159 kB | 135/205 kB | 159/379 kB | 53/146 kBProgress (4): 122/159 kB | 135/205 kB | 159/379 kB | 53/146 kBProgress (4): 126/159 kB | 135/205 kB | 159/379 kB | 53/146 kBProgress (4): 130/159 kB | 135/205 kB | 159/379 kB | 53/146 kBProgress (4): 130/159 kB | 135/205 kB | 159/379 kB | 57/146 kBProgress (4): 130/159 kB | 135/205 kB | 159/379 kB | 61/146 kBProgress (4): 130/159 kB | 135/205 kB | 159/379 kB | 65/146 kBProgress (4): 135/159 kB | 135/205 kB | 159/379 kB | 65/146 kBProgress (4): 139/159 kB | 135/205 kB | 159/379 kB | 65/146 kBProgress (4): 143/159 kB | 135/205 kB | 159/379 kB | 65/146 kBProgress (4): 147/159 kB | 135/205 kB | 159/379 kB | 65/146 kBProgress (4): 147/159 kB | 135/205 kB | 159/379 kB | 69/146 kBProgress (4): 147/159 kB | 135/205 kB | 163/379 kB | 69/146 kBProgress (4): 147/159 kB | 139/205 kB | 163/379 kB | 69/146 kBProgress (4): 147/159 kB | 143/205 kB | 163/379 kB | 69/146 kBProgress (4): 147/159 kB | 143/205 kB | 163/379 kB | 73/146 kBProgress (4): 147/159 kB | 143/205 kB | 163/379 kB | 77/146 kBProgress (4): 147/159 kB | 143/205 kB | 163/379 kB | 81/146 kBProgress (4): 151/159 kB | 143/205 kB | 163/379 kB | 81/146 kBProgress (4): 155/159 kB | 143/205 kB | 163/379 kB | 81/146 kBProgress (4): 159 kB | 143/205 kB | 163/379 kB | 81/146 kB    Progress (4): 159 kB | 143/205 kB | 163/379 kB | 85/146 kBProgress (4): 159 kB | 143/205 kB | 163/379 kB | 89/146 kBProgress (4): 159 kB | 143/205 kB | 167/379 kB | 89/146 kBProgress (4): 159 kB | 147/205 kB | 167/379 kB | 89/146 kBProgress (4): 159 kB | 147/205 kB | 171/379 kB | 89/146 kBProgress (4): 159 kB | 147/205 kB | 176/379 kB | 89/146 kBProgress (4): 159 kB | 147/205 kB | 180/379 kB | 89/146 kBProgress (4): 159 kB | 147/205 kB | 180/379 kB | 94/146 kBProgress (4): 159 kB | 151/205 kB | 180/379 kB | 94/146 kBProgress (4): 159 kB | 151/205 kB | 180/379 kB | 98/146 kBProgress (4): 159 kB | 155/205 kB | 180/379 kB | 98/146 kBProgress (4): 159 kB | 155/205 kB | 184/379 kB | 98/146 kBProgress (4): 159 kB | 159/205 kB | 184/379 kB | 98/146 kBProgress (4): 159 kB | 159/205 kB | 188/379 kB | 98/146 kBProgress (4): 159 kB | 163/205 kB | 188/379 kB | 98/146 kBProgress (4): 159 kB | 163/205 kB | 192/379 kB | 98/146 kBProgress (4): 159 kB | 163/205 kB | 196/379 kB | 98/146 kBProgress (4): 159 kB | 167/205 kB | 196/379 kB | 98/146 kBProgress (4): 159 kB | 171/205 kB | 196/379 kB | 98/146 kBProgress (4): 159 kB | 171/205 kB | 196/379 kB | 102/146 kBProgress (4): 159 kB | 176/205 kB | 196/379 kB | 102/146 kBProgress (4): 159 kB | 176/205 kB | 196/379 kB | 106/146 kBProgress (4): 159 kB | 176/205 kB | 196/379 kB | 110/146 kBProgress (4): 159 kB | 176/205 kB | 196/379 kB | 114/146 kBProgress (4): 159 kB | 176/205 kB | 196/379 kB | 118/146 kBProgress (4): 159 kB | 176/205 kB | 196/379 kB | 122/146 kBProgress (4): 159 kB | 176/205 kB | 196/379 kB | 126/146 kBProgress (4): 159 kB | 176/205 kB | 196/379 kB | 130/146 kBProgress (4): 159 kB | 176/205 kB | 196/379 kB | 135/146 kBProgress (4): 159 kB | 176/205 kB | 196/379 kB | 139/146 kBProgress (4): 159 kB | 176/205 kB | 196/379 kB | 143/146 kBProgress (4): 159 kB | 176/205 kB | 196/379 kB | 146 kB    Progress (4): 159 kB | 176/205 kB | 200/379 kB | 146 kBProgress (4): 159 kB | 180/205 kB | 200/379 kB | 146 kBProgress (4): 159 kB | 180/205 kB | 204/379 kB | 146 kBProgress (4): 159 kB | 180/205 kB | 208/379 kB | 146 kBProgress (4): 159 kB | 180/205 kB | 212/379 kB | 146 kBProgress (4): 159 kB | 184/205 kB | 212/379 kB | 146 kBProgress (4): 159 kB | 188/205 kB | 212/379 kB | 146 kBProgress (4): 159 kB | 188/205 kB | 216/379 kB | 146 kBProgress (4): 159 kB | 192/205 kB | 216/379 kB | 146 kBProgress (4): 159 kB | 192/205 kB | 221/379 kB | 146 kBProgress (4): 159 kB | 196/205 kB | 221/379 kB | 146 kBProgress (4): 159 kB | 196/205 kB | 225/379 kB | 146 kBProgress (4): 159 kB | 196/205 kB | 229/379 kB | 146 kBProgress (4): 159 kB | 200/205 kB | 229/379 kB | 146 kBProgress (4): 159 kB | 204/205 kB | 229/379 kB | 146 kBProgress (4): 159 kB | 205 kB | 229/379 kB | 146 kB    Progress (4): 159 kB | 205 kB | 233/379 kB | 146 kBProgress (4): 159 kB | 205 kB | 237/379 kB | 146 kBProgress (5): 159 kB | 205 kB | 237/379 kB | 146 kB | 2.1/42 kBProgress (5): 159 kB | 205 kB | 241/379 kB | 146 kB | 2.1/42 kBProgress (5): 159 kB | 205 kB | 245/379 kB | 146 kB | 2.1/42 kBProgress (5): 159 kB | 205 kB | 245/379 kB | 146 kB | 4.9/42 kBProgress (5): 159 kB | 205 kB | 245/379 kB | 146 kB | 7.7/42 kBProgress (5): 159 kB | 205 kB | 245/379 kB | 146 kB | 10/42 kB Progress (5): 159 kB | 205 kB | 249/379 kB | 146 kB | 10/42 kBProgress (5): 159 kB | 205 kB | 253/379 kB | 146 kB | 10/42 kBProgress (5): 159 kB | 205 kB | 257/379 kB | 146 kB | 10/42 kBProgress (5): 159 kB | 205 kB | 262/379 kB | 146 kB | 10/42 kBProgress (5): 159 kB | 205 kB | 262/379 kB | 146 kB | 13/42 kBProgress (5): 159 kB | 205 kB | 266/379 kB | 146 kB | 13/42 kBProgress (5): 159 kB | 205 kB | 266/379 kB | 146 kB | 16/42 kBProgress (5): 159 kB | 205 kB | 270/379 kB | 146 kB | 16/42 kBProgress (5): 159 kB | 205 kB | 274/379 kB | 146 kB | 16/42 kBProgress (5): 159 kB | 205 kB | 274/379 kB | 146 kB | 19/42 kBProgress (5): 159 kB | 205 kB | 278/379 kB | 146 kB | 19/42 kBProgress (5): 159 kB | 205 kB | 278/379 kB | 146 kB | 21/42 kBProgress (5): 159 kB | 205 kB | 278/379 kB | 146 kB | 24/42 kBProgress (5): 159 kB | 205 kB | 278/379 kB | 146 kB | 27/42 kBProgress (5): 159 kB | 205 kB | 278/379 kB | 146 kB | 30/42 kBProgress (5): 159 kB | 205 kB | 278/379 kB | 146 kB | 32/42 kB                                                              Downloaded from central: https://repo.maven.apache.org/maven2/org/apache/maven/resolver/maven-resolver-util/1.0.3/maven-resolver-util-1.0.3.jar (159 kB at 908 kB/s)
Downloading from central: https://repo.maven.apache.org/maven2/org/apache/maven/resolver/maven-resolver-transport-file/1.0.3/maven-resolver-transport-file-1.0.3.jar
Progress (4): 205 kB | 278/379 kB | 146 kB | 36/42 kBProgress (4): 205 kB | 278/379 kB | 146 kB | 40/42 kBProgress (4): 205 kB | 282/379 kB | 146 kB | 40/42 kBProgress (4): 205 kB | 282/379 kB | 146 kB | 42 kB   Progress (4): 205 kB | 286/379 kB | 146 kB | 42 kBProgress (4): 205 kB | 290/379 kB | 146 kB | 42 kBProgress (4): 205 kB | 294/379 kB | 146 kB | 42 kBProgress (4): 205 kB | 298/379 kB | 146 kB | 42 kBProgress (4): 205 kB | 302/379 kB | 146 kB | 42 kBProgress (4): 205 kB | 307/379 kB | 146 kB | 42 kBProgress (4): 205 kB | 311/379 kB | 146 kB | 42 kBProgress (4): 205 kB | 315/379 kB | 146 kB | 42 kBProgress (4): 205 kB | 319/379 kB | 146 kB | 42 kBProgress (4): 205 kB | 323/379 kB | 146 kB | 42 kBProgress (4): 205 kB | 327/379 kB | 146 kB | 42 kBProgress (4): 205 kB | 331/379 kB | 146 kB | 42 kBProgress (4): 205 kB | 335/379 kB | 146 kB | 42 kBProgress (4): 205 kB | 339/379 kB | 146 kB | 42 kB                                                  Downloaded from central: https://repo.maven.apache.org/maven2/org/apache/maven/resolver/maven-resolver-api/1.0.3/maven-resolver-api-1.0.3.jar (146 kB at 813 kB/s)
Progress (3): 205 kB | 343/379 kB | 42 kB                                         Downloading from central: https://repo.maven.apache.org/maven2/org/apache/maven/resolver/maven-resolver-transport-http/1.0.3/maven-resolver-transport-http-1.0.3.jar
Progress (3): 205 kB | 348/379 kB | 42 kBProgress (3): 205 kB | 352/379 kB | 42 kBProgress (3): 205 kB | 356/379 kB | 42 kBProgress (3): 205 kB | 360/379 kB | 42 kBProgress (3): 205 kB | 364/379 kB | 42 kBProgress (3): 205 kB | 368/379 kB | 42 kBProgress (3): 205 kB | 372/379 kB | 42 kBProgress (3): 205 kB | 376/379 kB | 42 kBProgress (3): 205 kB | 379 kB | 42 kB                                         Downloaded from central: https://repo.maven.apache.org/maven2/org/eclipse/sisu/org.eclipse.sisu.plexus/0.3.3/org.eclipse.sisu.plexus-0.3.3.jar (205 kB at 1.1 MB/s)
Downloading from central: https://repo.maven.apache.org/maven2/org/slf4j/jcl-over-slf4j/1.6.2/jcl-over-slf4j-1.6.2.jar
Downloaded from central: https://repo.maven.apache.org/maven2/org/apache/maven/resolver/maven-resolver-connector-basic/1.0.3/maven-resolver-connector-basic-1.0.3.jar (42 kB at 224 kB/s)
Downloading from central: https://repo.maven.apache.org/maven2/org/hamcrest/hamcrest-integration/1.3/hamcrest-integration-1.3.jar
Progress (2): 379 kB | 4.1/13 kBProgress (2): 379 kB | 7.6/13 kBProgress (2): 379 kB | 12/13 kB Progress (2): 379 kB | 13 kB   Progress (3): 379 kB | 13 kB | 4.1/41 kBProgress (3): 379 kB | 13 kB | 8.2/41 kBProgress (3): 379 kB | 13 kB | 12/41 kB Progress (3): 379 kB | 13 kB | 16/41 kB                                       Downloaded from central: https://repo.maven.apache.org/maven2/org/eclipse/sisu/org.eclipse.sisu.inject/0.3.3/org.eclipse.sisu.inject-0.3.3.jar (379 kB at 2.0 MB/s)
Progress (2): 13 kB | 20/41 kBProgress (2): 13 kB | 25/41 kBProgress (2): 13 kB | 29/41 kBProgress (2): 13 kB | 33/41 kBProgress (2): 13 kB | 37/41 kBProgress (2): 13 kB | 41/41 kBProgress (2): 13 kB | 41 kB   Progress (3): 13 kB | 41 kB | 4.1/17 kBProgress (3): 13 kB | 41 kB | 7.6/17 kBProgress (3): 13 kB | 41 kB | 12/17 kB Progress (3): 13 kB | 41 kB | 16/17 kBProgress (3): 13 kB | 41 kB | 17 kB   Progress (4): 13 kB | 41 kB | 17 kB | 4.1/4.8 kBProgress (4): 13 kB | 41 kB | 17 kB | 4.8 kB                                                Downloaded from central: https://repo.maven.apache.org/maven2/org/apache/maven/resolver/maven-resolver-transport-file/1.0.3/maven-resolver-transport-file-1.0.3.jar (13 kB at 65 kB/s)
Downloaded from central: https://repo.maven.apache.org/maven2/org/apache/maven/resolver/maven-resolver-transport-http/1.0.3/maven-resolver-transport-http-1.0.3.jar (41 kB at 198 kB/s)
Downloaded from central: https://repo.maven.apache.org/maven2/org/slf4j/jcl-over-slf4j/1.6.2/jcl-over-slf4j-1.6.2.jar (17 kB at 82 kB/s)
Downloaded from central: https://repo.maven.apache.org/maven2/org/hamcrest/hamcrest-integration/1.3/hamcrest-integration-1.3.jar (4.8 kB at 23 kB/s)
[INFO] 
[INFO] --- maven-clean-plugin:3.0.0:clean (default-clean) @ qpid-client-systests ---
[INFO] 
[INFO] --- maven-enforcer-plugin:1.4.1:enforce (enforce-minimum-versions) @ qpid-client-systests ---
[INFO] 
[INFO] --- jacoco-maven-plugin:0.7.5.201505241946:prepare-agent (default-prepare-agent) @ qpid-client-systests ---
[INFO] argLine set to "-javaagent:/home/jenkins/.m2/repository/org/jacoco/org.jacoco.agent/0.7.5.201505241946/org.jacoco.agent-0.7.5.201505241946-runtime.jar=destfile=<https://builds.apache.org/job/Qpid-JMS-AMQP-0-x-Broker-J-TestMatrix/jdk=JDK%201.8%20(latest),qpid.amqp.version=0-10/ws/systests/target/jacoco.exec">
[INFO] 
[INFO] --- maven-remote-resources-plugin:1.5:process (process-resource-bundles) @ qpid-client-systests ---
[INFO] 
[INFO] --- maven-resources-plugin:2.7:resources (default-resources) @ qpid-client-systests ---
[INFO] Using 'UTF-8' encoding to copy filtered resources.
[INFO] Copying 1 resource
[INFO] Copying 3 resources
[INFO] 
[INFO] --- maven-compiler-plugin:3.5.1:compile (default-compile) @ qpid-client-systests ---
[INFO] Compiling 22 source files to <https://builds.apache.org/job/Qpid-JMS-AMQP-0-x-Broker-J-TestMatrix/jdk=JDK%201.8%20(latest),qpid.amqp.version=0-10/ws/systests/target/classes>
[WARNING] bootstrap class path not set in conjunction with -source 1.7
[INFO] 
[INFO] --- maven-resources-plugin:2.7:testResources (default-testResources) @ qpid-client-systests ---
[INFO] Using 'UTF-8' encoding to copy filtered resources.
[INFO] Copying 1 resource
[INFO] Copying 3 resources
[INFO] 
[INFO] --- maven-compiler-plugin:3.5.1:testCompile (default-testCompile) @ qpid-client-systests ---
[INFO] Compiling 14 source files to <https://builds.apache.org/job/Qpid-JMS-AMQP-0-x-Broker-J-TestMatrix/jdk=JDK%201.8%20(latest),qpid.amqp.version=0-10/ws/systests/target/test-classes>
[WARNING] bootstrap class path not set in conjunction with -source 1.7
[INFO] <https://builds.apache.org/job/Qpid-JMS-AMQP-0-x-Broker-J-TestMatrix/jdk=JDK%201.8%20(latest),qpid.amqp.version=0-10/ws/systests/src/test/java/org/apache/qpid/systest/destination/AddressBasedDestinationTest.java>: Some input files use unchecked or unsafe operations.
[INFO] <https://builds.apache.org/job/Qpid-JMS-AMQP-0-x-Broker-J-TestMatrix/jdk=JDK%201.8%20(latest),qpid.amqp.version=0-10/ws/systests/src/test/java/org/apache/qpid/systest/destination/AddressBasedDestinationTest.java>: Recompile with -Xlint:unchecked for details.
[INFO] 
[INFO] --- maven-surefire-plugin:2.19.1:test (default-test) @ qpid-client-systests ---
[INFO] Tests are skipped.
[INFO] 
[INFO] --- maven-jar-plugin:3.0.0:jar (default-jar) @ qpid-client-systests ---
[INFO] Building jar: <https://builds.apache.org/job/Qpid-JMS-AMQP-0-x-Broker-J-TestMatrix/jdk=JDK%201.8%20(latest),qpid.amqp.version=0-10/ws/systests/target/qpid-client-systests-6.4.0-SNAPSHOT.jar>
[INFO] 
[INFO] --- maven-site-plugin:3.5.1:attach-descriptor (attach-descriptor) @ qpid-client-systests ---
[INFO] 
[INFO] --- maven-surefire-plugin:2.19.1:test (integration-test) @ qpid-client-systests ---

-------------------------------------------------------
 T E S T S
-------------------------------------------------------
Running org.apache.qpid.systest.producer.ImmediateAndMandatoryPublishingTest
Tests run: 11, Failures: 0, Errors: 0, Skipped: 11, Time elapsed: 26.239 sec - in org.apache.qpid.systest.producer.ImmediateAndMandatoryPublishingTest
Running org.apache.qpid.systest.producer.CloseOnNoRouteForMandatoryMessageTest
Tests run: 4, Failures: 0, Errors: 0, Skipped: 4, Time elapsed: 6.067 sec - in org.apache.qpid.systest.producer.CloseOnNoRouteForMandatoryMessageTest
Running org.apache.qpid.systest.producer.ReturnUnroutableMandatoryMessageTest
Tests run: 3, Failures: 0, Errors: 0, Skipped: 3, Time elapsed: 5.715 sec - in org.apache.qpid.systest.producer.ReturnUnroutableMandatoryMessageTest
Running org.apache.qpid.systest.connection.ExistingSocketTest
Tests run: 2, Failures: 0, Errors: 0, Skipped: 0, Time elapsed: 4.696 sec - in org.apache.qpid.systest.connection.ExistingSocketTest
Running org.apache.qpid.systest.connection.ConnectionTest
Tests run: 7, Failures: 2, Errors: 4, Skipped: 0, Time elapsed: 187.838 sec <<< FAILURE! - in org.apache.qpid.systest.connection.ConnectionTest
testDefaultExchanges(org.apache.qpid.systest.connection.ConnectionTest)  Time elapsed: 30.035 sec  <<< ERROR!
org.apache.qpid.AMQConnectionFailureException: connect timed out
	at org.apache.qpid.systest.connection.ConnectionTest.testDefaultExchanges(ConnectionTest.java:83)
Caused by: org.apache.qpid.transport.TransportException: Error connecting to broker
	at org.apache.qpid.systest.connection.ConnectionTest.testDefaultExchanges(ConnectionTest.java:83)
Caused by: java.net.SocketTimeoutException: connect timed out
	at org.apache.qpid.systest.connection.ConnectionTest.testDefaultExchanges(ConnectionTest.java:83)

testExceptionWhenUserPassIsRequired(org.apache.qpid.systest.connection.ConnectionTest)  Time elapsed: 30.016 sec  <<< FAILURE!
java.lang.AssertionError: Incorrect Exception thrown! The exception thrown is : connect timed out
	at org.apache.qpid.systest.connection.ConnectionTest.testExceptionWhenUserPassIsRequired(ConnectionTest.java:304)

testClientIDVerificationForSameUser(org.apache.qpid.systest.connection.ConnectionTest)  Time elapsed: 30.031 sec  <<< ERROR!
org.apache.qpid.QpidException: Unable to create session, the maximum number of sessions per connection is 0. You must either close one or more sessions or increase the maximum number of sessions available per connection.
	at org.apache.qpid.systest.connection.ConnectionTest.testClientIDVerificationForSameUser(ConnectionTest.java:206)
Caused by: org.apache.qpid.jms.ChannelLimitReachedException: Unable to create session, the maximum number of sessions per connection is 0. You must either close one or more sessions or increase the maximum number of sessions available per connection.
	at org.apache.qpid.systest.connection.ConnectionTest.testClientIDVerificationForSameUser(ConnectionTest.java:206)

testClientIDVerificationForDifferentUsers(org.apache.qpid.systest.connection.ConnectionTest)  Time elapsed: 30.038 sec  <<< ERROR!
org.apache.qpid.QpidException: Unable to create session, the maximum number of sessions per connection is 0. You must either close one or more sessions or increase the maximum number of sessions available per connection.
	at org.apache.qpid.systest.connection.ConnectionTest.testClientIDVerificationForDifferentUsers(ConnectionTest.java:253)
Caused by: org.apache.qpid.jms.ChannelLimitReachedException: Unable to create session, the maximum number of sessions per connection is 0. You must either close one or more sessions or increase the maximum number of sessions available per connection.
	at org.apache.qpid.systest.connection.ConnectionTest.testClientIDVerificationForDifferentUsers(ConnectionTest.java:253)

testUnsupportedSASLMechanism(org.apache.qpid.systest.connection.ConnectionTest)  Time elapsed: 30.042 sec  <<< FAILURE!
java.lang.AssertionError: Unexpected exception message : connect timed out
	at org.apache.qpid.systest.connection.ConnectionTest.testUnsupportedSASLMechanism(ConnectionTest.java:171)

testClientIdIsPopulatedAutomatically(org.apache.qpid.systest.connection.ConnectionTest)  Time elapsed: 30.042 sec  <<< ERROR!
org.apache.qpid.AMQConnectionFailureException: connect timed out
	at org.apache.qpid.systest.connection.ConnectionTest.testClientIdIsPopulatedAutomatically(ConnectionTest.java:137)
Caused by: org.apache.qpid.transport.TransportException: Error connecting to broker
	at org.apache.qpid.systest.connection.ConnectionTest.testClientIdIsPopulatedAutomatically(ConnectionTest.java:137)
Caused by: java.net.SocketTimeoutException: connect timed out
	at org.apache.qpid.systest.connection.ConnectionTest.testClientIdIsPopulatedAutomatically(ConnectionTest.java:137)

Running org.apache.qpid.systest.connection.HeartbeatTest
Tests run: 7, Failures: 0, Errors: 0, Skipped: 0, Time elapsed: 24.485 sec - in org.apache.qpid.systest.connection.HeartbeatTest
Running org.apache.qpid.systest.connection.ConnectionFactoryTest
Tests run: 2, Failures: 0, Errors: 2, Skipped: 0, Time elapsed: 64.455 sec <<< FAILURE! - in org.apache.qpid.systest.connection.ConnectionFactoryTest
testCreateConnectionWithUsernamePassword(org.apache.qpid.systest.connection.ConnectionFactoryTest)  Time elapsed: 30.036 sec  <<< ERROR!
javax.jms.JMSException: Error creating connection: connect timed out
	at org.apache.qpid.systest.connection.ConnectionFactoryTest.testCreateConnectionWithUsernamePassword(ConnectionFactoryTest.java:62)
Caused by: org.apache.qpid.AMQConnectionFailureException: connect timed out
	at org.apache.qpid.systest.connection.ConnectionFactoryTest.testCreateConnectionWithUsernamePassword(ConnectionFactoryTest.java:62)
Caused by: org.apache.qpid.transport.TransportException: Error connecting to broker
	at org.apache.qpid.systest.connection.ConnectionFactoryTest.testCreateConnectionWithUsernamePassword(ConnectionFactoryTest.java:62)
Caused by: java.net.SocketTimeoutException: connect timed out
	at org.apache.qpid.systest.connection.ConnectionFactoryTest.testCreateConnectionWithUsernamePassword(ConnectionFactoryTest.java:62)

testCreatingConnectionWithInstanceMadeUsingDefaultConstructor(org.apache.qpid.systest.connection.ConnectionFactoryTest)  Time elapsed: 30.028 sec  <<< ERROR!
javax.jms.JMSException: Error creating connection: connect timed out
	at org.apache.qpid.systest.connection.ConnectionFactoryTest.testCreatingConnectionWithInstanceMadeUsingDefaultConstructor(ConnectionFactoryTest.java:122)
Caused by: org.apache.qpid.AMQConnectionFailureException: connect timed out
	at org.apache.qpid.systest.connection.ConnectionFactoryTest.testCreatingConnectionWithInstanceMadeUsingDefaultConstructor(ConnectionFactoryTest.java:122)
Caused by: org.apache.qpid.transport.TransportException: Error connecting to broker
	at org.apache.qpid.systest.connection.ConnectionFactoryTest.testCreatingConnectionWithInstanceMadeUsingDefaultConstructor(ConnectionFactoryTest.java:122)
Caused by: java.net.SocketTimeoutException: connect timed out
	at org.apache.qpid.systest.connection.ConnectionFactoryTest.testCreatingConnectionWithInstanceMadeUsingDefaultConstructor(ConnectionFactoryTest.java:122)

Running org.apache.qpid.systest.connection.ExceptionListenerTest
Tests run: 1, Failures: 0, Errors: 0, Skipped: 1, Time elapsed: 3.512 sec - in org.apache.qpid.systest.connection.ExceptionListenerTest
Running org.apache.qpid.systest.core.brokerj.SpawnQpidBrokerAdminTest
Tests run: 5, Failures: 0, Errors: 0, Skipped: 0, Time elapsed: 18.015 sec - in org.apache.qpid.systest.core.brokerj.SpawnQpidBrokerAdminTest
Running org.apache.qpid.systest.message.MessageCompressionTest
Tests run: 5, Failures: 0, Errors: 1, Skipped: 0, Time elapsed: 38.78 sec <<< FAILURE! - in org.apache.qpid.systest.message.MessageCompressionTest
testDisablingCompressionAtBroker(org.apache.qpid.systest.message.MessageCompressionTest)  Time elapsed: 30.019 sec  <<< ERROR!
org.apache.qpid.AMQConnectionFailureException: connect timed out
	at org.apache.qpid.systest.message.MessageCompressionTest.enableMessageCompression(MessageCompressionTest.java:251)
	at org.apache.qpid.systest.message.MessageCompressionTest.testDisablingCompressionAtBroker(MessageCompressionTest.java:96)
Caused by: org.apache.qpid.transport.TransportException: Error connecting to broker
	at org.apache.qpid.systest.message.MessageCompressionTest.enableMessageCompression(MessageCompressionTest.java:251)
	at org.apache.qpid.systest.message.MessageCompressionTest.testDisablingCompressionAtBroker(MessageCompressionTest.java:96)
Caused by: java.net.SocketTimeoutException: connect timed out
	at org.apache.qpid.systest.message.MessageCompressionTest.enableMessageCompression(MessageCompressionTest.java:251)
	at org.apache.qpid.systest.message.MessageCompressionTest.testDisablingCompressionAtBroker(MessageCompressionTest.java:96)

Running org.apache.qpid.systest.message.AMQPEncodedMapMessageTest
Tests run: 5, Failures: 0, Errors: 0, Skipped: 0, Time elapsed: 6.541 sec - in org.apache.qpid.systest.message.AMQPEncodedMapMessageTest
Running org.apache.qpid.systest.message.JMSXUserIDTest
Tests run: 2, Failures: 0, Errors: 0, Skipped: 0, Time elapsed: 4.852 sec - in org.apache.qpid.systest.message.JMSXUserIDTest
Running org.apache.qpid.systest.destination.AddressBasedDestinationTest
Tests run: 45, Failures: 0, Errors: 0, Skipped: 2, Time elapsed: 33.841 sec - in org.apache.qpid.systest.destination.AddressBasedDestinationTest

Results :

Failed tests: 
  ConnectionTest.testExceptionWhenUserPassIsRequired:304 Incorrect Exception thrown! The exception thrown is : connect timed out
  ConnectionTest.testUnsupportedSASLMechanism:171 Unexpected exception message : connect timed out
Tests in error: 
  ConnectionFactoryTest.testCreateConnectionWithUsernamePassword:62 » JMS Error ...
  ConnectionFactoryTest.testCreatingConnectionWithInstanceMadeUsingDefaultConstructor:122 » JMS
  ConnectionTest.testClientIDVerificationForDifferentUsers:253 » Qpid Unable to ...
  ConnectionTest.testClientIDVerificationForSameUser:206 » Qpid Unable to create...
  ConnectionTest.testClientIdIsPopulatedAutomatically:137 » AMQConnectionFailure
  ConnectionTest.testDefaultExchanges:83 » AMQConnectionFailure connect timed ou...
  MessageCompressionTest.testDisablingCompressionAtBroker:96->enableMessageCompression:251 » AMQConnectionFailure

Tests run: 99, Failures: 2, Errors: 7, Skipped: 21

[INFO] ------------------------------------------------------------------------
[INFO] Reactor Summary:
[INFO] 
[INFO] Apache Qpid JMS AMQP 0-x Parent .................... SUCCESS [  5.281 s]
[INFO] Apache Qpid JMS AMQP 0-x ........................... SUCCESS [ 30.796 s]
[INFO] Apache Qpid JMS AMQP 0-x Bundles ................... SUCCESS [  2.021 s]
[INFO] Apache Qpid JMS AMQP 0-x Examples .................. SUCCESS [  0.205 s]
[INFO] Apache Qpid JMS AMQP 0-x Docbook ................... SUCCESS [  0.018 s]
[INFO] Apache Qpid JMS AMQP 0-8, 0-9 and 0-9-1 Docbook .... SUCCESS [  0.289 s]
[INFO] Apache Qpid JMS AMQP 0-10 Docbook .................. SUCCESS [  0.139 s]
[INFO] Apache Qpid JMS AMQP 0-x System Tests .............. FAILURE [07:11 min]
[INFO] ------------------------------------------------------------------------
[INFO] BUILD FAILURE
[INFO] ------------------------------------------------------------------------
[INFO] Total time: 07:50 min
[INFO] Finished at: 2018-01-15T22:21:58Z
[INFO] Final Memory: 42M/541M
[INFO] ------------------------------------------------------------------------
[ERROR] Failed to execute goal org.apache.maven.plugins:maven-surefire-plugin:2.19.1:test (integration-test) on project qpid-client-systests: There are test failures.
[ERROR] 
[ERROR] Please refer to <https://builds.apache.org/job/Qpid-JMS-AMQP-0-x-Broker-J-TestMatrix/jdk=JDK%201.8%20(latest),qpid.amqp.version=0-10/1/artifact/systests/target/surefire-reports/junit> for the individual test results.
[ERROR] -> [Help 1]
[ERROR] 
[ERROR] To see the full stack trace of the errors, re-run Maven with the -e switch.
[ERROR] Re-run Maven using the -X switch to enable full debug logging.
[ERROR] 
[ERROR] For more information about the errors and possible solutions, please read the following articles:
[ERROR] [Help 1] http://cwiki.apache.org/confluence/display/MAVEN/MojoFailureException
[ERROR] 
[ERROR] After correcting the problems, you can resume the build with the command
[ERROR]   mvn <goals> -rf :qpid-client-systests
Build step 'Invoke top-level Maven targets' marked build as failure
Archiving artifacts
[Fast Archiver] No prior successful build to compare, so performing full copy of artifacts
Performing Post build task...
Match found for : : True
Logical operation result is TRUE
Running script  : echo Finishing build
date
[0-10] $ /bin/bash -xe /tmp/jenkins4535114034260108956.sh
+ echo Finishing build
Finishing build
+ date
Mon Jan 15 22:22:26 UTC 2018
POST BUILD TASK : SUCCESS
END OF POST BUILD TASK : 0
Recording test results

Mime
View raw message