qpid-notifications mailing list archives

Site index · List index
Message view « Date » · « Thread »
Top « Date » · « Thread »
From Apache Jenkins Server <jenk...@builds.apache.org>
Subject Build failed in Jenkins: Qpid-Broker-J-TestMatrix » ubuntu,JDK 1.8 (latest),java-mms.0-10 #4077
Date Tue, 09 Jan 2018 01:53:49 GMT
See <https://builds.apache.org/job/Qpid-Broker-J-TestMatrix/Ubuntu%20Slaves=ubuntu,jdk=JDK%201.8%20(latest),profile=java-mms.0-10/4077/display/redirect?page=changes>

Changes:

[kwall] QPID-8038: [Broker-J] [AMQP 0-x] Add connection protocol tests related

[kwall] QPID-6933: [System Tests] Refactor some ConnectionTests as JMS 1.1

[orudyy] QPID-6933: [System Tests] Refactor authentication tests as JMS 1.1

[keith.wall] QPID-6933: [System Tests] Remove MultipleTransactedBatchProducerTest -

------------------------------------------
[...truncated 474.09 KB...]
[INFO] --- maven-antrun-plugin:1.8:run (output-test-properties) @ qpid-java-doc ---
[INFO] Executing tasks

main:
     [echo] Qpid Test Profile Properties
     [echo] [profile] java-mms.0-10
     [echo] [profile.broker.language] java
     [echo] [profile.broker.type] internal
     [echo] [profile.broker.command] "<https://builds.apache.org/job/Qpid-Broker-J-TestMatrix/Ubuntu%20Slaves=ubuntu,jdk=JDK%201.8%20(latest),profile=java-mms.0-10/ws/doc/bin/qpid-server">
-sp "@STORE_PATH" -st @STORE_TYPE -prop test.port=@PORT -prop "qpid.work_dir=@QPID_WORK"
     [echo] [profile.specific.excludes] JavaTransientExcludes Java010Excludes
     [echo] [profile.test.excludes] Excludes JavaExcludes java-mms.0-10.excludes JavaTransientExcludes
Java010Excludes
     [echo] [profile.broker.version] 0-10
     [echo] [profile.test.amqp_port_protocols] ["AMQP_0_8","AMQP_0_9","AMQP_0_9_1","AMQP_0_10"]
     [echo] [profile.broker.persistent] false
     [echo] [profile.virtualhostnode.type] Memory
     [echo] [profile.virtualhostnode.context.blueprint] {"type":"ProvidedStore","globalAddressDomains":"${qpid.globalAddressDomains}"}
     [echo] [profile.test_receive_timeout] 3000
[INFO] Executed tasks
[INFO] 
[INFO] --- maven-enforcer-plugin:1.4.1:enforce (enforce-minimum-versions) @ qpid-java-doc
---
[INFO] 
[INFO] --- maven-enforcer-plugin:1.4.1:enforce (enforce-versions-standard-properties) @ qpid-java-doc
---
[INFO] 
[INFO] --- maven-enforcer-plugin:1.4.1:enforce (enforce-enableAmqp0x) @ qpid-java-doc ---
[INFO] 
[INFO] --- jacoco-maven-plugin:0.7.5.201505241946:prepare-agent (default-prepare-agent) @
qpid-java-doc ---
[INFO] argLine set to "-javaagent:/home/jenkins/.m2/repository/org/jacoco/org.jacoco.agent/0.7.5.201505241946/org.jacoco.agent-0.7.5.201505241946-runtime.jar=destfile=<https://builds.apache.org/job/Qpid-Broker-J-TestMatrix/Ubuntu%20Slaves=ubuntu,jdk=JDK%201.8%20(latest),profile=java-mms.0-10/ws/doc/target/jacoco.exec">
-Xmx512m
[INFO] 
[INFO] --- maven-remote-resources-plugin:1.5:process (process-resource-bundles) @ qpid-java-doc
---
[INFO] 
[INFO] --- maven-site-plugin:3.5.1:attach-descriptor (attach-descriptor) @ qpid-java-doc ---
[INFO] 
[INFO] --- maven-assembly-plugin:2.6:single (default) @ qpid-java-doc ---
[INFO] Assemblies have been skipped per configuration of the skipAssembly parameter.
[INFO] 
[INFO] ------------------------------------------------------------------------
[INFO] Building Apache Qpid Broker-J Docbook 7.1.0-SNAPSHOT
[INFO] ------------------------------------------------------------------------
[INFO] 
[INFO] --- maven-clean-plugin:3.0.0:clean (default-clean) @ qpid-java-doc-broker ---
[INFO] 
[INFO] --- maven-antrun-plugin:1.8:run (output-test-properties) @ qpid-java-doc-broker ---
[INFO] Executing tasks

main:
     [echo] Qpid Test Profile Properties
     [echo] [profile] java-mms.0-10
     [echo] [profile.broker.language] java
     [echo] [profile.broker.type] internal
     [echo] [profile.broker.command] "<https://builds.apache.org/job/Qpid-Broker-J-TestMatrix/Ubuntu%20Slaves=ubuntu,jdk=JDK%201.8%20(latest),profile=java-mms.0-10/ws/doc/java-broker/bin/qpid-server">
-sp "@STORE_PATH" -st @STORE_TYPE -prop test.port=@PORT -prop "qpid.work_dir=@QPID_WORK"
     [echo] [profile.specific.excludes] JavaTransientExcludes Java010Excludes
     [echo] [profile.test.excludes] Excludes JavaExcludes java-mms.0-10.excludes JavaTransientExcludes
Java010Excludes
     [echo] [profile.broker.version] 0-10
     [echo] [profile.test.amqp_port_protocols] ["AMQP_0_8","AMQP_0_9","AMQP_0_9_1","AMQP_0_10"]
     [echo] [profile.broker.persistent] false
     [echo] [profile.virtualhostnode.type] Memory
     [echo] [profile.virtualhostnode.context.blueprint] {"type":"ProvidedStore","globalAddressDomains":"${qpid.globalAddressDomains}"}
     [echo] [profile.test_receive_timeout] 3000
[INFO] Executed tasks
[INFO] 
[INFO] --- maven-enforcer-plugin:1.4.1:enforce (enforce-minimum-versions) @ qpid-java-doc-broker
---
[INFO] 
[INFO] --- maven-enforcer-plugin:1.4.1:enforce (enforce-versions-standard-properties) @ qpid-java-doc-broker
---
[INFO] 
[INFO] --- maven-enforcer-plugin:1.4.1:enforce (enforce-enableAmqp0x) @ qpid-java-doc-broker
---
[INFO] 
[INFO] --- jacoco-maven-plugin:0.7.5.201505241946:prepare-agent (default-prepare-agent) @
qpid-java-doc-broker ---
[INFO] argLine set to "-javaagent:/home/jenkins/.m2/repository/org/jacoco/org.jacoco.agent/0.7.5.201505241946/org.jacoco.agent-0.7.5.201505241946-runtime.jar=destfile=<https://builds.apache.org/job/Qpid-Broker-J-TestMatrix/Ubuntu%20Slaves=ubuntu,jdk=JDK%201.8%20(latest),profile=java-mms.0-10/ws/doc/java-broker/target/jacoco.exec">
-Xmx512m
[INFO] 
[INFO] --- maven-resources-plugin:2.7:copy-resources (filter-docbook-sources) @ qpid-java-doc-broker
---
[INFO] Using 'UTF-8' encoding to copy filtered resources.
[INFO] Copying 76 resources
[INFO] 
[INFO] --- maven-remote-resources-plugin:1.5:process (process-resource-bundles) @ qpid-java-doc-broker
---
[INFO] 
[INFO] --- maven-resources-plugin:2.7:resources (default-resources) @ qpid-java-doc-broker
---
[INFO] Using 'UTF-8' encoding to copy filtered resources.
[INFO] Copying 76 resources
[INFO] 
[INFO] --- maven-compiler-plugin:3.5.1:compile (default-compile) @ qpid-java-doc-broker ---
[INFO] No sources to compile
[INFO] 
[INFO] --- maven-resources-plugin:2.7:testResources (default-testResources) @ qpid-java-doc-broker
---
[INFO] Using 'UTF-8' encoding to copy filtered resources.
[INFO] Copying 76 resources
[INFO] 
[INFO] --- maven-compiler-plugin:3.5.1:testCompile (default-testCompile) @ qpid-java-doc-broker
---
[INFO] No sources to compile
[INFO] 
[INFO] --- maven-surefire-plugin:2.19.1:test (default-test) @ qpid-java-doc-broker ---
[INFO] Tests are skipped.
[INFO] 
[INFO] --- maven-jar-plugin:3.0.0:jar (default-jar) @ qpid-java-doc-broker ---
[WARNING] JAR will be empty - no content was marked for inclusion!
[INFO] Building jar: <https://builds.apache.org/job/Qpid-Broker-J-TestMatrix/Ubuntu%20Slaves=ubuntu,jdk=JDK%201.8%20(latest),profile=java-mms.0-10/ws/doc/java-broker/target/qpid-java-doc-broker-7.1.0-SNAPSHOT.jar>
[INFO] 
[INFO] --- maven-site-plugin:3.5.1:attach-descriptor (attach-descriptor) @ qpid-java-doc-broker
---
[INFO] 
[INFO] --- maven-assembly-plugin:2.6:single (default) @ qpid-java-doc-broker ---
[INFO] Assemblies have been skipped per configuration of the skipAssembly parameter.
[INFO] 
[INFO] ------------------------------------------------------------------------
[INFO] Building Apache Qpid Broker-J Performance Test Docbook 7.1.0-SNAPSHOT
[INFO] ------------------------------------------------------------------------
[INFO] 
[INFO] --- maven-clean-plugin:3.0.0:clean (default-clean) @ qpid-java-doc-perftests ---
[INFO] 
[INFO] --- maven-antrun-plugin:1.8:run (output-test-properties) @ qpid-java-doc-perftests
---
[INFO] Executing tasks

main:
     [echo] Qpid Test Profile Properties
     [echo] [profile] java-mms.0-10
     [echo] [profile.broker.language] java
     [echo] [profile.broker.type] internal
     [echo] [profile.broker.command] "<https://builds.apache.org/job/Qpid-Broker-J-TestMatrix/Ubuntu%20Slaves=ubuntu,jdk=JDK%201.8%20(latest),profile=java-mms.0-10/ws/doc/java-perftests/bin/qpid-server">
-sp "@STORE_PATH" -st @STORE_TYPE -prop test.port=@PORT -prop "qpid.work_dir=@QPID_WORK"
     [echo] [profile.specific.excludes] JavaTransientExcludes Java010Excludes
     [echo] [profile.test.excludes] Excludes JavaExcludes java-mms.0-10.excludes JavaTransientExcludes
Java010Excludes
     [echo] [profile.broker.version] 0-10
     [echo] [profile.test.amqp_port_protocols] ["AMQP_0_8","AMQP_0_9","AMQP_0_9_1","AMQP_0_10"]
     [echo] [profile.broker.persistent] false
     [echo] [profile.virtualhostnode.type] Memory
     [echo] [profile.virtualhostnode.context.blueprint] {"type":"ProvidedStore","globalAddressDomains":"${qpid.globalAddressDomains}"}
     [echo] [profile.test_receive_timeout] 3000
[INFO] Executed tasks
[INFO] 
[INFO] --- maven-enforcer-plugin:1.4.1:enforce (enforce-minimum-versions) @ qpid-java-doc-perftests
---
[INFO] 
[INFO] --- maven-enforcer-plugin:1.4.1:enforce (enforce-versions-standard-properties) @ qpid-java-doc-perftests
---
[INFO] 
[INFO] --- maven-enforcer-plugin:1.4.1:enforce (enforce-enableAmqp0x) @ qpid-java-doc-perftests
---
[INFO] 
[INFO] --- jacoco-maven-plugin:0.7.5.201505241946:prepare-agent (default-prepare-agent) @
qpid-java-doc-perftests ---
[INFO] argLine set to "-javaagent:/home/jenkins/.m2/repository/org/jacoco/org.jacoco.agent/0.7.5.201505241946/org.jacoco.agent-0.7.5.201505241946-runtime.jar=destfile=<https://builds.apache.org/job/Qpid-Broker-J-TestMatrix/Ubuntu%20Slaves=ubuntu,jdk=JDK%201.8%20(latest),profile=java-mms.0-10/ws/doc/java-perftests/target/jacoco.exec">
-Xmx512m
[INFO] 
[INFO] --- maven-resources-plugin:2.7:copy-resources (filter-docbook-sources) @ qpid-java-doc-perftests
---
[INFO] Using 'UTF-8' encoding to copy filtered resources.
[INFO] Copying 1 resource
[INFO] 
[INFO] --- maven-remote-resources-plugin:1.5:process (process-resource-bundles) @ qpid-java-doc-perftests
---
[INFO] 
[INFO] --- maven-resources-plugin:2.7:resources (default-resources) @ qpid-java-doc-perftests
---
[INFO] Using 'UTF-8' encoding to copy filtered resources.
[INFO] Copying 1 resource
[INFO] 
[INFO] --- maven-compiler-plugin:3.5.1:compile (default-compile) @ qpid-java-doc-perftests
---
[INFO] No sources to compile
[INFO] 
[INFO] --- maven-resources-plugin:2.7:testResources (default-testResources) @ qpid-java-doc-perftests
---
[INFO] Using 'UTF-8' encoding to copy filtered resources.
[INFO] Copying 1 resource
[INFO] 
[INFO] --- maven-compiler-plugin:3.5.1:testCompile (default-testCompile) @ qpid-java-doc-perftests
---
[INFO] No sources to compile
[INFO] 
[INFO] --- maven-surefire-plugin:2.19.1:test (default-test) @ qpid-java-doc-perftests ---
[INFO] Tests are skipped.
[INFO] 
[INFO] --- maven-jar-plugin:3.0.0:jar (default-jar) @ qpid-java-doc-perftests ---
[WARNING] JAR will be empty - no content was marked for inclusion!
[INFO] Building jar: <https://builds.apache.org/job/Qpid-Broker-J-TestMatrix/Ubuntu%20Slaves=ubuntu,jdk=JDK%201.8%20(latest),profile=java-mms.0-10/ws/doc/java-perftests/target/qpid-java-doc-perftests-7.1.0-SNAPSHOT.jar>
[INFO] 
[INFO] --- maven-site-plugin:3.5.1:attach-descriptor (attach-descriptor) @ qpid-java-doc-perftests
---
[INFO] 
[INFO] --- maven-assembly-plugin:2.6:single (default) @ qpid-java-doc-perftests ---
[INFO] Assemblies have been skipped per configuration of the skipAssembly parameter.
[INFO] ------------------------------------------------------------------------
[INFO] Reactor Summary:
[INFO] 
[INFO] Apache Qpid Broker-J Parent ........................ SUCCESS [  8.092 s]
[INFO] Apache Qpid Broker-J Code Generation ............... SUCCESS [  4.619 s]
[INFO] Apache Qpid Broker-J Test Utilities ................ SUCCESS [  0.789 s]
[INFO] Apache Qpid Broker-J Core .......................... SUCCESS [ 27.356 s]
[INFO] Apache Qpid Broker-J LogBack Logging Plug-in ....... SUCCESS [  1.955 s]
[INFO] Apache Qpid Broker-J Access Control Plug-in ........ SUCCESS [  1.074 s]
[INFO] Apache Qpid Broker-J AMQP 0-10 Protocol Plug-in .... SUCCESS [  2.472 s]
[INFO] Apache Qpid Broker-J AMQP 0-8 Protocol Plug-in ..... SUCCESS [  2.141 s]
[INFO] Apache Qpid Broker-J AMQP 1-0 Protocol Plug-in ..... SUCCESS [  4.925 s]
[INFO] Apache Qpid Broker-J AMQP 0-8 to 0-10 Message Conversion Plug-in SUCCESS [  0.467 s]
[INFO] Apache Qpid Broker-J AMQP 0-8 to 1-0 Message Conversion Plug-in SUCCESS [  0.688 s]
[INFO] Apache Qpid Broker-J AMQP 0-10 to 1-0 Message Conversion Plug-in SUCCESS [  0.656 s]
[INFO] Apache Qpid Broker-J JDBC Message Store Plug-in .... SUCCESS [  1.451 s]
[INFO] Apache Qpid Broker-J Derby Message Store Plug-in ... SUCCESS [  0.743 s]
[INFO] Apache Qpid Broker-J JDBC Message Store Connection Pooling Plug-in SUCCESS [  0.370
s]
[INFO] Apache Qpid AMQP 1.0 JDBC Link Store Plug-in ....... SUCCESS [  0.396 s]
[INFO] Apache Qpid Broker-J HTTP Management Plug-in ....... SUCCESS [  5.215 s]
[INFO] Apache Qpid Broker-J AMQP Management Protocol Plug-in SUCCESS [  0.433 s]
[INFO] Apache Qpid Broker-J Memory Message Store Plug-in .. SUCCESS [  0.384 s]
[INFO] Apache Qpid Broker-J WebSocket Plug-in ............. SUCCESS [  0.688 s]
[INFO] Apache Qpid Broker-J BDB Message Store Plug-in ..... SUCCESS [  3.542 s]
[INFO] Apache Qpid AMQP 1.0 BDB Link Store Plug-in ........ SUCCESS [  0.363 s]
[INFO] Apache Qpid Broker-J ............................... SUCCESS [  0.723 s]
[INFO] Apache Qpid Broker-J Bundles ....................... SUCCESS [  5.586 s]
[INFO] Apache Qpid Broker-J Tools ......................... SUCCESS [  0.243 s]
[INFO] Apache Qpid Broker-J System Test Parent ............ SUCCESS [  2.726 s]
[INFO] Apache Qpid Broker-J System Test Utils ............. SUCCESS [  1.026 s]
[INFO] Apache Qpid Broker-J JMS System Tests Core ......... SUCCESS [  1.051 s]
[INFO] Apache Qpid Broker-J System Tests .................. SUCCESS [19:23 min]
[INFO] Apache Qpid Broker-J JMS 1.1 System Tests .......... FAILURE [03:46 min]
[INFO] Apache Qpid Broker-J JMS 2.0 System Tests .......... SUCCESS [  1.628 s]
[INFO] Apache Qpid Broker-J Protocol Tests Core ........... SUCCESS [  1.195 s]
[INFO] Apache Qpid Protocol Tests for AMQP 0-8,0-9,0-9-1 .. SUCCESS [ 27.307 s]
[INFO] Apache Qpid Protocol Tests for AMQP 0-10 ........... SUCCESS [ 19.934 s]
[INFO] Apache Qpid Protocol Tests for AMQP 1.0 ............ SUCCESS [01:04 min]
[INFO] Apache Qpid Broker-J End to End Conversion Tests ... SUCCESS [  3.021 s]
[INFO] Apache Qpid Broker-J Performance Tests ............. SUCCESS [  1.841 s]
[INFO] Apache Qpid Broker-J Performance Test System Tests . SUCCESS [ 25.360 s]
[INFO] Apache Qpid Broker-J Performance Tests Visualisation JFC SUCCESS [  1.508 s]
[INFO] Apache Qpid Broker-J BDB Store System Tests ........ SUCCESS [  2.923 s]
[INFO] Apache Qpid Joram JMS Tests ........................ SUCCESS [  0.638 s]
[INFO] Apache Qpid Broker-J JMS TCK Configuration ......... SUCCESS [  1.069 s]
[INFO] Apache Qpid Broker-J Docbook ....................... SUCCESS [  0.051 s]
[INFO] Apache Qpid Broker-J Docbook ....................... SUCCESS [  1.070 s]
[INFO] Apache Qpid Broker-J Performance Test Docbook ...... SUCCESS [  0.100 s]
[INFO] ------------------------------------------------------------------------
[INFO] BUILD FAILURE
[INFO] ------------------------------------------------------------------------
[INFO] Total time: 27:03 min
[INFO] Finished at: 2018-01-09T01:52:32Z
[INFO] Final Memory: 136M/1553M
[INFO] ------------------------------------------------------------------------
[ERROR] Failed to execute goal org.apache.maven.plugins:maven-surefire-plugin:2.19.1:test
(integration-test) on project qpid-systests-jms_1.1: There are test failures.
[ERROR] 
[ERROR] Please refer to <https://builds.apache.org/job/Qpid-Broker-J-TestMatrix/Ubuntu%20Slaves=ubuntu,jdk=JDK%201.8%20(latest),profile=java-mms.0-10/4077/artifact/systests/qpid-systests-jms_1.1/target/surefire-reports/java-mms.0-10>
for the individual test results.
[ERROR] -> [Help 1]
[ERROR] 
[ERROR] To see the full stack trace of the errors, re-run Maven with the -e switch.
[ERROR] Re-run Maven using the -X switch to enable full debug logging.
[ERROR] 
[ERROR] For more information about the errors and possible solutions, please read the following
articles:
[ERROR] [Help 1] http://cwiki.apache.org/confluence/display/MAVEN/MojoFailureException
[ERROR] 
[ERROR] After correcting the problems, you can resume the build with the command
[ERROR]   mvn <goals> -rf :qpid-systests-jms_1.1
Build step 'Invoke top-level Maven targets' marked build as failure
Archiving artifacts
Performing Post build task...
Match found for : : True
Logical operation result is TRUE
Running script  : echo Finishing build
date
[java-mms.0-10] $ /bin/bash -xe /tmp/jenkins414114143438494769.sh
+ echo Finishing build
Finishing build
+ date
Tue Jan  9 01:53:49 UTC 2018
POST BUILD TASK : SUCCESS
END OF POST BUILD TASK : 0
Recording test results

Mime
View raw message