qpid-notifications mailing list archives

Site index · List index
Message view « Date » · « Thread »
Top « Date » · « Thread »
From Apache Jenkins Server <jenk...@builds.apache.org>
Subject Build failed in Jenkins: Qpid-cpp-JMS-AMQP-0-x-Test #4373
Date Sun, 14 Jan 2018 12:52:54 GMT
See <https://builds.apache.org/job/Qpid-cpp-JMS-AMQP-0-x-Test/4373/display/redirect?page=changes>

Changes:

[kwall] QPID-8074: [JMS AMQP 0-x][System Tests] Move more client specific tests

------------------------------------------
[...truncated 135.65 KB...]
[INFO] 
[INFO] --- maven-remote-resources-plugin:1.5:process (process-resource-bundles) @ qpid-java-doc-jms-client-0-8
---
[INFO] 
[INFO] --- maven-resources-plugin:2.7:resources (default-resources) @ qpid-java-doc-jms-client-0-8
---
[INFO] Using 'UTF-8' encoding to copy filtered resources.
[INFO] Copying 18 resources
[INFO] 
[INFO] --- maven-compiler-plugin:3.5.1:compile (default-compile) @ qpid-java-doc-jms-client-0-8
---
[INFO] No sources to compile
[INFO] 
[INFO] --- maven-resources-plugin:2.7:testResources (default-testResources) @ qpid-java-doc-jms-client-0-8
---
[INFO] Using 'UTF-8' encoding to copy filtered resources.
[INFO] Copying 18 resources
[INFO] 
[INFO] --- maven-compiler-plugin:3.5.1:testCompile (default-testCompile) @ qpid-java-doc-jms-client-0-8
---
[INFO] No sources to compile
[INFO] 
[INFO] --- maven-surefire-plugin:2.19.1:test (default-test) @ qpid-java-doc-jms-client-0-8
---
[INFO] Tests are skipped.
[INFO] 
[INFO] --- maven-jar-plugin:3.0.0:jar (default-jar) @ qpid-java-doc-jms-client-0-8 ---
[WARNING] JAR will be empty - no content was marked for inclusion!
[INFO] Building jar: <https://builds.apache.org/job/Qpid-cpp-JMS-AMQP-0-x-Test/ws/qpid-jms-amqp-0-x/doc/jms-client-0-8/target/qpid-java-doc-jms-client-0-8-6.4.0-SNAPSHOT.jar>
[INFO] 
[INFO] --- maven-site-plugin:3.5.1:attach-descriptor (attach-descriptor) @ qpid-java-doc-jms-client-0-8
---
[INFO] 
[INFO] --- maven-assembly-plugin:2.6:single (default) @ qpid-java-doc-jms-client-0-8 ---
[INFO] Assemblies have been skipped per configuration of the skipAssembly parameter.
[INFO] 
[INFO] --- maven-install-plugin:2.5.2:install (default-install) @ qpid-java-doc-jms-client-0-8
---
[INFO] Skipping artifact installation
[INFO] 
[INFO] ------------------------------------------------------------------------
[INFO] Building Apache Qpid JMS AMQP 0-10 Docbook 6.4.0-SNAPSHOT
[INFO] ------------------------------------------------------------------------
[INFO] 
[INFO] --- maven-clean-plugin:3.0.0:clean (default-clean) @ qpid-java-doc-jms-client-0-10
---
[INFO] Deleting <https://builds.apache.org/job/Qpid-cpp-JMS-AMQP-0-x-Test/ws/qpid-jms-amqp-0-x/doc/jms-client-0-10/target>
[INFO] 
[INFO] --- maven-enforcer-plugin:1.4.1:enforce (enforce-minimum-versions) @ qpid-java-doc-jms-client-0-10
---
[INFO] 
[INFO] --- jacoco-maven-plugin:0.7.5.201505241946:prepare-agent (default-prepare-agent) @
qpid-java-doc-jms-client-0-10 ---
[INFO] argLine set to -javaagent:/home/jenkins/.m2/repository/org/jacoco/org.jacoco.agent/0.7.5.201505241946/org.jacoco.agent-0.7.5.201505241946-runtime.jar=destfile=<https://builds.apache.org/job/Qpid-cpp-JMS-AMQP-0-x-Test/ws/qpid-jms-amqp-0-x/doc/jms-client-0-10/target/jacoco.exec>
[INFO] 
[INFO] --- maven-resources-plugin:2.7:copy-resources (filter-docbook-sources) @ qpid-java-doc-jms-client-0-10
---
[INFO] Using 'UTF-8' encoding to copy filtered resources.
[INFO] Copying 1 resource
[INFO] 
[INFO] --- maven-remote-resources-plugin:1.5:process (process-resource-bundles) @ qpid-java-doc-jms-client-0-10
---
[INFO] 
[INFO] --- maven-resources-plugin:2.7:resources (default-resources) @ qpid-java-doc-jms-client-0-10
---
[INFO] Using 'UTF-8' encoding to copy filtered resources.
[INFO] Copying 1 resource
[INFO] 
[INFO] --- maven-compiler-plugin:3.5.1:compile (default-compile) @ qpid-java-doc-jms-client-0-10
---
[INFO] No sources to compile
[INFO] 
[INFO] --- maven-resources-plugin:2.7:testResources (default-testResources) @ qpid-java-doc-jms-client-0-10
---
[INFO] Using 'UTF-8' encoding to copy filtered resources.
[INFO] Copying 1 resource
[INFO] 
[INFO] --- maven-compiler-plugin:3.5.1:testCompile (default-testCompile) @ qpid-java-doc-jms-client-0-10
---
[INFO] No sources to compile
[INFO] 
[INFO] --- maven-surefire-plugin:2.19.1:test (default-test) @ qpid-java-doc-jms-client-0-10
---
[INFO] Tests are skipped.
[INFO] 
[INFO] --- maven-jar-plugin:3.0.0:jar (default-jar) @ qpid-java-doc-jms-client-0-10 ---
[WARNING] JAR will be empty - no content was marked for inclusion!
[INFO] Building jar: <https://builds.apache.org/job/Qpid-cpp-JMS-AMQP-0-x-Test/ws/qpid-jms-amqp-0-x/doc/jms-client-0-10/target/qpid-java-doc-jms-client-0-10-6.4.0-SNAPSHOT.jar>
[INFO] 
[INFO] --- maven-site-plugin:3.5.1:attach-descriptor (attach-descriptor) @ qpid-java-doc-jms-client-0-10
---
[INFO] 
[INFO] --- maven-assembly-plugin:2.6:single (default) @ qpid-java-doc-jms-client-0-10 ---
[INFO] Assemblies have been skipped per configuration of the skipAssembly parameter.
[INFO] 
[INFO] --- maven-install-plugin:2.5.2:install (default-install) @ qpid-java-doc-jms-client-0-10
---
[INFO] Skipping artifact installation
[INFO] 
[INFO] ------------------------------------------------------------------------
[INFO] Building Apache Qpid JMS AMQP 0-x System Tests 6.4.0-SNAPSHOT
[INFO] ------------------------------------------------------------------------
[INFO] 
[INFO] --- maven-clean-plugin:3.0.0:clean (default-clean) @ qpid-client-systests ---
[INFO] Deleting <https://builds.apache.org/job/Qpid-cpp-JMS-AMQP-0-x-Test/ws/qpid-jms-amqp-0-x/systests/target>
[INFO] 
[INFO] --- maven-enforcer-plugin:1.4.1:enforce (enforce-minimum-versions) @ qpid-client-systests
---
[INFO] 
[INFO] --- jacoco-maven-plugin:0.7.5.201505241946:prepare-agent (default-prepare-agent) @
qpid-client-systests ---
[INFO] argLine set to -javaagent:/home/jenkins/.m2/repository/org/jacoco/org.jacoco.agent/0.7.5.201505241946/org.jacoco.agent-0.7.5.201505241946-runtime.jar=destfile=<https://builds.apache.org/job/Qpid-cpp-JMS-AMQP-0-x-Test/ws/qpid-jms-amqp-0-x/systests/target/jacoco.exec>
[INFO] 
[INFO] --- maven-remote-resources-plugin:1.5:process (process-resource-bundles) @ qpid-client-systests
---
[INFO] 
[INFO] --- maven-resources-plugin:2.7:resources (default-resources) @ qpid-client-systests
---
[INFO] Using 'UTF-8' encoding to copy filtered resources.
[INFO] Copying 1 resource
[INFO] Copying 3 resources
[INFO] 
[INFO] --- maven-compiler-plugin:3.5.1:compile (default-compile) @ qpid-client-systests ---
[INFO] Compiling 22 source files to <https://builds.apache.org/job/Qpid-cpp-JMS-AMQP-0-x-Test/ws/qpid-jms-amqp-0-x/systests/target/classes>
[WARNING] bootstrap class path not set in conjunction with -source 1.7
[INFO] 
[INFO] --- maven-resources-plugin:2.7:testResources (default-testResources) @ qpid-client-systests
---
[INFO] Using 'UTF-8' encoding to copy filtered resources.
[INFO] Copying 1 resource
[INFO] Copying 3 resources
[INFO] 
[INFO] --- maven-compiler-plugin:3.5.1:testCompile (default-testCompile) @ qpid-client-systests
---
[INFO] Compiling 14 source files to <https://builds.apache.org/job/Qpid-cpp-JMS-AMQP-0-x-Test/ws/qpid-jms-amqp-0-x/systests/target/test-classes>
[WARNING] bootstrap class path not set in conjunction with -source 1.7
[INFO] <https://builds.apache.org/job/Qpid-cpp-JMS-AMQP-0-x-Test/ws/qpid-jms-amqp-0-x/systests/src/test/java/org/apache/qpid/systest/destination/AddressBasedDestinationTest.java>:
Some input files use unchecked or unsafe operations.
[INFO] <https://builds.apache.org/job/Qpid-cpp-JMS-AMQP-0-x-Test/ws/qpid-jms-amqp-0-x/systests/src/test/java/org/apache/qpid/systest/destination/AddressBasedDestinationTest.java>:
Recompile with -Xlint:unchecked for details.
[INFO] 
[INFO] --- maven-surefire-plugin:2.19.1:test (default-test) @ qpid-client-systests ---
[INFO] Tests are skipped.
[INFO] 
[INFO] --- maven-jar-plugin:3.0.0:jar (default-jar) @ qpid-client-systests ---
[INFO] Building jar: <https://builds.apache.org/job/Qpid-cpp-JMS-AMQP-0-x-Test/ws/qpid-jms-amqp-0-x/systests/target/qpid-client-systests-6.4.0-SNAPSHOT.jar>
[INFO] 
[INFO] --- maven-site-plugin:3.5.1:attach-descriptor (attach-descriptor) @ qpid-client-systests
---
[INFO] 
[INFO] --- maven-surefire-plugin:2.19.1:test (integration-test) @ qpid-client-systests ---
[INFO] Tests are skipped.
[INFO] 
[INFO] --- maven-install-plugin:2.5.2:install (default-install) @ qpid-client-systests ---
[INFO] Installing <https://builds.apache.org/job/Qpid-cpp-JMS-AMQP-0-x-Test/ws/qpid-jms-amqp-0-x/systests/target/qpid-client-systests-6.4.0-SNAPSHOT.jar>
to /home/jenkins/.m2/repository/org/apache/qpid/qpid-client-systests/6.4.0-SNAPSHOT/qpid-client-systests-6.4.0-SNAPSHOT.jar
[INFO] Installing <https://builds.apache.org/job/Qpid-cpp-JMS-AMQP-0-x-Test/ws/qpid-jms-amqp-0-x/systests/pom.xml>
to /home/jenkins/.m2/repository/org/apache/qpid/qpid-client-systests/6.4.0-SNAPSHOT/qpid-client-systests-6.4.0-SNAPSHOT.pom
[INFO] ------------------------------------------------------------------------
[INFO] Reactor Summary:
[INFO] 
[INFO] Apache Qpid JMS AMQP 0-x Parent .................... SUCCESS [  2.047 s]
[INFO] Apache Qpid JMS AMQP 0-x ........................... SUCCESS [  6.969 s]
[INFO] Apache Qpid JMS AMQP 0-x Bundles ................... SUCCESS [  0.653 s]
[INFO] Apache Qpid JMS AMQP 0-x Examples .................. SUCCESS [  0.190 s]
[INFO] Apache Qpid JMS AMQP 0-x Docbook ................... SUCCESS [  0.022 s]
[INFO] Apache Qpid JMS AMQP 0-8, 0-9 and 0-9-1 Docbook .... SUCCESS [  0.268 s]
[INFO] Apache Qpid JMS AMQP 0-10 Docbook .................. SUCCESS [  0.281 s]
[INFO] Apache Qpid JMS AMQP 0-x System Tests .............. SUCCESS [  1.997 s]
[INFO] ------------------------------------------------------------------------
[INFO] BUILD SUCCESS
[INFO] ------------------------------------------------------------------------
[INFO] Total time: 12.672 s
[INFO] Finished at: 2018-01-14T12:52:08Z
[INFO] Final Memory: 53M/3138M
[INFO] ------------------------------------------------------------------------
[Qpid-cpp-JMS-AMQP-0-x-Test] $ /home/jenkins/tools/maven/latest3/bin/mvn -f <https://builds.apache.org/job/Qpid-cpp-JMS-AMQP-0-x-Test/ws/qpid-jms-amqp-0-x/pom.xml>
-Djava.io.tmpdir=<https://builds.apache.org/job/Qpid-cpp-JMS-AMQP-0-x-Test/ws/tmp> -Dqpid.systest.broker.executable=<https://builds.apache.org/job/Qpid-cpp-JMS-AMQP-0-x-Test/ws/build/src/qpidd>
verify -Pcpp -fae -pl systests
[INFO] Scanning for projects...
[INFO] 
[INFO] ------------------------------------------------------------------------
[INFO] Building Apache Qpid JMS AMQP 0-x System Tests 6.4.0-SNAPSHOT
[INFO] ------------------------------------------------------------------------
[INFO] 
[INFO] --- maven-enforcer-plugin:1.4.1:enforce (enforce-minimum-versions) @ qpid-client-systests
---
[INFO] 
[INFO] --- jacoco-maven-plugin:0.7.5.201505241946:prepare-agent (default-prepare-agent) @
qpid-client-systests ---
[INFO] argLine set to -javaagent:/home/jenkins/.m2/repository/org/jacoco/org.jacoco.agent/0.7.5.201505241946/org.jacoco.agent-0.7.5.201505241946-runtime.jar=destfile=<https://builds.apache.org/job/Qpid-cpp-JMS-AMQP-0-x-Test/ws/qpid-jms-amqp-0-x/systests/target/jacoco.exec>
[INFO] 
[INFO] --- maven-remote-resources-plugin:1.5:process (process-resource-bundles) @ qpid-client-systests
---
[INFO] 
[INFO] --- maven-resources-plugin:2.7:resources (default-resources) @ qpid-client-systests
---
[INFO] Using 'UTF-8' encoding to copy filtered resources.
[INFO] Copying 1 resource
[INFO] Copying 3 resources
[INFO] 
[INFO] --- maven-compiler-plugin:3.5.1:compile (default-compile) @ qpid-client-systests ---
[INFO] Nothing to compile - all classes are up to date
[INFO] 
[INFO] --- maven-resources-plugin:2.7:testResources (default-testResources) @ qpid-client-systests
---
[INFO] Using 'UTF-8' encoding to copy filtered resources.
[INFO] Copying 1 resource
[INFO] Copying 3 resources
[INFO] 
[INFO] --- maven-compiler-plugin:3.5.1:testCompile (default-testCompile) @ qpid-client-systests
---
[INFO] Nothing to compile - all classes are up to date
[INFO] 
[INFO] --- maven-surefire-plugin:2.19.1:test (default-test) @ qpid-client-systests ---
[INFO] Tests are skipped.
[INFO] 
[INFO] --- maven-jar-plugin:3.0.0:jar (default-jar) @ qpid-client-systests ---
[INFO] Building jar: <https://builds.apache.org/job/Qpid-cpp-JMS-AMQP-0-x-Test/ws/qpid-jms-amqp-0-x/systests/target/qpid-client-systests-6.4.0-SNAPSHOT.jar>
[INFO] 
[INFO] --- maven-site-plugin:3.5.1:attach-descriptor (attach-descriptor) @ qpid-client-systests
---
[INFO] 
[INFO] --- maven-surefire-plugin:2.19.1:test (integration-test) @ qpid-client-systests ---

-------------------------------------------------------
 T E S T S
-------------------------------------------------------
Running org.apache.qpid.systest.core.brokerj.SpawnQpidBrokerAdminTest
Tests run: 5, Failures: 0, Errors: 0, Skipped: 5, Time elapsed: 0.044 sec - in org.apache.qpid.systest.core.brokerj.SpawnQpidBrokerAdminTest
Running org.apache.qpid.systest.destination.AddressBasedDestinationTest
Tests run: 45, Failures: 0, Errors: 0, Skipped: 2, Time elapsed: 12.01 sec - in org.apache.qpid.systest.destination.AddressBasedDestinationTest
Running org.apache.qpid.systest.producer.ImmediateAndMandatoryPublishingTest
Tests run: 11, Failures: 0, Errors: 0, Skipped: 11, Time elapsed: 0.283 sec - in org.apache.qpid.systest.producer.ImmediateAndMandatoryPublishingTest
Running org.apache.qpid.systest.producer.CloseOnNoRouteForMandatoryMessageTest
Tests run: 4, Failures: 0, Errors: 0, Skipped: 4, Time elapsed: 0.074 sec - in org.apache.qpid.systest.producer.CloseOnNoRouteForMandatoryMessageTest
Running org.apache.qpid.systest.producer.ReturnUnroutableMandatoryMessageTest
Tests run: 3, Failures: 0, Errors: 0, Skipped: 3, Time elapsed: 0.064 sec - in org.apache.qpid.systest.producer.ReturnUnroutableMandatoryMessageTest
Running org.apache.qpid.systest.message.JMSXUserIDTest
Tests run: 2, Failures: 0, Errors: 0, Skipped: 0, Time elapsed: 0.083 sec - in org.apache.qpid.systest.message.JMSXUserIDTest
Running org.apache.qpid.systest.message.MessageCompressionTest
Tests run: 5, Failures: 0, Errors: 0, Skipped: 5, Time elapsed: 0.134 sec - in org.apache.qpid.systest.message.MessageCompressionTest
Running org.apache.qpid.systest.message.AMQPEncodedMapMessageTest
Tests run: 5, Failures: 0, Errors: 0, Skipped: 0, Time elapsed: 0.195 sec - in org.apache.qpid.systest.message.AMQPEncodedMapMessageTest
Running org.apache.qpid.systest.connection.HeartbeatTest
Tests run: 7, Failures: 1, Errors: 0, Skipped: 0, Time elapsed: 16.907 sec <<< FAILURE!
- in org.apache.qpid.systest.connection.HeartbeatTest
testUnidirectionalHeartbeating(org.apache.qpid.systest.connection.HeartbeatTest)  Time elapsed:
2.553 sec  <<< FAILURE!
java.lang.AssertionError: Unexpected number of heartbeats received by the receiver:  expected:<0>
but was:<2>
	at org.apache.qpid.systest.connection.HeartbeatTest.testUnidirectionalHeartbeating(HeartbeatTest.java:165)

Running org.apache.qpid.systest.connection.ExistingSocketTest
Tests run: 2, Failures: 0, Errors: 0, Skipped: 0, Time elapsed: 0.242 sec - in org.apache.qpid.systest.connection.ExistingSocketTest
Running org.apache.qpid.systest.connection.ExceptionListenerTest
Tests run: 1, Failures: 0, Errors: 0, Skipped: 1, Time elapsed: 0.028 sec - in org.apache.qpid.systest.connection.ExceptionListenerTest
Running org.apache.qpid.systest.connection.ConnectionTest
Tests run: 7, Failures: 0, Errors: 0, Skipped: 1, Time elapsed: 0.231 sec - in org.apache.qpid.systest.connection.ConnectionTest
Running org.apache.qpid.systest.connection.ConnectionFactoryTest
Tests run: 2, Failures: 0, Errors: 0, Skipped: 0, Time elapsed: 0.062 sec - in org.apache.qpid.systest.connection.ConnectionFactoryTest

Results :

Failed tests: 
  HeartbeatTest.testUnidirectionalHeartbeating:165 Unexpected number of heartbeats received
by the receiver:  expected:<0> but was:<2>

Tests run: 99, Failures: 1, Errors: 0, Skipped: 32

[INFO] ------------------------------------------------------------------------
[INFO] BUILD FAILURE
[INFO] ------------------------------------------------------------------------
[INFO] Total time: 35.577 s
[INFO] Finished at: 2018-01-14T12:52:46Z
[INFO] Final Memory: 35M/1294M
[INFO] ------------------------------------------------------------------------
[ERROR] Failed to execute goal org.apache.maven.plugins:maven-surefire-plugin:2.19.1:test
(integration-test) on project qpid-client-systests: There are test failures.
[ERROR] 
[ERROR] Please refer to <https://builds.apache.org/job/Qpid-cpp-JMS-AMQP-0-x-Test/4373/artifact/qpid-jms-amqp-0-x/systests/target/surefire-reports/junit>
for the individual test results.
[ERROR] -> [Help 1]
[ERROR] 
[ERROR] To see the full stack trace of the errors, re-run Maven with the -e switch.
[ERROR] Re-run Maven using the -X switch to enable full debug logging.
[ERROR] 
[ERROR] For more information about the errors and possible solutions, please read the following
articles:
[ERROR] [Help 1] http://cwiki.apache.org/confluence/display/MAVEN/MojoFailureException
Build step 'Invoke top-level Maven targets' marked build as failure
[locks-and-latches] Releasing all the locks
[locks-and-latches] All the locks released
Archiving artifacts
[Fast Archiver] Compressed 66.62 MB of artifacts by 85.1% relative to #4372
Recording test results

Mime
View raw message