qpid-notifications mailing list archives

Site index · List index
Message view « Date » · « Thread »
Top « Date » · « Thread »
From Apache Jenkins Server <jenk...@builds.apache.org>
Subject Build failed in Jenkins: Qpid-Java-Java-6.0.x-TestMatrix » ubuntu,JDK 1.7 (latest),java-dby.0-9-1 #154
Date Thu, 09 Nov 2017 05:08:24 GMT
See <https://builds.apache.org/job/Qpid-Java-Java-6.0.x-TestMatrix/Ubuntu%20Slaves=ubuntu,jdk=JDK%201.7%20(latest),profile=java-dby.0-9-1/154/display/redirect?page=changes>

Changes:

[kwall] QPID-7853: [Broker-J] Avoid possibility that a message is enqueue twice

------------------------------------------
[...truncated 410.93 KB...]
[INFO] --- maven-remote-resources-plugin:1.5:process (default) @ qpid-java-doc-jms-client-0-8
---
[INFO] 
[INFO] --- maven-resources-plugin:2.6:resources (default-resources) @ qpid-java-doc-jms-client-0-8
---
[INFO] Using 'UTF-8' encoding to copy filtered resources.
[INFO] skip non existing resourceDirectory <https://builds.apache.org/job/Qpid-Java-Java-6.0.x-TestMatrix/Ubuntu%20Slaves=ubuntu,jdk=JDK%201.7%20(latest),profile=java-dby.0-9-1/ws/doc/jms-client-0-8/src/main/resources>
[INFO] Copying 3 resources
[INFO] 
[INFO] --- maven-compiler-plugin:3.1:compile (default-compile) @ qpid-java-doc-jms-client-0-8
---
[INFO] No sources to compile
[INFO] 
[INFO] --- maven-resources-plugin:2.6:testResources (default-testResources) @ qpid-java-doc-jms-client-0-8
---
[INFO] Using 'UTF-8' encoding to copy filtered resources.
[INFO] skip non existing resourceDirectory <https://builds.apache.org/job/Qpid-Java-Java-6.0.x-TestMatrix/Ubuntu%20Slaves=ubuntu,jdk=JDK%201.7%20(latest),profile=java-dby.0-9-1/ws/doc/jms-client-0-8/src/test/resources>
[INFO] Copying 3 resources
[INFO] 
[INFO] --- maven-compiler-plugin:3.1:testCompile (default-testCompile) @ qpid-java-doc-jms-client-0-8
---
[INFO] No sources to compile
[INFO] 
[INFO] --- maven-surefire-plugin:2.17:test (default-test) @ qpid-java-doc-jms-client-0-8 ---
[INFO] Tests are skipped.
[INFO] 
[INFO] --- maven-jar-plugin:2.5:jar (default-jar) @ qpid-java-doc-jms-client-0-8 ---
[INFO] Skipping packaging of the jar
[INFO] 
[INFO] --- maven-site-plugin:3.4:attach-descriptor (attach-descriptor) @ qpid-java-doc-jms-client-0-8
---
[INFO] 
[INFO] --- maven-assembly-plugin:2.4.1:single (default) @ qpid-java-doc-jms-client-0-8 ---
[INFO] Assemblies have been skipped per configuration of the skipAssembly parameter.
[INFO] 
[INFO] --- maven-antrun-plugin:1.7:run (create-qbtc-output-dir) @ qpid-java-doc-jms-client-0-8
---
[INFO] Executing tasks

main:
    [mkdir] Created dir: <https://builds.apache.org/job/Qpid-Java-Java-6.0.x-TestMatrix/Ubuntu%20Slaves=ubuntu,jdk=JDK%201.7%20(latest),profile=java-dby.0-9-1/ws/doc/jms-client-0-8/target/qbtc-test-config>
[INFO] Executed tasks
[INFO]                                                                         
[INFO] ------------------------------------------------------------------------
[INFO] Building Apache Qpid JMS Client for AMQP 0-10 Docbook 6.0.9-SNAPSHOT
[INFO] ------------------------------------------------------------------------
[INFO] 
[INFO] --- maven-clean-plugin:2.5:clean (default-clean) @ qpid-java-doc-jms-client-0-10 ---
[INFO] 
[INFO] --- maven-antrun-plugin:1.7:run (output-test-properties) @ qpid-java-doc-jms-client-0-10
---
[INFO] Executing tasks

main:
     [echo] Qpid Test Profile Properties
     [echo] [profile] java-dby.0-9-1
     [echo] [profile.broker.language] java
     [echo] [profile.broker.type] internal
     [echo] [profile.broker.command] "<https://builds.apache.org/job/Qpid-Java-Java-6.0.x-TestMatrix/Ubuntu%20Slaves=ubuntu,jdk=JDK%201.7%20(latest),profile=java-dby.0-9-1/ws/doc/jms-client-0-10/bin/qpid-server">
-sp @STORE_PATH -st @STORE_TYPE
     [echo] [profile.specific.excludes] JavaPersistentExcludes JavaDerbyExcludes XAExcludes
JavaPre010Excludes
     [echo] [profile.test.excludes] Excludes JavaExcludes java-dby.0-9-1.excludes JavaPersistentExcludes
JavaDerbyExcludes XAExcludes JavaPre010Excludes
     [echo] [profile.broker.version] v0_9_1
     [echo] [profile.test.amqp_port_protocols] ["AMQP_0_8","AMQP_0_9","AMQP_0_9_1"]
     [echo] [profile.broker.persistent] true
     [echo] [profile.virtualhostnode.type] DERBY
     [echo] [profile.virtualhostnode.context.blueprint] {"type":"ProvidedStore","globalAddressDomains":"${qpid.globalAddressDomains}"}
     [echo] [profile.test_receive_timeout] 2000
[INFO] Executed tasks
[INFO] 
[INFO] --- maven-enforcer-plugin:1.3.1:enforce (enforce-minimum-versions) @ qpid-java-doc-jms-client-0-10
---
[INFO] 
[INFO] --- maven-enforcer-plugin:1.3.1:enforce (enforce-versions-standard-properties) @ qpid-java-doc-jms-client-0-10
---
[INFO] 
[INFO] --- jacoco-maven-plugin:0.7.5.201505241946:prepare-agent (default-prepare-agent) @
qpid-java-doc-jms-client-0-10 ---
[INFO] argLine set to "-javaagent:/home/jenkins/.m2/repository/org/jacoco/org.jacoco.agent/0.7.5.201505241946/org.jacoco.agent-0.7.5.201505241946-runtime.jar=destfile=<https://builds.apache.org/job/Qpid-Java-Java-6.0.x-TestMatrix/Ubuntu%20Slaves=ubuntu,jdk=JDK%201.7%20(latest),profile=java-dby.0-9-1/ws/doc/jms-client-0-10/target/jacoco.exec">
-Xmx512m
[INFO] 
[INFO] --- maven-resources-plugin:2.6:copy-resources (filter-docbook-sources) @ qpid-java-doc-jms-client-0-10
---
[INFO] Using 'UTF-8' encoding to copy filtered resources.
[INFO] Copying 1 resource
[INFO] 
[INFO] --- maven-remote-resources-plugin:1.5:process (default) @ qpid-java-doc-jms-client-0-10
---
[INFO] 
[INFO] --- maven-resources-plugin:2.6:resources (default-resources) @ qpid-java-doc-jms-client-0-10
---
[INFO] Using 'UTF-8' encoding to copy filtered resources.
[INFO] skip non existing resourceDirectory <https://builds.apache.org/job/Qpid-Java-Java-6.0.x-TestMatrix/Ubuntu%20Slaves=ubuntu,jdk=JDK%201.7%20(latest),profile=java-dby.0-9-1/ws/doc/jms-client-0-10/src/main/resources>
[INFO] Copying 3 resources
[INFO] 
[INFO] --- maven-compiler-plugin:3.1:compile (default-compile) @ qpid-java-doc-jms-client-0-10
---
[INFO] No sources to compile
[INFO] 
[INFO] --- maven-resources-plugin:2.6:testResources (default-testResources) @ qpid-java-doc-jms-client-0-10
---
[INFO] Using 'UTF-8' encoding to copy filtered resources.
[INFO] skip non existing resourceDirectory <https://builds.apache.org/job/Qpid-Java-Java-6.0.x-TestMatrix/Ubuntu%20Slaves=ubuntu,jdk=JDK%201.7%20(latest),profile=java-dby.0-9-1/ws/doc/jms-client-0-10/src/test/resources>
[INFO] Copying 3 resources
[INFO] 
[INFO] --- maven-compiler-plugin:3.1:testCompile (default-testCompile) @ qpid-java-doc-jms-client-0-10
---
[INFO] No sources to compile
[INFO] 
[INFO] --- maven-surefire-plugin:2.17:test (default-test) @ qpid-java-doc-jms-client-0-10
---
[INFO] Tests are skipped.
[INFO] 
[INFO] --- maven-jar-plugin:2.5:jar (default-jar) @ qpid-java-doc-jms-client-0-10 ---
[INFO] Skipping packaging of the jar
[INFO] 
[INFO] --- maven-site-plugin:3.4:attach-descriptor (attach-descriptor) @ qpid-java-doc-jms-client-0-10
---
[INFO] 
[INFO] --- maven-assembly-plugin:2.4.1:single (default) @ qpid-java-doc-jms-client-0-10 ---
[INFO] Assemblies have been skipped per configuration of the skipAssembly parameter.
[INFO] 
[INFO] --- maven-antrun-plugin:1.7:run (create-qbtc-output-dir) @ qpid-java-doc-jms-client-0-10
---
[INFO] Executing tasks

main:
    [mkdir] Created dir: <https://builds.apache.org/job/Qpid-Java-Java-6.0.x-TestMatrix/Ubuntu%20Slaves=ubuntu,jdk=JDK%201.7%20(latest),profile=java-dby.0-9-1/ws/doc/jms-client-0-10/target/qbtc-test-config>
[INFO] Executed tasks
[INFO]                                                                         
[INFO] ------------------------------------------------------------------------
[INFO] Building Apache Qpid Performance Test Docbook 6.0.9-SNAPSHOT
[INFO] ------------------------------------------------------------------------
[INFO] 
[INFO] --- maven-clean-plugin:2.5:clean (default-clean) @ qpid-java-doc-perftests ---
[INFO] 
[INFO] --- maven-antrun-plugin:1.7:run (output-test-properties) @ qpid-java-doc-perftests
---
[INFO] Executing tasks

main:
     [echo] Qpid Test Profile Properties
     [echo] [profile] java-dby.0-9-1
     [echo] [profile.broker.language] java
     [echo] [profile.broker.type] internal
     [echo] [profile.broker.command] "<https://builds.apache.org/job/Qpid-Java-Java-6.0.x-TestMatrix/Ubuntu%20Slaves=ubuntu,jdk=JDK%201.7%20(latest),profile=java-dby.0-9-1/ws/doc/java-perftests/bin/qpid-server">
-sp @STORE_PATH -st @STORE_TYPE
     [echo] [profile.specific.excludes] JavaPersistentExcludes JavaDerbyExcludes XAExcludes
JavaPre010Excludes
     [echo] [profile.test.excludes] Excludes JavaExcludes java-dby.0-9-1.excludes JavaPersistentExcludes
JavaDerbyExcludes XAExcludes JavaPre010Excludes
     [echo] [profile.broker.version] v0_9_1
     [echo] [profile.test.amqp_port_protocols] ["AMQP_0_8","AMQP_0_9","AMQP_0_9_1"]
     [echo] [profile.broker.persistent] true
     [echo] [profile.virtualhostnode.type] DERBY
     [echo] [profile.virtualhostnode.context.blueprint] {"type":"ProvidedStore","globalAddressDomains":"${qpid.globalAddressDomains}"}
     [echo] [profile.test_receive_timeout] 2000
[INFO] Executed tasks
[INFO] 
[INFO] --- maven-enforcer-plugin:1.3.1:enforce (enforce-minimum-versions) @ qpid-java-doc-perftests
---
[INFO] 
[INFO] --- maven-enforcer-plugin:1.3.1:enforce (enforce-versions-standard-properties) @ qpid-java-doc-perftests
---
[INFO] 
[INFO] --- jacoco-maven-plugin:0.7.5.201505241946:prepare-agent (default-prepare-agent) @
qpid-java-doc-perftests ---
[INFO] argLine set to "-javaagent:/home/jenkins/.m2/repository/org/jacoco/org.jacoco.agent/0.7.5.201505241946/org.jacoco.agent-0.7.5.201505241946-runtime.jar=destfile=<https://builds.apache.org/job/Qpid-Java-Java-6.0.x-TestMatrix/Ubuntu%20Slaves=ubuntu,jdk=JDK%201.7%20(latest),profile=java-dby.0-9-1/ws/doc/java-perftests/target/jacoco.exec">
-Xmx512m
[INFO] 
[INFO] --- maven-resources-plugin:2.6:copy-resources (filter-docbook-sources) @ qpid-java-doc-perftests
---
[INFO] Using 'UTF-8' encoding to copy filtered resources.
[INFO] Copying 1 resource
[INFO] 
[INFO] --- maven-remote-resources-plugin:1.5:process (default) @ qpid-java-doc-perftests ---
[INFO] 
[INFO] --- maven-resources-plugin:2.6:resources (default-resources) @ qpid-java-doc-perftests
---
[INFO] Using 'UTF-8' encoding to copy filtered resources.
[INFO] skip non existing resourceDirectory <https://builds.apache.org/job/Qpid-Java-Java-6.0.x-TestMatrix/Ubuntu%20Slaves=ubuntu,jdk=JDK%201.7%20(latest),profile=java-dby.0-9-1/ws/doc/java-perftests/src/main/resources>
[INFO] Copying 3 resources
[INFO] 
[INFO] --- maven-compiler-plugin:3.1:compile (default-compile) @ qpid-java-doc-perftests ---
[INFO] No sources to compile
[INFO] 
[INFO] --- maven-resources-plugin:2.6:testResources (default-testResources) @ qpid-java-doc-perftests
---
[INFO] Using 'UTF-8' encoding to copy filtered resources.
[INFO] skip non existing resourceDirectory <https://builds.apache.org/job/Qpid-Java-Java-6.0.x-TestMatrix/Ubuntu%20Slaves=ubuntu,jdk=JDK%201.7%20(latest),profile=java-dby.0-9-1/ws/doc/java-perftests/src/test/resources>
[INFO] Copying 3 resources
[INFO] 
[INFO] --- maven-compiler-plugin:3.1:testCompile (default-testCompile) @ qpid-java-doc-perftests
---
[INFO] No sources to compile
[INFO] 
[INFO] --- maven-surefire-plugin:2.17:test (default-test) @ qpid-java-doc-perftests ---
[INFO] Tests are skipped.
[INFO] 
[INFO] --- maven-jar-plugin:2.5:jar (default-jar) @ qpid-java-doc-perftests ---
[INFO] Skipping packaging of the jar
[INFO] 
[INFO] --- maven-site-plugin:3.4:attach-descriptor (attach-descriptor) @ qpid-java-doc-perftests
---
[INFO] 
[INFO] --- maven-assembly-plugin:2.4.1:single (default) @ qpid-java-doc-perftests ---
[INFO] Assemblies have been skipped per configuration of the skipAssembly parameter.
[INFO] 
[INFO] --- maven-antrun-plugin:1.7:run (create-qbtc-output-dir) @ qpid-java-doc-perftests
---
[INFO] Executing tasks

main:
    [mkdir] Created dir: <https://builds.apache.org/job/Qpid-Java-Java-6.0.x-TestMatrix/Ubuntu%20Slaves=ubuntu,jdk=JDK%201.7%20(latest),profile=java-dby.0-9-1/ws/doc/java-perftests/target/qbtc-test-config>
[INFO] Executed tasks
[INFO] ------------------------------------------------------------------------
[INFO] Reactor Summary:
[INFO] 
[INFO] Apache Qpid for Java .............................. SUCCESS [2.333s]
[INFO] Apache Qpid Broker Code Generation ................ SUCCESS [1.549s]
[INFO] Apache Qpid Test Utilities ........................ SUCCESS [0.578s]
[INFO] Apache Qpid Common ................................ SUCCESS [5.706s]
[INFO] Qpid Management Common ............................ SUCCESS [0.323s]
[INFO] Apache Qpid Broker Core ........................... SUCCESS [7.768s]
[INFO] Apache Qpid Access Control Broker Plug-in ......... SUCCESS [0.534s]
[INFO] Apache Qpid AMQP 0-8 Protocol Broker Plug-in ...... SUCCESS [0.537s]
[INFO] Apache Qpid AMQP 0-10 Protocol Plug-in ............ SUCCESS [0.621s]
[INFO] Apache Qpid AMQP 1-0 Protocol Broker Plug-in ...... SUCCESS [1.146s]
[INFO] Apache Qpid AMQP 0-8 to 0-10 Message Conversion Broker Plug-in  SUCCESS [0.191s]
[INFO] Apache Qpid AMQP 0-8 to 1-0 Message Conversion Broker Plug-in  SUCCESS [0.175s]
[INFO] Apache Qpid AMQP 0-10 to 1-0 Message Conversion Broker Plug-in  SUCCESS [0.236s]
[INFO] Apache Qpid Derby Message Store Broker Plug-in .... SUCCESS [0.376s]
[INFO] Apache Qpid JDBC Message Store Connection Pooling Plug-in  SUCCESS [0.171s]
[INFO] Apache Qpid JDBC Message Store Broker Plug-in ..... SUCCESS [0.368s]
[INFO] Apache Qpid HTTP Management Broker Plug-in ........ SUCCESS [1.025s]
[INFO] Qpid JMX Management Broker Plug-in ................ SUCCESS [0.481s]
[INFO] Apache Qpid Memory Message Store Broker Plug-in ... SUCCESS [0.200s]
[INFO] Apache Qpid WebSocket Broker Plug-in .............. SUCCESS [0.292s]
[INFO] Apache Qpid JMS Client for AMQP 0-9-1/0-10 ........ SUCCESS [1.814s]
[INFO] Apache Qpid BDB Message Store Broker Plug-in ...... SUCCESS [1.193s]
[INFO] Qpid BDB Message Store JMX ........................ SUCCESS [0.186s]
[INFO] Apache Qpid Broker for Java ....................... SUCCESS [3.719s]
[INFO] Apache Qpid AMQP Management Protocol Broker Plug-in  SUCCESS [0.165s]
[INFO] Apache Qpid Client for AMQP 0-9-1/0-10 Examples ... SUCCESS [0.144s]
[INFO] Apache Qpid JCA ................................... SUCCESS [0.441s]
[INFO] Apache Qpid Resource Adaptor ...................... SUCCESS [0.333s]
[INFO] Apache Qpid Tools ................................. SUCCESS [0.255s]
[INFO] Qpid Management Examples .......................... SUCCESS [0.090s]
[INFO] Apache Qpid System Test Parent .................... SUCCESS [0.672s]
[INFO] Apache Qpid System Tests .......................... FAILURE [4:42:59.598s]
[INFO] Apache Qpid Performance Tests ..................... SUCCESS [1.050s]
[INFO] Apache Qpid Performance Test System Tests ......... SKIPPED
[INFO] Apache Qpid Performance Tests Visualisation JFC ... SUCCESS [0.787s]
[INFO] Apache Qpid BDB Store System Tests ................ SKIPPED
[INFO] Apache Qpid Joram JMS Tests ....................... SUCCESS [0.267s]
[INFO] Apache Qpid for Java Docbook ...................... SUCCESS [0.050s]
[INFO] Apache Qpid Broker for Java Docbook ............... SUCCESS [0.315s]
[INFO] Apache Qpid JMS Client for AMQP 0-8, 0-9 and 0-9-1 Docbook  SUCCESS [0.098s]
[INFO] Apache Qpid JMS Client for AMQP 0-10 Docbook ...... SUCCESS [0.077s]
[INFO] Apache Qpid Performance Test Docbook .............. SUCCESS [0.074s]
[INFO] ------------------------------------------------------------------------
[INFO] BUILD FAILURE
[INFO] ------------------------------------------------------------------------
[INFO] Total time: 4:43:36.827s
[INFO] Finished at: Thu Nov 09 05:06:42 UTC 2017
[INFO] Final Memory: 120M/2574M
[INFO] ------------------------------------------------------------------------
[ERROR] Failed to execute goal org.apache.maven.plugins:maven-surefire-plugin:2.17:test (integration-test)
on project qpid-systests: There are test failures.
[ERROR] 
[ERROR] Please refer to <https://builds.apache.org/job/Qpid-Java-Java-6.0.x-TestMatrix/Ubuntu%20Slaves=ubuntu,jdk=JDK%201.7%20(latest),profile=java-dby.0-9-1/154/artifact/systests/target/surefire-reports>
for the individual test results.
[ERROR] -> [Help 1]
[ERROR] 
[ERROR] To see the full stack trace of the errors, re-run Maven with the -e switch.
[ERROR] Re-run Maven using the -X switch to enable full debug logging.
[ERROR] 
[ERROR] For more information about the errors and possible solutions, please read the following
articles:
[ERROR] [Help 1] http://cwiki.apache.org/confluence/display/MAVEN/MojoFailureException
[ERROR] 
[ERROR] After correcting the problems, you can resume the build with the command
[ERROR]   mvn <goals> -rf :qpid-systests
Build step 'Invoke top-level Maven targets' marked build as failure
[locks-and-latches] Releasing all the locks
[locks-and-latches] All the locks released
Archiving artifacts
Recording test results

Mime
View raw message