qpid-notifications mailing list archives

Site index · List index
Message view « Date » · « Thread »
Top « Date » · « Thread »
From Apache Jenkins Server <jenk...@builds.apache.org>
Subject Build failed in Jenkins: Qpid-BrokerForJava-TestMatrix » ubuntu,JDK 1.8 (latest),java-mms.0-10 #3945
Date Thu, 12 Oct 2017 12:18:22 GMT
See <https://builds.apache.org/job/Qpid-BrokerForJava-TestMatrix/Ubuntu%20Slaves=ubuntu,jdk=JDK%201.8%20(latest),profile=java-mms.0-10/3945/display/redirect>

------------------------------------------
Started by upstream project "Qpid-BrokerForJava-TestMatrix" build number 3945
originally caused by:
 Started by an SCM change
 Started by an SCM change
[EnvInject] - Loading node environment variables.
Building remotely on qnode3 (ubuntu xenial) in workspace <https://builds.apache.org/job/Qpid-BrokerForJava-TestMatrix/Ubuntu%20Slaves=ubuntu,jdk=JDK%201.8%20(latest),profile=java-mms.0-10/ws/>
 > git rev-parse --is-inside-work-tree # timeout=10
Fetching changes from the remote Git repository
 > git config remote.origin.url https://git-wip-us.apache.org/repos/asf/qpid-broker-j.git
# timeout=10
Cleaning workspace
 > git rev-parse --verify HEAD # timeout=10
Resetting working tree
 > git reset --hard # timeout=10
 > git clean -fdx # timeout=10
Fetching upstream changes from https://git-wip-us.apache.org/repos/asf/qpid-broker-j.git
 > git --version # timeout=10
 > git fetch --tags --progress https://git-wip-us.apache.org/repos/asf/qpid-broker-j.git
+refs/heads/*:refs/remotes/origin/* --depth=1
Checking out Revision 538c917e6c3252e9c6f482e783007c031b2a56d1 (refs/remotes/origin/master)
Commit message: "QPID-7799: [Java Broker] Replace StatisticsCounters with AtomicLongs and
remove statistics reset functionality"
 > git config core.sparsecheckout # timeout=10
 > git checkout -f 538c917e6c3252e9c6f482e783007c031b2a56d1
 > git rev-list d60f40a4942c491c603a66c4407ab6f94e87c2df # timeout=10
First time build. Skipping changelog.
FATAL: Unable to produce a script file
java.io.IOException: No space left on device
	at java.io.FileOutputStream.writeBytes(Native Method)
	at java.io.FileOutputStream.write(FileOutputStream.java:326)
	at sun.nio.cs.StreamEncoder.writeBytes(StreamEncoder.java:221)
	at sun.nio.cs.StreamEncoder.implClose(StreamEncoder.java:316)
	at sun.nio.cs.StreamEncoder.close(StreamEncoder.java:149)
	at java.io.OutputStreamWriter.close(OutputStreamWriter.java:233)
	at hudson.FilePath$17.invoke(FilePath.java:1381)
	at hudson.FilePath$17.invoke(FilePath.java:1364)
	at hudson.FilePath$FileCallableWrapper.call(FilePath.java:2750)
	at hudson.remoting.UserRequest.perform(UserRequest.java:181)
	at hudson.remoting.UserRequest.perform(UserRequest.java:52)
	at hudson.remoting.Request$2.run(Request.java:336)
	at hudson.remoting.InterceptingExecutorService$1.call(InterceptingExecutorService.java:68)
	at java.util.concurrent.FutureTask.run(FutureTask.java:266)
	at java.util.concurrent.ThreadPoolExecutor.runWorker(ThreadPoolExecutor.java:1142)
	at java.util.concurrent.ThreadPoolExecutor$Worker.run(ThreadPoolExecutor.java:617)
	at java.lang.Thread.run(Thread.java:745)
	at ......remote call to qnode3(Native Method)
	at hudson.remoting.Channel.attachCallSiteStackTrace(Channel.java:1554)
	at hudson.remoting.UserResponse.retrieve(UserRequest.java:281)
	at hudson.remoting.Channel.call(Channel.java:839)
	at hudson.FilePath.act(FilePath.java:987)
Caused: java.io.IOException: remote file operation failed: <https://builds.apache.org/job/Qpid-BrokerForJava-TestMatrix/Ubuntu%20Slaves=ubuntu,jdk=JDK%201.8%20(latest),profile=java-mms.0-10/ws/>
at hudson.remoting.Channel@2801ec2:qnode3
	at hudson.FilePath.act(FilePath.java:994)
	at hudson.FilePath.act(FilePath.java:976)
	at hudson.FilePath.createTextTempFile(FilePath.java:1364)
Caused: java.io.IOException: Failed to create a temp file on <https://builds.apache.org/job/Qpid-BrokerForJava-TestMatrix/Ubuntu%20Slaves=ubuntu,jdk=JDK%201.8%20(latest),profile=java-mms.0-10/ws/>
	at hudson.FilePath.createTextTempFile(FilePath.java:1387)
	at hudson.tasks.CommandInterpreter.createScriptFile(CommandInterpreter.java:162)
	at hudson.tasks.CommandInterpreter.perform(CommandInterpreter.java:94)
	at hudson.tasks.CommandInterpreter.perform(CommandInterpreter.java:66)
	at hudson.tasks.BuildStepMonitor$1.perform(BuildStepMonitor.java:20)
	at hudson.model.AbstractBuild$AbstractBuildExecution.perform(AbstractBuild.java:736)
	at hudson.model.Build$BuildExecution.build(Build.java:206)
	at hudson.model.Build$BuildExecution.doRun(Build.java:163)
	at hudson.model.AbstractBuild$AbstractBuildExecution.run(AbstractBuild.java:496)
	at hudson.model.Run.execute(Run.java:1737)
	at hudson.matrix.MatrixRun.run(MatrixRun.java:146)
	at hudson.model.ResourceController.execute(ResourceController.java:97)
	at hudson.model.Executor.run(Executor.java:419)
Build step 'Execute shell' marked build as failure
Archiving artifacts
Performing Post build task...
Match found for : : True
Logical operation result is TRUE
Running script  : echo Finishing build
date
FATAL: Unable to produce a script file
java.io.IOException: No space left on device
	at java.io.FileOutputStream.writeBytes(Native Method)
	at java.io.FileOutputStream.write(FileOutputStream.java:326)
	at sun.nio.cs.StreamEncoder.writeBytes(StreamEncoder.java:221)
	at sun.nio.cs.StreamEncoder.implClose(StreamEncoder.java:316)
	at sun.nio.cs.StreamEncoder.close(StreamEncoder.java:149)
	at java.io.OutputStreamWriter.close(OutputStreamWriter.java:233)
	at hudson.FilePath$17.invoke(FilePath.java:1381)
	at hudson.FilePath$17.invoke(FilePath.java:1364)
	at hudson.FilePath$FileCallableWrapper.call(FilePath.java:2750)
	at hudson.remoting.UserRequest.perform(UserRequest.java:181)
	at hudson.remoting.UserRequest.perform(UserRequest.java:52)
	at hudson.remoting.Request$2.run(Request.java:336)
	at hudson.remoting.InterceptingExecutorService$1.call(InterceptingExecutorService.java:68)
	at java.util.concurrent.FutureTask.run(FutureTask.java:266)
	at java.util.concurrent.ThreadPoolExecutor.runWorker(ThreadPoolExecutor.java:1142)
	at java.util.concurrent.ThreadPoolExecutor$Worker.run(ThreadPoolExecutor.java:617)
	at java.lang.Thread.run(Thread.java:745)
	at ......remote call to qnode3(Native Method)
	at hudson.remoting.Channel.attachCallSiteStackTrace(Channel.java:1554)
	at hudson.remoting.UserResponse.retrieve(UserRequest.java:281)
	at hudson.remoting.Channel.call(Channel.java:839)
	at hudson.FilePath.act(FilePath.java:987)
Caused: java.io.IOException: remote file operation failed: <https://builds.apache.org/job/Qpid-BrokerForJava-TestMatrix/Ubuntu%20Slaves=ubuntu,jdk=JDK%201.8%20(latest),profile=java-mms.0-10/ws/>
at hudson.remoting.Channel@2801ec2:qnode3
	at hudson.FilePath.act(FilePath.java:994)
	at hudson.FilePath.act(FilePath.java:976)
	at hudson.FilePath.createTextTempFile(FilePath.java:1364)
Caused: java.io.IOException: Failed to create a temp file on <https://builds.apache.org/job/Qpid-BrokerForJava-TestMatrix/Ubuntu%20Slaves=ubuntu,jdk=JDK%201.8%20(latest),profile=java-mms.0-10/ws/>
	at hudson.FilePath.createTextTempFile(FilePath.java:1387)
	at hudson.tasks.CommandInterpreter.createScriptFile(CommandInterpreter.java:162)
	at hudson.tasks.CommandInterpreter.perform(CommandInterpreter.java:94)
	at hudson.tasks.CommandInterpreter.perform(CommandInterpreter.java:66)
	at hudson.plugins.postbuildtask.PostbuildTask.perform(PostbuildTask.java:123)
	at hudson.tasks.BuildStepMonitor$1.perform(BuildStepMonitor.java:20)
	at hudson.model.AbstractBuild$AbstractBuildExecution.perform(AbstractBuild.java:736)
	at hudson.model.AbstractBuild$AbstractBuildExecution.performAllBuildSteps(AbstractBuild.java:682)
	at hudson.model.Build$BuildExecution.post2(Build.java:186)
	at hudson.model.AbstractBuild$AbstractBuildExecution.post(AbstractBuild.java:627)
	at hudson.model.Run.execute(Run.java:1762)
	at hudson.matrix.MatrixRun.run(MatrixRun.java:146)
	at hudson.model.ResourceController.execute(ResourceController.java:97)
	at hudson.model.Executor.run(Executor.java:419)
POST BUILD TASK : FAILURE
END OF POST BUILD TASK : 0
Recording test results
ERROR: Step ‘Publish JUnit test result report’ failed: No test report files were found.
Configuration error?


Mime
View raw message