qpid-notifications mailing list archives

Site index · List index
Message view « Date » · « Thread »
Top « Date » · « Thread »
From Apache Jenkins Server <jenk...@builds.apache.org>
Subject Build failed in Jenkins: Qpid-cpp-JMS-AMQP-0-x-Test #4208
Date Thu, 12 Oct 2017 12:40:43 GMT
See <https://builds.apache.org/job/Qpid-cpp-JMS-AMQP-0-x-Test/4208/display/redirect>

------------------------------------------
[...truncated 545.33 KB...]
Tests run: 9, Failures: 0, Errors: 0, Skipped: 0, Time elapsed: 0.007 sec - in org.apache.qpid.server.security.auth.manager.ExternalAuthenticationTest
Running org.apache.qpid.server.security.auth.manager.ScramSha1AuthenticationManagerTest
Tests run: 3, Failures: 0, Errors: 0, Skipped: 0, Time elapsed: 0.001 sec - in org.apache.qpid.server.security.auth.manager.ScramSha1AuthenticationManagerTest
Running org.apache.qpid.server.security.auth.manager.MD5AuthenticationManagerTest
Tests run: 3, Failures: 0, Errors: 0, Skipped: 0, Time elapsed: 0.002 sec - in org.apache.qpid.server.security.auth.manager.MD5AuthenticationManagerTest
Running org.apache.qpid.server.security.auth.manager.MultipleAuthenticationManagersTest
Tests run: 1, Failures: 0, Errors: 0, Skipped: 0, Time elapsed: 0 sec - in org.apache.qpid.server.security.auth.manager.MultipleAuthenticationManagersTest
Running org.apache.qpid.server.logging.ExchangeLoggingTest
Tests run: 4, Failures: 0, Errors: 0, Skipped: 0, Time elapsed: 0.003 sec - in org.apache.qpid.server.logging.ExchangeLoggingTest
Running org.apache.qpid.server.logging.TransientQueueLoggingTest
Tests run: 5, Failures: 0, Errors: 0, Skipped: 0, Time elapsed: 0.002 sec - in org.apache.qpid.server.logging.TransientQueueLoggingTest
Running org.apache.qpid.server.logging.VirtualHostLoggingTest
Tests run: 2, Failures: 0, Errors: 0, Skipped: 0, Time elapsed: 0.001 sec - in org.apache.qpid.server.logging.VirtualHostLoggingTest
Running org.apache.qpid.server.logging.ConsumerLoggingTest
Tests run: 6, Failures: 0, Errors: 0, Skipped: 0, Time elapsed: 0.003 sec - in org.apache.qpid.server.logging.ConsumerLoggingTest
Running org.apache.qpid.server.logging.ConnectionLoggingTest
Tests run: 2, Failures: 0, Errors: 0, Skipped: 0, Time elapsed: 0.001 sec - in org.apache.qpid.server.logging.ConnectionLoggingTest
Running org.apache.qpid.server.logging.QueueLoggingTest
Tests run: 2, Failures: 0, Errors: 0, Skipped: 0, Time elapsed: 0.001 sec - in org.apache.qpid.server.logging.QueueLoggingTest
Running org.apache.qpid.server.logging.AccessControlLoggingTest
Tests run: 4, Failures: 0, Errors: 0, Skipped: 0, Time elapsed: 0.003 sec - in org.apache.qpid.server.logging.AccessControlLoggingTest
Running org.apache.qpid.server.logging.BrokerLoggingTest
Tests run: 8, Failures: 0, Errors: 0, Skipped: 0, Time elapsed: 0.006 sec - in org.apache.qpid.server.logging.BrokerLoggingTest
Running org.apache.qpid.server.logging.AlertingTest
Tests run: 3, Failures: 0, Errors: 0, Skipped: 0, Time elapsed: 0.002 sec - in org.apache.qpid.server.logging.AlertingTest
Running org.apache.qpid.server.logging.ChannelLoggingTest
Tests run: 6, Failures: 0, Errors: 0, Skipped: 0, Time elapsed: 0.004 sec - in org.apache.qpid.server.logging.ChannelLoggingTest
Running org.apache.qpid.server.logging.DurableQueueLoggingTest
Tests run: 5, Failures: 0, Errors: 0, Skipped: 0, Time elapsed: 0.003 sec - in org.apache.qpid.server.logging.DurableQueueLoggingTest
Running org.apache.qpid.server.AbruptClientDisconnectTest
Tests run: 2, Failures: 0, Errors: 0, Skipped: 0, Time elapsed: 5.697 sec - in org.apache.qpid.server.AbruptClientDisconnectTest
Running org.apache.qpid.server.persistent.NoLocalAfterRecoveryTest
Tests run: 2, Failures: 0, Errors: 0, Skipped: 0, Time elapsed: 0.001 sec - in org.apache.qpid.server.persistent.NoLocalAfterRecoveryTest
Running org.apache.qpid.server.store.PersistentStoreTest
Tests run: 5, Failures: 0, Errors: 0, Skipped: 0, Time elapsed: 0.004 sec - in org.apache.qpid.server.store.PersistentStoreTest
Running org.apache.qpid.server.store.SplitStoreTest
Tests run: 2, Failures: 0, Errors: 0, Skipped: 0, Time elapsed: 0.001 sec - in org.apache.qpid.server.store.SplitStoreTest
Running org.apache.qpid.server.queue.QueueDepthWithSelectorTest
Tests run: 1, Failures: 0, Errors: 0, Skipped: 0, Time elapsed: 0.168 sec - in org.apache.qpid.server.queue.QueueDepthWithSelectorTest
Running org.apache.qpid.server.queue.ConsumerPriorityTest
Tests run: 5, Failures: 0, Errors: 0, Skipped: 0, Time elapsed: 0.004 sec - in org.apache.qpid.server.queue.ConsumerPriorityTest
Running org.apache.qpid.server.queue.MultipleTransactedBatchProducerTest
Tests run: 1, Failures: 0, Errors: 0, Skipped: 0, Time elapsed: 6.065 sec - in org.apache.qpid.server.queue.MultipleTransactedBatchProducerTest
Running org.apache.qpid.server.queue.LastValueQueueTest
Tests run: 7, Failures: 0, Errors: 0, Skipped: 0, Time elapsed: 13.998 sec - in org.apache.qpid.server.queue.LastValueQueueTest
Running org.apache.qpid.server.queue.PriorityQueueTest
Tests run: 3, Failures: 0, Errors: 0, Skipped: 0, Time elapsed: 1.292 sec - in org.apache.qpid.server.queue.PriorityQueueTest
Running org.apache.qpid.server.queue.ProducerFlowControlTest
Tests run: 7, Failures: 0, Errors: 0, Skipped: 0, Time elapsed: 0.006 sec - in org.apache.qpid.server.queue.ProducerFlowControlTest
Running org.apache.qpid.server.queue.LiveQueueOperationsTest
Tests run: 1, Failures: 0, Errors: 0, Skipped: 0, Time elapsed: 0.001 sec - in org.apache.qpid.server.queue.LiveQueueOperationsTest
Running org.apache.qpid.server.queue.SortedQueueTest
Tests run: 8, Failures: 0, Errors: 0, Skipped: 0, Time elapsed: 0.018 sec - in org.apache.qpid.server.queue.SortedQueueTest
Running org.apache.qpid.server.queue.MessageGroupQueueTest
Tests run: 11, Failures: 0, Errors: 0, Skipped: 0, Time elapsed: 6.259 sec - in org.apache.qpid.server.queue.MessageGroupQueueTest
Running org.apache.qpid.server.queue.EnsureNondestructiveConsumersTest
Tests run: 1, Failures: 0, Errors: 0, Skipped: 0, Time elapsed: 0 sec - in org.apache.qpid.server.queue.EnsureNondestructiveConsumersTest
Running org.apache.qpid.server.queue.QueueMessageDurabilityTest
Tests run: 4, Failures: 0, Errors: 0, Skipped: 0, Time elapsed: 0.003 sec - in org.apache.qpid.server.queue.QueueMessageDurabilityTest
Running org.apache.qpid.server.queue.ArrivalTimeFilterTest
Tests run: 2, Failures: 0, Errors: 0, Skipped: 0, Time elapsed: 0.002 sec - in org.apache.qpid.server.queue.ArrivalTimeFilterTest
Running org.apache.qpid.server.queue.ModelTest
Tests run: 4, Failures: 0, Errors: 0, Skipped: 0, Time elapsed: 0.002 sec - in org.apache.qpid.server.queue.ModelTest
Running org.apache.qpid.server.queue.FlowToDiskTest
Tests run: 1, Failures: 0, Errors: 0, Skipped: 0, Time elapsed: 0 sec - in org.apache.qpid.server.queue.FlowToDiskTest
Running org.apache.qpid.server.queue.TimeToLiveTest
Tests run: 5, Failures: 0, Errors: 0, Skipped: 0, Time elapsed: 2.166 sec - in org.apache.qpid.server.queue.TimeToLiveTest
Running org.apache.qpid.server.queue.NodeAutoCreationPolicyTest
Tests run: 9, Failures: 0, Errors: 0, Skipped: 0, Time elapsed: 0.016 sec - in org.apache.qpid.server.queue.NodeAutoCreationPolicyTest
Running org.apache.qpid.server.queue.QueueBindTest
Tests run: 2, Failures: 0, Errors: 0, Skipped: 0, Time elapsed: 0.095 sec - in org.apache.qpid.server.queue.QueueBindTest
Running org.apache.qpid.server.queue.DefaultFiltersTest
Tests run: 2, Failures: 0, Errors: 0, Skipped: 0, Time elapsed: 0.001 sec - in org.apache.qpid.server.queue.DefaultFiltersTest
Running org.apache.qpid.server.stats.StatisticsReportingTest
Tests run: 2, Failures: 0, Errors: 0, Skipped: 0, Time elapsed: 0.001 sec - in org.apache.qpid.server.stats.StatisticsReportingTest
Running org.apache.qpid.server.routing.AlternateBindingRoutingTest
Tests run: 1, Failures: 0, Errors: 0, Skipped: 0, Time elapsed: 0 sec - in org.apache.qpid.server.routing.AlternateBindingRoutingTest
Running org.apache.qpid.server.routing.ExchangeRoutingTest
Tests run: 3, Failures: 0, Errors: 0, Skipped: 0, Time elapsed: 0.002 sec - in org.apache.qpid.server.routing.ExchangeRoutingTest
Running org.apache.qpid.server.message.MessageProtocolConversionTest
Tests run: 2, Failures: 0, Errors: 0, Skipped: 0, Time elapsed: 0.002 sec - in org.apache.qpid.server.message.MessageProtocolConversionTest
Running org.apache.qpid.server.exchange.ReturnUnroutableMandatoryMessageTest
Tests run: 3, Failures: 0, Errors: 0, Skipped: 0, Time elapsed: 0.002 sec - in org.apache.qpid.server.exchange.ReturnUnroutableMandatoryMessageTest
Running org.apache.qpid.server.SupportedProtocolVersionsTest
Tests run: 4, Failures: 0, Errors: 0, Skipped: 0, Time elapsed: 0.003 sec - in org.apache.qpid.server.SupportedProtocolVersionsTest
Running org.apache.qpid.server.failover.FailoverMethodTest
Tests run: 3, Failures: 0, Errors: 0, Skipped: 0, Time elapsed: 0.002 sec - in org.apache.qpid.server.failover.FailoverMethodTest
Running org.apache.qpid.server.BrokerStartupTest
Tests run: 2, Failures: 0, Errors: 0, Skipped: 0, Time elapsed: 0.001 sec - in org.apache.qpid.server.BrokerStartupTest
Running org.apache.qpid.util.LogMonitorTest
Tests run: 8, Failures: 0, Errors: 0, Skipped: 0, Time elapsed: 2.02 sec - in org.apache.qpid.util.LogMonitorTest
Running org.apache.qpid.transport.MaxFrameSizeTest
Tests run: 2, Failures: 0, Errors: 0, Skipped: 0, Time elapsed: 0.004 sec - in org.apache.qpid.transport.MaxFrameSizeTest
Running org.apache.qpid.transport.ConnectionEstablishmentTest
Tests run: 1, Failures: 0, Errors: 0, Skipped: 0, Time elapsed: 0.001 sec - in org.apache.qpid.transport.ConnectionEstablishmentTest
Running org.apache.qpid.transport.ProtocolNegotiationTest
Tests run: 5, Failures: 0, Errors: 0, Skipped: 0, Time elapsed: 0.208 sec - in org.apache.qpid.transport.ProtocolNegotiationTest
Running org.apache.qpid.client.HeartbeatTest
Tests run: 8, Failures: 0, Errors: 0, Skipped: 0, Time elapsed: 14.53 sec - in org.apache.qpid.client.HeartbeatTest
Running org.apache.qpid.client.prefetch.PrefetchBehaviourTest
Tests run: 4, Failures: 0, Errors: 0, Skipped: 0, Time elapsed: 5.436 sec - in org.apache.qpid.client.prefetch.PrefetchBehaviourTest
Running org.apache.qpid.client.redelivered.RedeliveredMessageTest
Tests run: 1, Failures: 0, Errors: 0, Skipped: 0, Time elapsed: 0.219 sec - in org.apache.qpid.client.redelivered.RedeliveredMessageTest
Running org.apache.qpid.client.ssl.SSLTest
Tests run: 17, Failures: 0, Errors: 0, Skipped: 0, Time elapsed: 0.028 sec - in org.apache.qpid.client.ssl.SSLTest
Running org.apache.qpid.client.AsynchMessageListenerTest
Tests run: 9, Failures: 0, Errors: 0, Skipped: 0, Time elapsed: 1.341 sec - in org.apache.qpid.client.AsynchMessageListenerTest
Running org.apache.qpid.client.SynchReceiveTest
Tests run: 4, Failures: 0, Errors: 0, Skipped: 0, Time elapsed: 1.271 sec - in org.apache.qpid.client.SynchReceiveTest
Running org.apache.qpid.client.SyncPublishTest
Tests run: 1, Failures: 0, Errors: 0, Skipped: 0, Time elapsed: 0.001 sec - in org.apache.qpid.client.SyncPublishTest
Running org.apache.qpid.client.message.AMQPEncodedMapMessageTest
Tests run: 6, Failures: 0, Errors: 0, Skipped: 0, Time elapsed: 0.594 sec - in org.apache.qpid.client.message.AMQPEncodedMapMessageTest
Running org.apache.qpid.client.message.ObjectMessageClassWhitelistingTest
Tests run: 9, Failures: 0, Errors: 0, Skipped: 0, Time elapsed: 0.927 sec - in org.apache.qpid.client.message.ObjectMessageClassWhitelistingTest
Running org.apache.qpid.client.connection.ExistingSocketTest
Tests run: 2, Failures: 0, Errors: 0, Skipped: 0, Time elapsed: 0.226 sec - in org.apache.qpid.client.connection.ExistingSocketTest
Running org.apache.qpid.client.failover.FailoverBehaviourTest
Tests run: 37, Failures: 0, Errors: 0, Skipped: 0, Time elapsed: 45.821 sec - in org.apache.qpid.client.failover.FailoverBehaviourTest
Running org.apache.qpid.client.failover.AddressBasedFailoverBehaviourTest
Tests run: 37, Failures: 0, Errors: 0, Skipped: 0, Time elapsed: 46.489 sec - in org.apache.qpid.client.failover.AddressBasedFailoverBehaviourTest
Running org.apache.qpid.client.failover.MultipleBrokersFailoverTest
Tests run: 2, Failures: 0, Errors: 0, Skipped: 0, Time elapsed: 0 sec - in org.apache.qpid.client.failover.MultipleBrokersFailoverTest
Running org.apache.qpid.client.session.QueueDeclareTest
Tests run: 3, Failures: 0, Errors: 0, Skipped: 0, Time elapsed: 0.255 sec - in org.apache.qpid.client.session.QueueDeclareTest
Running org.apache.qpid.client.session.QueueDeleteTest
Tests run: 2, Failures: 0, Errors: 0, Skipped: 0, Time elapsed: 0.143 sec - in org.apache.qpid.client.session.QueueDeleteTest
Running org.apache.qpid.client.session.ExchangeDeleteTest
Tests run: 2, Failures: 0, Errors: 0, Skipped: 0, Time elapsed: 0.126 sec - in org.apache.qpid.client.session.ExchangeDeleteTest
Running org.apache.qpid.client.TemporaryQueuePrefixTest
Tests run: 4, Failures: 0, Errors: 0, Skipped: 0, Time elapsed: 0.004 sec - in org.apache.qpid.client.TemporaryQueuePrefixTest
Running org.apache.qpid.client.SessionCreateTest
Tests run: 1, Failures: 0, Errors: 0, Skipped: 0, Time elapsed: 65.385 sec - in org.apache.qpid.client.SessionCreateTest
Running org.apache.qpid.systest.MessageRoutingTest
Tests run: 7, Failures: 0, Errors: 0, Skipped: 0, Time elapsed: 0.004 sec - in org.apache.qpid.systest.MessageRoutingTest
Running org.apache.qpid.systest.MessageCompressionTest
Tests run: 10, Failures: 0, Errors: 0, Skipped: 0, Time elapsed: 0.007 sec - in org.apache.qpid.systest.MessageCompressionTest
Running org.apache.qpid.systest.prefetch.ZeroPrefetchTest
Tests run: 1, Failures: 0, Errors: 0, Skipped: 0, Time elapsed: 0.083 sec - in org.apache.qpid.systest.prefetch.ZeroPrefetchTest
Running org.apache.qpid.systest.management.amqp.AmqpManagementTest
Tests run: 18, Failures: 0, Errors: 0, Skipped: 0, Time elapsed: 0.016 sec - in org.apache.qpid.systest.management.amqp.AmqpManagementTest
Running org.apache.qpid.systest.AnonymousProducerTest
Tests run: 4, Failures: 0, Errors: 0, Skipped: 0, Time elapsed: 0.169 sec - in org.apache.qpid.systest.AnonymousProducerTest
Running org.apache.qpid.systest.rest.GroupProviderRestTest
Tests run: 10, Failures: 0, Errors: 0, Skipped: 0, Time elapsed: 0.01 sec - in org.apache.qpid.systest.rest.GroupProviderRestTest
Running org.apache.qpid.systest.rest.UserPreferencesRestTest
Tests run: 9, Failures: 0, Errors: 0, Skipped: 0, Time elapsed: 0.007 sec - in org.apache.qpid.systest.rest.UserPreferencesRestTest
Running org.apache.qpid.systest.rest.AnonymousAccessRestTest
Tests run: 4, Failures: 0, Errors: 0, Skipped: 0, Time elapsed: 0.002 sec - in org.apache.qpid.systest.rest.AnonymousAccessRestTest
Running org.apache.qpid.systest.rest.PublishMessageRestTest
Tests run: 6, Failures: 0, Errors: 0, Skipped: 0, Time elapsed: 0.003 sec - in org.apache.qpid.systest.rest.PublishMessageRestTest
Running org.apache.qpid.systest.rest.PreemtiveAuthRestTest
Tests run: 8, Failures: 0, Errors: 0, Skipped: 0, Time elapsed: 0.004 sec - in org.apache.qpid.systest.rest.PreemtiveAuthRestTest
Running org.apache.qpid.systest.rest.AccessControlProviderRestTest
Tests run: 4, Failures: 0, Errors: 0, Skipped: 0, Time elapsed: 0.002 sec - in org.apache.qpid.systest.rest.AccessControlProviderRestTest
Running org.apache.qpid.systest.rest.BrokerRestHttpsTest
Tests run: 1, Failures: 0, Errors: 0, Skipped: 0, Time elapsed: 0 sec - in org.apache.qpid.systest.rest.BrokerRestHttpsTest
Running org.apache.qpid.systest.rest.SaslRestTest
Tests run: 14, Failures: 0, Errors: 0, Skipped: 0, Time elapsed: 0.007 sec - in org.apache.qpid.systest.rest.SaslRestTest
Running org.apache.qpid.systest.rest.VirtualHostRestTest
Tests run: 28, Failures: 0, Errors: 0, Skipped: 0, Time elapsed: 0.015 sec - in org.apache.qpid.systest.rest.VirtualHostRestTest
Running org.apache.qpid.systest.rest.BrokerRestTest
Tests run: 6, Failures: 0, Errors: 0, Skipped: 0, Time elapsed: 0.002 sec - in org.apache.qpid.systest.rest.BrokerRestTest
Running org.apache.qpid.systest.rest.StructureRestTest
Tests run: 1, Failures: 0, Errors: 0, Skipped: 0, Time elapsed: 0 sec - in org.apache.qpid.systest.rest.StructureRestTest
Running org.apache.qpid.systest.rest.KeyStoreRestTest
Tests run: 5, Failures: 0, Errors: 0, Skipped: 0, Time elapsed: 0.002 sec - in org.apache.qpid.systest.rest.KeyStoreRestTest
Running org.apache.qpid.systest.rest.ConnectionRestTest
Tests run: 9, Failures: 0, Errors: 0, Skipped: 0, Time elapsed: 0.005 sec - in org.apache.qpid.systest.rest.ConnectionRestTest
Running org.apache.qpid.systest.rest.CompressedResponsesRestTest
Tests run: 4, Failures: 0, Errors: 0, Skipped: 0, Time elapsed: 0.002 sec - in org.apache.qpid.systest.rest.CompressedResponsesRestTest
Running org.apache.qpid.systest.rest.VirtualHostNodeRestTest
Tests run: 9, Failures: 0, Errors: 0, Skipped: 0, Time elapsed: 0.006 sec - in org.apache.qpid.systest.rest.VirtualHostNodeRestTest
Running org.apache.qpid.systest.rest.UserRestTest
Tests run: 7, Failures: 0, Errors: 0, Skipped: 0, Time elapsed: 0.004 sec - in org.apache.qpid.systest.rest.UserRestTest
Running org.apache.qpid.systest.rest.PortRestTest
Tests run: 12, Failures: 0, Errors: 0, Skipped: 0, Time elapsed: 0.039 sec - in org.apache.qpid.systest.rest.PortRestTest
Running org.apache.qpid.systest.rest.BrokerRestHttpsClientCertAuthTest
Tests run: 1, Failures: 0, Errors: 0, Skipped: 0, Time elapsed: 0.001 sec - in org.apache.qpid.systest.rest.BrokerRestHttpsClientCertAuthTest
Running org.apache.qpid.systest.rest.MessagesRestTest
Tests run: 14, Failures: 0, Errors: 0, Skipped: 0, Time elapsed: 0.008 sec - in org.apache.qpid.systest.rest.MessagesRestTest
Running org.apache.qpid.systest.rest.QueueRestTest
Tests run: 8, Failures: 0, Errors: 0, Skipped: 0, Time elapsed: 0.004 sec - in org.apache.qpid.systest.rest.QueueRestTest
Running org.apache.qpid.systest.rest.TrustStoreRestTest
Tests run: 5, Failures: 0, Errors: 0, Skipped: 0, Time elapsed: 0.002 sec - in org.apache.qpid.systest.rest.TrustStoreRestTest
Running org.apache.qpid.systest.rest.ExportImportMessagesRestTest
Tests run: 1, Failures: 0, Errors: 0, Skipped: 0, Time elapsed: 0 sec - in org.apache.qpid.systest.rest.ExportImportMessagesRestTest
Running org.apache.qpid.systest.rest.QueryRestTest
Tests run: 4, Failures: 0, Errors: 0, Skipped: 0, Time elapsed: 0.002 sec - in org.apache.qpid.systest.rest.QueryRestTest
Running org.apache.qpid.systest.rest.acl.BrokerACLTest
Tests run: 45, Failures: 0, Errors: 0, Skipped: 0, Time elapsed: 0.026 sec - in org.apache.qpid.systest.rest.acl.BrokerACLTest
Running org.apache.qpid.systest.rest.acl.ExchangeRestACLTest
Tests run: 9, Failures: 0, Errors: 0, Skipped: 0, Time elapsed: 0.008 sec - in org.apache.qpid.systest.rest.acl.ExchangeRestACLTest
Running org.apache.qpid.systest.rest.acl.VirtualHostNodeACLTest
Tests run: 3, Failures: 0, Errors: 0, Skipped: 0, Time elapsed: 0.003 sec - in org.apache.qpid.systest.rest.acl.VirtualHostNodeACLTest
Running org.apache.qpid.systest.rest.acl.UserRestACLTest
Tests run: 3, Failures: 0, Errors: 0, Skipped: 0, Time elapsed: 0.003 sec - in org.apache.qpid.systest.rest.acl.UserRestACLTest
Running org.apache.qpid.systest.rest.acl.VirtualHostACLTest
Tests run: 6, Failures: 0, Errors: 0, Skipped: 0, Time elapsed: 0.005 sec - in org.apache.qpid.systest.rest.acl.VirtualHostACLTest
Running org.apache.qpid.systest.rest.acl.GroupRestACLTest
Tests run: 4, Failures: 0, Errors: 0, Skipped: 0, Time elapsed: 0.003 sec - in org.apache.qpid.systest.rest.acl.GroupRestACLTest
Running org.apache.qpid.systest.rest.acl.VirtualHostAccessControlProviderRestTest
Tests run: 7, Failures: 0, Errors: 0, Skipped: 0, Time elapsed: 0.007 sec - in org.apache.qpid.systest.rest.acl.VirtualHostAccessControlProviderRestTest
Running org.apache.qpid.systest.rest.acl.QueueRestACLTest
Tests run: 7, Failures: 0, Errors: 0, Skipped: 0, Time elapsed: 0.005 sec - in org.apache.qpid.systest.rest.acl.QueueRestACLTest
Running org.apache.qpid.systest.rest.ExchangeRestTest
Tests run: 4, Failures: 0, Errors: 0, Skipped: 0, Time elapsed: 0.002 sec - in org.apache.qpid.systest.rest.ExchangeRestTest
Running org.apache.qpid.systest.rest.HttpManagementRestTest
Tests run: 3, Failures: 0, Errors: 0, Skipped: 0, Time elapsed: 0.002 sec - in org.apache.qpid.systest.rest.HttpManagementRestTest
Running org.apache.qpid.systest.rest.GroupRestTest
Tests run: 5, Failures: 0, Errors: 0, Skipped: 0, Time elapsed: 0.003 sec - in org.apache.qpid.systest.rest.GroupRestTest
Running org.apache.qpid.systest.rest.AuthenticationProviderRestTest
Tests run: 9, Failures: 0, Errors: 0, Skipped: 0, Time elapsed: 0.007 sec - in org.apache.qpid.systest.rest.AuthenticationProviderRestTest
Running org.apache.qpid.systest.rest.BrokerRestHttpAndHttpsTest
Tests run: 4, Failures: 0, Errors: 0, Skipped: 0, Time elapsed: 0.002 sec - in org.apache.qpid.systest.rest.BrokerRestHttpAndHttpsTest
Running org.apache.qpid.systest.rest.VirtualHostLoggerRestTest
Tests run: 2, Failures: 0, Errors: 0, Skipped: 0, Time elapsed: 0.001 sec - in org.apache.qpid.systest.rest.VirtualHostLoggerRestTest
Running org.apache.qpid.systest.messageencryption.MessageEncryptionTest
Tests run: 8, Failures: 0, Errors: 0, Skipped: 0, Time elapsed: 0.057 sec - in org.apache.qpid.systest.messageencryption.MessageEncryptionTest

Results :

Tests in error: 
  BrokerClosesClientConnectionTest>QpidTestCase.run:165->QpidBrokerTestCase.runBare:91->QpidBrokerTestCase.tearDown:574
ยป JMS

Tests run: 1050, Failures: 0, Errors: 1, Skipped: 0

[INFO] ------------------------------------------------------------------------
[INFO] BUILD FAILURE
[INFO] ------------------------------------------------------------------------
[INFO] Total time: 06:16 min
[INFO] Finished at: 2017-10-12T12:17:32Z
[INFO] Final Memory: 46M/1545M
[INFO] ------------------------------------------------------------------------
[ERROR] Failed to execute goal org.apache.maven.plugins:maven-surefire-plugin:2.19.1:test
(integration-test) on project qpid-systests: There are test failures.
[ERROR] 
[ERROR] Please refer to <https://builds.apache.org/job/Qpid-cpp-JMS-AMQP-0-x-Test/4208/artifact/qpid-broker-j/systests/target/surefire-reports/cpp>
for the individual test results.
[ERROR] -> [Help 1]
[ERROR] 
[ERROR] To see the full stack trace of the errors, re-run Maven with the -e switch.
[ERROR] Re-run Maven using the -X switch to enable full debug logging.
[ERROR] 
[ERROR] For more information about the errors and possible solutions, please read the following
articles:
[ERROR] [Help 1] http://cwiki.apache.org/confluence/display/MAVEN/MojoFailureException
Build step 'Invoke top-level Maven targets' marked build as failure
[locks-and-latches] Releasing all the locks
[locks-and-latches] All the locks released
Archiving artifacts
Recording test results

Mime
View raw message