qpid-notifications mailing list archives

Site index · List index
Message view « Date » · « Thread »
Top « Date » · « Thread »
From Apache Jenkins Server <jenk...@builds.apache.org>
Subject Build failed in Jenkins: Qpid-BrokerForJava-TestMatrix » ubuntu,JDK 1.8 (latest),java-bdb.0-9-1 #3887
Date Wed, 13 Sep 2017 09:47:25 GMT
See <https://builds.apache.org/job/Qpid-BrokerForJava-TestMatrix/Ubuntu%20Slaves=ubuntu,jdk=JDK%201.8%20(latest),profile=java-bdb.0-9-1/3887/display/redirect?page=changes>

Changes:

[kwall] NO-JIRA: Exclude new  org.apache.qpid.server.routing.ExchangeRoutingTest

------------------------------------------
[...truncated 390.17 KB...]
[INFO] ------------------------------------------------------------------------
[INFO] Building Apache Qpid for Java Docbook 7.0.0-SNAPSHOT
[INFO] ------------------------------------------------------------------------
[INFO] 
[INFO] --- maven-clean-plugin:3.0.0:clean (default-clean) @ qpid-java-doc ---
[INFO] 
[INFO] --- maven-antrun-plugin:1.8:run (output-test-properties) @ qpid-java-doc ---
[INFO] Executing tasks

main:
     [echo] Qpid Test Profile Properties
     [echo] [profile] java-bdb.0-9-1
     [echo] [profile.broker.language] java
     [echo] [profile.broker.type] internal
     [echo] [profile.broker.command] "<https://builds.apache.org/job/Qpid-BrokerForJava-TestMatrix/Ubuntu%20Slaves=ubuntu,jdk=JDK%201.8%20(latest),profile=java-bdb.0-9-1/ws/doc/bin/qpid-server">
-sp "@STORE_PATH" -st @STORE_TYPE -prop test.port=@PORT -prop "qpid.work_dir=@QPID_WORK"
     [echo] [profile.specific.excludes] JavaPersistentExcludes XAExcludes JavaPre010Excludes
JavaBDBExcludes
     [echo] [profile.test.excludes] Excludes JavaExcludes java-bdb.0-9-1.excludes JavaPersistentExcludes
XAExcludes JavaPre010Excludes JavaBDBExcludes
     [echo] [profile.broker.version] v0_9_1
     [echo] [profile.test.amqp_port_protocols] ["AMQP_0_8","AMQP_0_9","AMQP_0_9_1"]
     [echo] [profile.broker.persistent] true
     [echo] [profile.virtualhostnode.type] BDB
     [echo] [profile.virtualhostnode.context.blueprint] {"type":"ProvidedStore","globalAddressDomains":"${qpid.globalAddressDomains}"}
     [echo] [profile.test_receive_timeout] 1000
[INFO] Executed tasks
[INFO] 
[INFO] --- maven-enforcer-plugin:1.4.1:enforce (enforce-minimum-versions) @ qpid-java-doc
---
[INFO] 
[INFO] --- maven-enforcer-plugin:1.4.1:enforce (enforce-versions-standard-properties) @ qpid-java-doc
---
[INFO] 
[INFO] --- maven-enforcer-plugin:1.4.1:enforce (enforce-enableAmqp10) @ qpid-java-doc ---
[INFO] 
[INFO] --- jacoco-maven-plugin:0.7.5.201505241946:prepare-agent (default-prepare-agent) @
qpid-java-doc ---
[INFO] argLine set to "-javaagent:/home/jenkins/.m2/repository/org/jacoco/org.jacoco.agent/0.7.5.201505241946/org.jacoco.agent-0.7.5.201505241946-runtime.jar=destfile=<https://builds.apache.org/job/Qpid-BrokerForJava-TestMatrix/Ubuntu%20Slaves=ubuntu,jdk=JDK%201.8%20(latest),profile=java-bdb.0-9-1/ws/doc/target/jacoco.exec">
-Xmx512m
[INFO] 
[INFO] --- maven-remote-resources-plugin:1.5:process (process-resource-bundles) @ qpid-java-doc
---
[INFO] 
[INFO] --- maven-site-plugin:3.5.1:attach-descriptor (attach-descriptor) @ qpid-java-doc ---
[INFO] 
[INFO] --- maven-assembly-plugin:2.6:single (default) @ qpid-java-doc ---
[INFO] Assemblies have been skipped per configuration of the skipAssembly parameter.
[INFO] 
[INFO] ------------------------------------------------------------------------
[INFO] Building Apache Qpid Broker for Java Docbook 7.0.0-SNAPSHOT
[INFO] ------------------------------------------------------------------------
[INFO] 
[INFO] --- maven-clean-plugin:3.0.0:clean (default-clean) @ qpid-java-doc-broker ---
[INFO] 
[INFO] --- maven-antrun-plugin:1.8:run (output-test-properties) @ qpid-java-doc-broker ---
[INFO] Executing tasks

main:
     [echo] Qpid Test Profile Properties
     [echo] [profile] java-bdb.0-9-1
     [echo] [profile.broker.language] java
     [echo] [profile.broker.type] internal
     [echo] [profile.broker.command] "<https://builds.apache.org/job/Qpid-BrokerForJava-TestMatrix/Ubuntu%20Slaves=ubuntu,jdk=JDK%201.8%20(latest),profile=java-bdb.0-9-1/ws/doc/java-broker/bin/qpid-server">
-sp "@STORE_PATH" -st @STORE_TYPE -prop test.port=@PORT -prop "qpid.work_dir=@QPID_WORK"
     [echo] [profile.specific.excludes] JavaPersistentExcludes XAExcludes JavaPre010Excludes
JavaBDBExcludes
     [echo] [profile.test.excludes] Excludes JavaExcludes java-bdb.0-9-1.excludes JavaPersistentExcludes
XAExcludes JavaPre010Excludes JavaBDBExcludes
     [echo] [profile.broker.version] v0_9_1
     [echo] [profile.test.amqp_port_protocols] ["AMQP_0_8","AMQP_0_9","AMQP_0_9_1"]
     [echo] [profile.broker.persistent] true
     [echo] [profile.virtualhostnode.type] BDB
     [echo] [profile.virtualhostnode.context.blueprint] {"type":"ProvidedStore","globalAddressDomains":"${qpid.globalAddressDomains}"}
     [echo] [profile.test_receive_timeout] 1000
[INFO] Executed tasks
[INFO] 
[INFO] --- maven-enforcer-plugin:1.4.1:enforce (enforce-minimum-versions) @ qpid-java-doc-broker
---
[INFO] 
[INFO] --- maven-enforcer-plugin:1.4.1:enforce (enforce-versions-standard-properties) @ qpid-java-doc-broker
---
[INFO] 
[INFO] --- maven-enforcer-plugin:1.4.1:enforce (enforce-enableAmqp10) @ qpid-java-doc-broker
---
[INFO] 
[INFO] --- jacoco-maven-plugin:0.7.5.201505241946:prepare-agent (default-prepare-agent) @
qpid-java-doc-broker ---
[INFO] argLine set to "-javaagent:/home/jenkins/.m2/repository/org/jacoco/org.jacoco.agent/0.7.5.201505241946/org.jacoco.agent-0.7.5.201505241946-runtime.jar=destfile=<https://builds.apache.org/job/Qpid-BrokerForJava-TestMatrix/Ubuntu%20Slaves=ubuntu,jdk=JDK%201.8%20(latest),profile=java-bdb.0-9-1/ws/doc/java-broker/target/jacoco.exec">
-Xmx512m
[INFO] 
[INFO] --- maven-resources-plugin:2.7:copy-resources (filter-docbook-sources) @ qpid-java-doc-broker
---
[INFO] Using 'UTF-8' encoding to copy filtered resources.
[INFO] Copying 77 resources
[INFO] 
[INFO] --- maven-remote-resources-plugin:1.5:process (process-resource-bundles) @ qpid-java-doc-broker
---
[INFO] 
[INFO] --- maven-resources-plugin:2.7:resources (default-resources) @ qpid-java-doc-broker
---
[INFO] Using 'UTF-8' encoding to copy filtered resources.
[INFO] Copying 77 resources
[INFO] 
[INFO] --- maven-compiler-plugin:3.5.1:compile (default-compile) @ qpid-java-doc-broker ---
[INFO] No sources to compile
[INFO] 
[INFO] --- maven-resources-plugin:2.7:testResources (default-testResources) @ qpid-java-doc-broker
---
[INFO] Using 'UTF-8' encoding to copy filtered resources.
[INFO] Copying 77 resources
[INFO] 
[INFO] --- maven-compiler-plugin:3.5.1:testCompile (default-testCompile) @ qpid-java-doc-broker
---
[INFO] No sources to compile
[INFO] 
[INFO] --- maven-surefire-plugin:2.19.1:test (default-test) @ qpid-java-doc-broker ---
[INFO] Tests are skipped.
[INFO] 
[INFO] --- maven-jar-plugin:3.0.0:jar (default-jar) @ qpid-java-doc-broker ---
[WARNING] JAR will be empty - no content was marked for inclusion!
[INFO] Building jar: <https://builds.apache.org/job/Qpid-BrokerForJava-TestMatrix/Ubuntu%20Slaves=ubuntu,jdk=JDK%201.8%20(latest),profile=java-bdb.0-9-1/ws/doc/java-broker/target/qpid-java-doc-broker-7.0.0-SNAPSHOT.jar>
[INFO] 
[INFO] --- maven-site-plugin:3.5.1:attach-descriptor (attach-descriptor) @ qpid-java-doc-broker
---
[INFO] 
[INFO] --- maven-assembly-plugin:2.6:single (default) @ qpid-java-doc-broker ---
[INFO] Assemblies have been skipped per configuration of the skipAssembly parameter.
[INFO] 
[INFO] ------------------------------------------------------------------------
[INFO] Building Apache Qpid Performance Test Docbook 7.0.0-SNAPSHOT
[INFO] ------------------------------------------------------------------------
[INFO] 
[INFO] --- maven-clean-plugin:3.0.0:clean (default-clean) @ qpid-java-doc-perftests ---
[INFO] 
[INFO] --- maven-antrun-plugin:1.8:run (output-test-properties) @ qpid-java-doc-perftests
---
[INFO] Executing tasks

main:
     [echo] Qpid Test Profile Properties
     [echo] [profile] java-bdb.0-9-1
     [echo] [profile.broker.language] java
     [echo] [profile.broker.type] internal
     [echo] [profile.broker.command] "<https://builds.apache.org/job/Qpid-BrokerForJava-TestMatrix/Ubuntu%20Slaves=ubuntu,jdk=JDK%201.8%20(latest),profile=java-bdb.0-9-1/ws/doc/java-perftests/bin/qpid-server">
-sp "@STORE_PATH" -st @STORE_TYPE -prop test.port=@PORT -prop "qpid.work_dir=@QPID_WORK"
     [echo] [profile.specific.excludes] JavaPersistentExcludes XAExcludes JavaPre010Excludes
JavaBDBExcludes
     [echo] [profile.test.excludes] Excludes JavaExcludes java-bdb.0-9-1.excludes JavaPersistentExcludes
XAExcludes JavaPre010Excludes JavaBDBExcludes
     [echo] [profile.broker.version] v0_9_1
     [echo] [profile.test.amqp_port_protocols] ["AMQP_0_8","AMQP_0_9","AMQP_0_9_1"]
     [echo] [profile.broker.persistent] true
     [echo] [profile.virtualhostnode.type] BDB
     [echo] [profile.virtualhostnode.context.blueprint] {"type":"ProvidedStore","globalAddressDomains":"${qpid.globalAddressDomains}"}
     [echo] [profile.test_receive_timeout] 1000
[INFO] Executed tasks
[INFO] 
[INFO] --- maven-enforcer-plugin:1.4.1:enforce (enforce-minimum-versions) @ qpid-java-doc-perftests
---
[INFO] 
[INFO] --- maven-enforcer-plugin:1.4.1:enforce (enforce-versions-standard-properties) @ qpid-java-doc-perftests
---
[INFO] 
[INFO] --- maven-enforcer-plugin:1.4.1:enforce (enforce-enableAmqp10) @ qpid-java-doc-perftests
---
[INFO] 
[INFO] --- jacoco-maven-plugin:0.7.5.201505241946:prepare-agent (default-prepare-agent) @
qpid-java-doc-perftests ---
[INFO] argLine set to "-javaagent:/home/jenkins/.m2/repository/org/jacoco/org.jacoco.agent/0.7.5.201505241946/org.jacoco.agent-0.7.5.201505241946-runtime.jar=destfile=<https://builds.apache.org/job/Qpid-BrokerForJava-TestMatrix/Ubuntu%20Slaves=ubuntu,jdk=JDK%201.8%20(latest),profile=java-bdb.0-9-1/ws/doc/java-perftests/target/jacoco.exec">
-Xmx512m
[INFO] 
[INFO] --- maven-resources-plugin:2.7:copy-resources (filter-docbook-sources) @ qpid-java-doc-perftests
---
[INFO] Using 'UTF-8' encoding to copy filtered resources.
[INFO] Copying 1 resource
[INFO] 
[INFO] --- maven-remote-resources-plugin:1.5:process (process-resource-bundles) @ qpid-java-doc-perftests
---
[INFO] 
[INFO] --- maven-resources-plugin:2.7:resources (default-resources) @ qpid-java-doc-perftests
---
[INFO] Using 'UTF-8' encoding to copy filtered resources.
[INFO] Copying 1 resource
[INFO] 
[INFO] --- maven-compiler-plugin:3.5.1:compile (default-compile) @ qpid-java-doc-perftests
---
[INFO] No sources to compile
[INFO] 
[INFO] --- maven-resources-plugin:2.7:testResources (default-testResources) @ qpid-java-doc-perftests
---
[INFO] Using 'UTF-8' encoding to copy filtered resources.
[INFO] Copying 1 resource
[INFO] 
[INFO] --- maven-compiler-plugin:3.5.1:testCompile (default-testCompile) @ qpid-java-doc-perftests
---
[INFO] No sources to compile
[INFO] 
[INFO] --- maven-surefire-plugin:2.19.1:test (default-test) @ qpid-java-doc-perftests ---
[INFO] Tests are skipped.
[INFO] 
[INFO] --- maven-jar-plugin:3.0.0:jar (default-jar) @ qpid-java-doc-perftests ---
[WARNING] JAR will be empty - no content was marked for inclusion!
[INFO] Building jar: <https://builds.apache.org/job/Qpid-BrokerForJava-TestMatrix/Ubuntu%20Slaves=ubuntu,jdk=JDK%201.8%20(latest),profile=java-bdb.0-9-1/ws/doc/java-perftests/target/qpid-java-doc-perftests-7.0.0-SNAPSHOT.jar>
[INFO] 
[INFO] --- maven-site-plugin:3.5.1:attach-descriptor (attach-descriptor) @ qpid-java-doc-perftests
---
[INFO] 
[INFO] --- maven-assembly-plugin:2.6:single (default) @ qpid-java-doc-perftests ---
[INFO] Assemblies have been skipped per configuration of the skipAssembly parameter.
[INFO] ------------------------------------------------------------------------
[INFO] Reactor Summary:
[INFO] 
[INFO] Apache Qpid Broker for Java ........................ SUCCESS [  2.130 s]
[INFO] Apache Qpid Broker Code Generation ................. SUCCESS [  1.961 s]
[INFO] Apache Qpid Test Utilities ......................... SUCCESS [  0.674 s]
[INFO] Apache Qpid Broker Core ............................ SUCCESS [ 12.725 s]
[INFO] Apache Qpid LogBack Logging Broker Plug-in ......... SUCCESS [  0.930 s]
[INFO] Apache Qpid Access Control Broker Plug-in .......... SUCCESS [  0.717 s]
[INFO] Apache Qpid AMQP 0-10 Protocol Plug-in ............. SUCCESS [  1.327 s]
[INFO] Apache Qpid AMQP 0-8 Protocol Broker Plug-in ....... SUCCESS [  1.247 s]
[INFO] Apache Qpid AMQP 1-0 Protocol Broker Plug-in ....... SUCCESS [  1.714 s]
[INFO] Apache Qpid AMQP 0-8 to 0-10 Message Conversion Broker Plug-in SUCCESS [  0.330 s]
[INFO] Apache Qpid AMQP 0-8 to 1-0 Message Conversion Broker Plug-in SUCCESS [  0.459 s]
[INFO] Apache Qpid AMQP 0-10 to 1-0 Message Conversion Broker Plug-in SUCCESS [  0.455 s]
[INFO] Apache Qpid JDBC Message Store Broker Plug-in ...... SUCCESS [  0.731 s]
[INFO] Apache Qpid Derby Message Store Broker Plug-in ..... SUCCESS [  0.728 s]
[INFO] Apache Qpid JDBC Message Store Connection Pooling Plug-in SUCCESS [  0.335 s]
[INFO] Apache Qpid AMQP 1.0 JDBC Link Store Plug-in ....... SUCCESS [  0.296 s]
[INFO] Apache Qpid HTTP Management Broker Plug-in ......... SUCCESS [  1.571 s]
[INFO] Apache Qpid AMQP Management Protocol Broker Plug-in  SUCCESS [  0.317 s]
[INFO] Apache Qpid Memory Message Store Broker Plug-in .... SUCCESS [  0.277 s]
[INFO] Apache Qpid WebSocket Broker Plug-in ............... SUCCESS [  0.464 s]
[INFO] Apache Qpid BDB Message Store Broker Plug-in ....... SUCCESS [  1.708 s]
[INFO] Apache Qpid AMQP 1.0 BDB Link Store Plug-in ........ SUCCESS [  0.309 s]
[INFO] Apache Qpid Broker for Java ........................ SUCCESS [  5.610 s]
[INFO] Apache Qpid Tools .................................. SUCCESS [  0.411 s]
[INFO] Apache Qpid System Test Parent ..................... SUCCESS [  1.074 s]
[INFO] Apache Qpid System Tests ........................... FAILURE [29:58 min]
[INFO] Apache Qpid System Test Utils ...................... SUCCESS [  0.949 s]
[INFO] Apache Qpid JMS 2.0 System Tests ................... SKIPPED
[INFO] Apache Qpid Protocol Tests for AMQP 1.0 ............ SUCCESS [01:01 min]
[INFO] Apache Qpid End to End Conversion Tests ............ SUCCESS [  2.172 s]
[INFO] Apache Qpid Performance Tests ...................... SUCCESS [  1.304 s]
[INFO] Apache Qpid Performance Test System Tests .......... SKIPPED
[INFO] Apache Qpid Performance Tests Visualisation JFC .... SUCCESS [  1.219 s]
[INFO] Apache Qpid BDB Store System Tests ................. SKIPPED
[INFO] Apache Qpid Joram JMS Tests ........................ SUCCESS [  0.224 s]
[INFO] Apache Qpid JMS TCK Configuration .................. SUCCESS [  0.189 s]
[INFO] Apache Qpid for Java Docbook ....................... SUCCESS [  0.038 s]
[INFO] Apache Qpid Broker for Java Docbook ................ SUCCESS [  0.387 s]
[INFO] Apache Qpid Performance Test Docbook ............... SUCCESS [  0.063 s]
[INFO] ------------------------------------------------------------------------
[INFO] BUILD FAILURE
[INFO] ------------------------------------------------------------------------
[INFO] Total time: 31:45 min
[INFO] Finished at: 2017-09-13T09:42:58Z
[INFO] Final Memory: 178M/7486M
[INFO] ------------------------------------------------------------------------
[ERROR] Failed to execute goal org.apache.maven.plugins:maven-surefire-plugin:2.19.1:test
(integration-test) on project qpid-systests: There are test failures.
[ERROR] 
[ERROR] Please refer to <https://builds.apache.org/job/Qpid-BrokerForJava-TestMatrix/Ubuntu%20Slaves=ubuntu,jdk=JDK%201.8%20(latest),profile=java-bdb.0-9-1/3887/artifact/systests/target/surefire-reports/java-bdb.0-9-1>
for the individual test results.
[ERROR] -> [Help 1]
[ERROR] 
[ERROR] To see the full stack trace of the errors, re-run Maven with the -e switch.
[ERROR] Re-run Maven using the -X switch to enable full debug logging.
[ERROR] 
[ERROR] For more information about the errors and possible solutions, please read the following
articles:
[ERROR] [Help 1] http://cwiki.apache.org/confluence/display/MAVEN/MojoFailureException
[ERROR] 
[ERROR] After correcting the problems, you can resume the build with the command
[ERROR]   mvn <goals> -rf :qpid-systests
Build step 'Invoke top-level Maven targets' marked build as failure
Archiving artifacts
Performing Post build task...
Match found for : : True
Logical operation result is TRUE
Running script  : echo Finishing build
date
[java-bdb.0-9-1] $ /bin/bash -xe /tmp/jenkins5334718043722849378.sh
+ echo Finishing build
Finishing build
+ date
Wed Sep 13 09:47:23 UTC 2017
POST BUILD TASK : SUCCESS
END OF POST BUILD TASK : 0
Recording test results

Mime
View raw message