qpid-notifications mailing list archives

Site index · List index
Message view « Date » · « Thread »
Top « Date » · « Thread »
From Apache Jenkins Server <jenk...@builds.apache.org>
Subject Build failed in Jenkins: Qpid-proton-c #1480
Date Wed, 27 Sep 2017 17:07:06 GMT
See <https://builds.apache.org/job/Qpid-proton-c/1480/display/redirect?page=changes>

Changes:

[jross] PROTON-1368: Remove the unused parser and scanner code

------------------------------------------
[...truncated 13.47 KB...]
[ 39%] Building C object proton-c/CMakeFiles/qpid-proton-core.dir/src/sasl/cyrus_sasl.c.o
[ 40%] Building C object proton-c/CMakeFiles/qpid-proton-core.dir/src/ssl/openssl.c.o
Linking C shared library libqpid-proton-core.so
[ 41%] Built target qpid-proton-core
Scanning dependencies of target qpid-proton-proactor
[ 42%] Building C object proton-c/CMakeFiles/qpid-proton-proactor.dir/src/proactor/epoll.c.o
[ 42%] Building C object proton-c/CMakeFiles/qpid-proton-proactor.dir/src/proactor/proactor-internal.c.o
Linking C shared library libqpid-proton-proactor.so
[ 42%] Built target qpid-proton-proactor
Scanning dependencies of target msgr-recv
[ 43%] Building C object tests/tools/apps/c/CMakeFiles/msgr-recv.dir/msgr-recv.c.o
[ 43%] Building C object tests/tools/apps/c/CMakeFiles/msgr-recv.dir/msgr-common.c.o
Linking C executable msgr-recv
[ 43%] Built target msgr-recv
Scanning dependencies of target msgr-send
[ 44%] Building C object tests/tools/apps/c/CMakeFiles/msgr-send.dir/msgr-send.c.o
[ 44%] Building C object tests/tools/apps/c/CMakeFiles/msgr-send.dir/msgr-common.c.o
Linking C executable msgr-send
[ 44%] Built target msgr-send
Scanning dependencies of target reactor-recv
[ 44%] Building C object tests/tools/apps/c/CMakeFiles/reactor-recv.dir/reactor-recv.c.o
[ 45%] Building C object tests/tools/apps/c/CMakeFiles/reactor-recv.dir/msgr-common.c.o
Linking C executable reactor-recv
[ 45%] Built target reactor-recv
Scanning dependencies of target reactor-send
[ 45%] Building C object tests/tools/apps/c/CMakeFiles/reactor-send.dir/reactor-send.c.o
[ 46%] Building C object tests/tools/apps/c/CMakeFiles/reactor-send.dir/msgr-common.c.o
Linking C executable reactor-send
[ 46%] Built target reactor-send
Scanning dependencies of target qpid-proton-cpp
[ 46%] Building CXX object proton-c/bindings/cpp/CMakeFiles/qpid-proton-cpp.dir/src/binary.cpp.o
[ 47%] Building CXX object proton-c/bindings/cpp/CMakeFiles/qpid-proton-cpp.dir/src/byte_array.cpp.o
[ 47%] Building CXX object proton-c/bindings/cpp/CMakeFiles/qpid-proton-cpp.dir/src/map.cpp.o
[ 48%] Building CXX object proton-c/bindings/cpp/CMakeFiles/qpid-proton-cpp.dir/src/connection.cpp.o
[ 48%] Building CXX object proton-c/bindings/cpp/CMakeFiles/qpid-proton-cpp.dir/src/connection_options.cpp.o
[ 49%] Building CXX object proton-c/bindings/cpp/CMakeFiles/qpid-proton-cpp.dir/src/container.cpp.o
[ 49%] Building CXX object proton-c/bindings/cpp/CMakeFiles/qpid-proton-cpp.dir/src/proactor_container_impl.cpp.o
[ 50%] Building CXX object proton-c/bindings/cpp/CMakeFiles/qpid-proton-cpp.dir/src/contexts.cpp.o
[ 51%] Building CXX object proton-c/bindings/cpp/CMakeFiles/qpid-proton-cpp.dir/src/data.cpp.o
[ 51%] Building CXX object proton-c/bindings/cpp/CMakeFiles/qpid-proton-cpp.dir/src/decimal.cpp.o
[ 52%] Building CXX object proton-c/bindings/cpp/CMakeFiles/qpid-proton-cpp.dir/src/decoder.cpp.o
[ 52%] Building CXX object proton-c/bindings/cpp/CMakeFiles/qpid-proton-cpp.dir/src/delivery.cpp.o
[ 53%] Building CXX object proton-c/bindings/cpp/CMakeFiles/qpid-proton-cpp.dir/src/duration.cpp.o
[ 53%] Building CXX object proton-c/bindings/cpp/CMakeFiles/qpid-proton-cpp.dir/src/encoder.cpp.o
[ 54%] Building CXX object proton-c/bindings/cpp/CMakeFiles/qpid-proton-cpp.dir/src/endpoint.cpp.o
[ 54%] Building CXX object proton-c/bindings/cpp/CMakeFiles/qpid-proton-cpp.dir/src/error.cpp.o
[ 55%] Building CXX object proton-c/bindings/cpp/CMakeFiles/qpid-proton-cpp.dir/src/error_condition.cpp.o
[ 55%] Building CXX object proton-c/bindings/cpp/CMakeFiles/qpid-proton-cpp.dir/src/handler.cpp.o
[ 56%] Building CXX object proton-c/bindings/cpp/CMakeFiles/qpid-proton-cpp.dir/src/io/connection_driver.cpp.o
[ 56%] Building CXX object proton-c/bindings/cpp/CMakeFiles/qpid-proton-cpp.dir/src/io/link_namer.cpp.o
[ 57%] Building CXX object proton-c/bindings/cpp/CMakeFiles/qpid-proton-cpp.dir/src/link.cpp.o
[ 57%] Building CXX object proton-c/bindings/cpp/CMakeFiles/qpid-proton-cpp.dir/src/listener.cpp.o
[ 58%] Building CXX object proton-c/bindings/cpp/CMakeFiles/qpid-proton-cpp.dir/src/message.cpp.o
[ 58%] Building CXX object proton-c/bindings/cpp/CMakeFiles/qpid-proton-cpp.dir/src/messaging_adapter.cpp.o
[ 59%] Building CXX object proton-c/bindings/cpp/CMakeFiles/qpid-proton-cpp.dir/src/node_options.cpp.o
[ 59%] Building CXX object proton-c/bindings/cpp/CMakeFiles/qpid-proton-cpp.dir/src/object.cpp.o
[ 60%] Building CXX object proton-c/bindings/cpp/CMakeFiles/qpid-proton-cpp.dir/src/proton_bits.cpp.o
[ 60%] Building CXX object proton-c/bindings/cpp/CMakeFiles/qpid-proton-cpp.dir/src/receiver.cpp.o
[ 61%] Building CXX object proton-c/bindings/cpp/CMakeFiles/qpid-proton-cpp.dir/src/receiver_options.cpp.o
[ 61%] Building CXX object proton-c/bindings/cpp/CMakeFiles/qpid-proton-cpp.dir/src/reconnect_options.cpp.o
[ 62%] Building CXX object proton-c/bindings/cpp/CMakeFiles/qpid-proton-cpp.dir/src/returned.cpp.o
[ 62%] Building CXX object proton-c/bindings/cpp/CMakeFiles/qpid-proton-cpp.dir/src/sasl.cpp.o
[ 63%] Building CXX object proton-c/bindings/cpp/CMakeFiles/qpid-proton-cpp.dir/src/scalar_base.cpp.o
[ 63%] Building CXX object proton-c/bindings/cpp/CMakeFiles/qpid-proton-cpp.dir/src/sender.cpp.o
[ 64%] Building CXX object proton-c/bindings/cpp/CMakeFiles/qpid-proton-cpp.dir/src/sender_options.cpp.o
[ 64%] Building CXX object proton-c/bindings/cpp/CMakeFiles/qpid-proton-cpp.dir/src/session.cpp.o
[ 65%] Building CXX object proton-c/bindings/cpp/CMakeFiles/qpid-proton-cpp.dir/src/session_options.cpp.o
[ 65%] Building CXX object proton-c/bindings/cpp/CMakeFiles/qpid-proton-cpp.dir/src/source.cpp.o
[ 66%] Building CXX object proton-c/bindings/cpp/CMakeFiles/qpid-proton-cpp.dir/src/ssl.cpp.o
[ 66%] Building CXX object proton-c/bindings/cpp/CMakeFiles/qpid-proton-cpp.dir/src/ssl_domain.cpp.o
[ 67%] Building CXX object proton-c/bindings/cpp/CMakeFiles/qpid-proton-cpp.dir/src/target.cpp.o
[ 68%] Building CXX object proton-c/bindings/cpp/CMakeFiles/qpid-proton-cpp.dir/src/terminus.cpp.o
[ 68%] Building CXX object proton-c/bindings/cpp/CMakeFiles/qpid-proton-cpp.dir/src/timestamp.cpp.o
[ 69%] Building CXX object proton-c/bindings/cpp/CMakeFiles/qpid-proton-cpp.dir/src/tracker.cpp.o
[ 69%] Building CXX object proton-c/bindings/cpp/CMakeFiles/qpid-proton-cpp.dir/src/transfer.cpp.o
[ 70%] Building CXX object proton-c/bindings/cpp/CMakeFiles/qpid-proton-cpp.dir/src/transport.cpp.o
[ 70%] Building CXX object proton-c/bindings/cpp/CMakeFiles/qpid-proton-cpp.dir/src/type_id.cpp.o
[ 71%] Building CXX object proton-c/bindings/cpp/CMakeFiles/qpid-proton-cpp.dir/src/url.cpp.o
[ 71%] Building CXX object proton-c/bindings/cpp/CMakeFiles/qpid-proton-cpp.dir/src/uuid.cpp.o
[ 72%] Building CXX object proton-c/bindings/cpp/CMakeFiles/qpid-proton-cpp.dir/src/value.cpp.o
[ 72%] Building CXX object proton-c/bindings/cpp/CMakeFiles/qpid-proton-cpp.dir/src/work_queue.cpp.o
Linking CXX shared library libqpid-proton-cpp.so
[ 72%] Built target qpid-proton-cpp
Scanning dependencies of target codec_test
[ 72%] Building CXX object proton-c/bindings/cpp/CMakeFiles/codec_test.dir/src/codec_test.cpp.o
Linking CXX executable codec_test
[ 72%] Built target codec_test
Scanning dependencies of target connection_driver_test
[ 73%] Building CXX object proton-c/bindings/cpp/CMakeFiles/connection_driver_test.dir/src/connection_driver_test.cpp.o
Linking CXX executable connection_driver_test
[ 73%] Built target connection_driver_test
Scanning dependencies of target container_test
[ 74%] Building CXX object proton-c/bindings/cpp/CMakeFiles/container_test.dir/src/container_test.cpp.o
Linking CXX executable container_test
[ 74%] Built target container_test
Scanning dependencies of target interop_test
[ 75%] Building CXX object proton-c/bindings/cpp/CMakeFiles/interop_test.dir/src/interop_test.cpp.o
Linking CXX executable interop_test
[ 75%] Built target interop_test
Scanning dependencies of target map_test
[ 75%] Building CXX object proton-c/bindings/cpp/CMakeFiles/map_test.dir/src/map_test.cpp.o
Linking CXX executable map_test
[ 75%] Built target map_test
Scanning dependencies of target message_test
[ 75%] Building CXX object proton-c/bindings/cpp/CMakeFiles/message_test.dir/src/message_test.cpp.o
Linking CXX executable message_test
[ 75%] Built target message_test
Scanning dependencies of target reconnect_test
[ 75%] Building CXX object proton-c/bindings/cpp/CMakeFiles/reconnect_test.dir/src/reconnect_test.cpp.o
Linking CXX executable reconnect_test
[ 75%] Built target reconnect_test
Scanning dependencies of target scalar_test
[ 76%] Building CXX object proton-c/bindings/cpp/CMakeFiles/scalar_test.dir/src/scalar_test.cpp.o
Linking CXX executable scalar_test
[ 76%] Built target scalar_test
Scanning dependencies of target url_test
[ 77%] Building CXX object proton-c/bindings/cpp/CMakeFiles/url_test.dir/src/url_test.cpp.o
Linking CXX executable url_test
[ 77%] Built target url_test
Scanning dependencies of target value_test
[ 78%] Building CXX object proton-c/bindings/cpp/CMakeFiles/value_test.dir/src/value_test.cpp.o
Linking CXX executable value_test
[ 78%] Built target value_test
Scanning dependencies of target reactor_send_cpp
[ 78%] Building CXX object tests/tools/apps/cpp/CMakeFiles/reactor_send_cpp.dir/reactor_send.cpp.o
Linking CXX executable reactor_send_cpp
[ 78%] Built target reactor_send_cpp
Scanning dependencies of target go-build
[ 78%] Built target go-build
[ 78%] Swig source
Scanning dependencies of target _cproton
[ 79%] Building C object proton-c/bindings/python/CMakeFiles/_cproton.dir/cprotonPYTHON_wrap.c.o
Linking C shared module _cproton.so
[ 79%] Built target _cproton
Scanning dependencies of target py_src_dist
[ 79%] Built target py_src_dist
[ 79%] Swig source
Scanning dependencies of target cproton-ruby
[ 80%] Building C object proton-c/bindings/ruby/CMakeFiles/cproton-ruby.dir/rubyRUBY_wrap.c.o
Linking C shared module cproton.so
[ 80%] Built target cproton-ruby
[ 80%] Swig source
Scanning dependencies of target cproton_perl
[ 81%] Building C object proton-c/bindings/perl/CMakeFiles/cproton_perl.dir/perlPERL_wrap.c.o
Linking C shared module cproton_perl.so
[ 81%] Built target cproton_perl
Scanning dependencies of target c-condition-tests
[ 81%] Building C object proton-c/src/tests/CMakeFiles/c-condition-tests.dir/condition.c.o
Linking C executable c-condition-tests
[ 81%] Built target c-condition-tests
Scanning dependencies of target c-connection-driver-tests
[ 82%] Building C object proton-c/src/tests/CMakeFiles/c-connection-driver-tests.dir/connection_driver.c.o
Linking C executable c-connection-driver-tests
[ 82%] Built target c-connection-driver-tests
Scanning dependencies of target c-data-tests
[ 82%] Building C object proton-c/src/tests/CMakeFiles/c-data-tests.dir/data.c.o
Linking C executable c-data-tests
[ 82%] Built target c-data-tests
Scanning dependencies of target c-engine-tests
[ 82%] Building C object proton-c/src/tests/CMakeFiles/c-engine-tests.dir/engine.c.o
Linking C executable c-engine-tests
[ 82%] Built target c-engine-tests
Scanning dependencies of target c-event-tests
[ 83%] Building C object proton-c/src/tests/CMakeFiles/c-event-tests.dir/event.c.o
Linking C executable c-event-tests
[ 83%] Built target c-event-tests
Scanning dependencies of target c-message-tests
[ 83%] Building C object proton-c/src/tests/CMakeFiles/c-message-tests.dir/message.c.o
Linking C executable c-message-tests
[ 83%] Built target c-message-tests
Scanning dependencies of target c-object-tests
[ 84%] Building C object proton-c/src/tests/CMakeFiles/c-object-tests.dir/object.c.o
Linking C executable c-object-tests
[ 84%] Built target c-object-tests
Scanning dependencies of target c-parse-url-tests
[ 84%] Building C object proton-c/src/tests/CMakeFiles/c-parse-url-tests.dir/parse-url.c.o
Linking C executable c-parse-url-tests
[ 84%] Built target c-parse-url-tests
Scanning dependencies of target c-proactor-tests
[ 85%] Building C object proton-c/src/tests/CMakeFiles/c-proactor-tests.dir/proactor.c.o
Linking C executable c-proactor-tests
[ 85%] Built target c-proactor-tests
Scanning dependencies of target c-reactor-tests
[ 85%] Building C object proton-c/src/tests/CMakeFiles/c-reactor-tests.dir/reactor.c.o
Linking C executable c-reactor-tests
[ 85%] Built target c-reactor-tests
Scanning dependencies of target c-refcount-tests
[ 85%] Building C object proton-c/src/tests/CMakeFiles/c-refcount-tests.dir/refcount.c.o
Linking C executable c-refcount-tests
[ 85%] Built target c-refcount-tests
Scanning dependencies of target c-broker
[ 86%] Building C object examples/c/CMakeFiles/c-broker.dir/broker.c.o
Linking C executable broker
[ 86%] Built target c-broker
Scanning dependencies of target c-direct
[ 87%] Building C object examples/c/CMakeFiles/c-direct.dir/direct.c.o
Linking C executable direct
[ 87%] Built target c-direct
Scanning dependencies of target c-receive
[ 88%] Building C object examples/c/CMakeFiles/c-receive.dir/receive.c.o
Linking C executable receive
[ 88%] Built target c-receive
Scanning dependencies of target c-send
[ 89%] Building C object examples/c/CMakeFiles/c-send.dir/send.c.o
Linking C executable send
[ 89%] Built target c-send
Scanning dependencies of target c-send-abort
[ 89%] Building C object examples/c/CMakeFiles/c-send-abort.dir/send-abort.c.o
Linking C executable send-abort
[ 89%] Built target c-send-abort
Scanning dependencies of target go_example_electron_broker
[ 89%] Built target go_example_electron_broker
Scanning dependencies of target go_example_electron_receive
[ 89%] Built target go_example_electron_receive
Scanning dependencies of target go_example_electron_send
[ 89%] Built target go_example_electron_send
Scanning dependencies of target go_example_proton_broker
[ 89%] Built target go_example_proton_broker
Scanning dependencies of target go_example_test
# testmain
runtime.raceinit: __tsan_init: not defined
runtime.raceinit: __tsan_map_shadow: not defined
runtime.racefini: __tsan_fini: not defined
runtime.racemapshadow: __tsan_map_shadow: not defined
runtime.racemalloc: __tsan_malloc: not defined
runtime.racegostart: __tsan_go_start: not defined
runtime.racegoend: __tsan_go_end: not defined
runtime.raceacquireg: __tsan_acquire: not defined
runtime.racereleaseg: __tsan_release: not defined
runtime.racereleasemergeg: __tsan_release_merge: not defined
runtime.racefingo: __tsan_finalizer_goroutine: not defined
runtime.RaceDisable: __tsan_go_ignore_sync_begin: not defined
runtime.RaceEnable: __tsan_go_ignore_sync_end: not defined
runtime.raceread: __tsan_read: not defined
runtime.racereadpc: __tsan_read_pc: not defined
runtime.racewrite: __tsan_write: not defined
runtime.racewritepc: __tsan_write_pc: not defined
runtime.racereadrange: __tsan_read_range: not defined
runtime.racereadrangepc1: __tsan_read_range: not defined
runtime.racewriterange: __tsan_write_range: not defined
runtime.racewriterangepc1: __tsan_write_range: not defined
/usr/lib/go/pkg/tool/linux_amd64/link: too many errors
make[2]: *** [examples/go/CMakeFiles/go_example_test] Error 2
make[1]: *** [examples/go/CMakeFiles/go_example_test.dir/all] Error 2
make: *** [all] Error 2
Build step 'Execute shell' marked build as failure
Recording test results
ERROR: Step ‘Publish JUnit test result report’ failed: No test report files were found.
Configuration error?


Mime
View raw message