qpid-notifications mailing list archives

Site index · List index
Message view « Date » · « Thread »
Top « Date » · « Thread »
From Apache Jenkins Server <jenk...@builds.apache.org>
Subject Build failed in Jenkins: Qpid-BrokerForJava-JoramJMSTest » ubuntu,JDK 1.8.0_102,qpid-jms-client #1310
Date Fri, 11 Aug 2017 14:16:30 GMT
See <https://builds.apache.org/job/Qpid-BrokerForJava-JoramJMSTest/Ubuntu%20Slaves=ubuntu,jdk=JDK%201.8.0_102,qpid.joramtests=qpid-jms-client/1310/display/redirect?page=changes>

Changes:

[lquack] QPID-7434: [Java Broker] Improve handling of empty map/stream messages.

[lquack] QPID-7434: [Java Broker] Improve AMQP 0-x to Internal conversion and add

[lquack] QPID-7434: [Java Broker] Improve Internal to AMQP 0-x message conversion

------------------------------------------
[...truncated 323.85 KB...]
[INFO] Executing tasks

main:
     [echo] Qpid Test Profile Properties
     [echo] [profile] java-mms.0-10
     [echo] [profile.broker.language] java
     [echo] [profile.broker.type] internal
     [echo] [profile.broker.command] "<https://builds.apache.org/job/Qpid-BrokerForJava-JoramJMSTest/Ubuntu%20Slaves=ubuntu,jdk=JDK%201.8.0_102,qpid.joramtests=qpid-jms-client/ws/doc/java-broker/bin/qpid-server">
-sp "@STORE_PATH" -st @STORE_TYPE -prop test.port=@PORT -prop "qpid.work_dir=@QPID_WORK"
     [echo] [profile.specific.excludes] JavaTransientExcludes Java010Excludes
     [echo] [profile.test.excludes] Excludes JavaExcludes java-mms.0-10.excludes JavaTransientExcludes
Java010Excludes
     [echo] [profile.broker.version] v0_10
     [echo] [profile.test.amqp_port_protocols] ["AMQP_0_8","AMQP_0_9","AMQP_0_9_1","AMQP_0_10"]
     [echo] [profile.broker.persistent] false
     [echo] [profile.virtualhostnode.type] Memory
     [echo] [profile.virtualhostnode.context.blueprint] {"type":"ProvidedStore","globalAddressDomains":"${qpid.globalAddressDomains}"}
     [echo] [profile.test_receive_timeout] 1000
[INFO] Executed tasks
[INFO] 
[INFO] --- maven-enforcer-plugin:1.4.1:enforce (enforce-minimum-versions) @ qpid-java-doc-broker
---
[INFO] 
[INFO] --- maven-enforcer-plugin:1.4.1:enforce (enforce-versions-standard-properties) @ qpid-java-doc-broker
---
[INFO] 
[INFO] --- maven-enforcer-plugin:1.4.1:enforce (enforce-enableAmqp10) @ qpid-java-doc-broker
---
[INFO] 
[INFO] --- jacoco-maven-plugin:0.7.5.201505241946:prepare-agent (default-prepare-agent) @
qpid-java-doc-broker ---
[INFO] argLine set to "-javaagent:/home/jenkins/.m2/repository/org/jacoco/org.jacoco.agent/0.7.5.201505241946/org.jacoco.agent-0.7.5.201505241946-runtime.jar=destfile=<https://builds.apache.org/job/Qpid-BrokerForJava-JoramJMSTest/Ubuntu%20Slaves=ubuntu,jdk=JDK%201.8.0_102,qpid.joramtests=qpid-jms-client/ws/doc/java-broker/target/jacoco.exec">
-Xmx512m
[INFO] 
[INFO] --- maven-resources-plugin:2.7:copy-resources (filter-docbook-sources) @ qpid-java-doc-broker
---
[INFO] Using 'UTF-8' encoding to copy filtered resources.
[INFO] Copying 77 resources
[INFO] 
[INFO] --- maven-remote-resources-plugin:1.5:process (process-resource-bundles) @ qpid-java-doc-broker
---
[INFO] 
[INFO] --- maven-resources-plugin:2.7:resources (default-resources) @ qpid-java-doc-broker
---
[INFO] Using 'UTF-8' encoding to copy filtered resources.
[INFO] Copying 77 resources
[INFO] 
[INFO] --- maven-compiler-plugin:3.5.1:compile (default-compile) @ qpid-java-doc-broker ---
[INFO] No sources to compile
[INFO] 
[INFO] --- maven-resources-plugin:2.7:testResources (default-testResources) @ qpid-java-doc-broker
---
[INFO] Using 'UTF-8' encoding to copy filtered resources.
[INFO] Copying 77 resources
[INFO] 
[INFO] --- maven-compiler-plugin:3.5.1:testCompile (default-testCompile) @ qpid-java-doc-broker
---
[INFO] No sources to compile
[INFO] 
[INFO] --- maven-surefire-plugin:2.19.1:test (default-test) @ qpid-java-doc-broker ---
[INFO] Tests are skipped.
[INFO] 
[INFO] --- maven-jar-plugin:3.0.0:jar (default-jar) @ qpid-java-doc-broker ---
[WARNING] JAR will be empty - no content was marked for inclusion!
[INFO] Building jar: <https://builds.apache.org/job/Qpid-BrokerForJava-JoramJMSTest/Ubuntu%20Slaves=ubuntu,jdk=JDK%201.8.0_102,qpid.joramtests=qpid-jms-client/ws/doc/java-broker/target/qpid-java-doc-broker-7.0.0-SNAPSHOT.jar>
[INFO] 
[INFO] --- maven-site-plugin:3.5.1:attach-descriptor (attach-descriptor) @ qpid-java-doc-broker
---
[INFO] 
[INFO] --- maven-assembly-plugin:2.6:single (default) @ qpid-java-doc-broker ---
[INFO] Assemblies have been skipped per configuration of the skipAssembly parameter.
[INFO] 
[INFO] ------------------------------------------------------------------------
[INFO] Building Apache Qpid Performance Test Docbook 7.0.0-SNAPSHOT
[INFO] ------------------------------------------------------------------------
[INFO] 
[INFO] --- maven-clean-plugin:3.0.0:clean (default-clean) @ qpid-java-doc-perftests ---
[INFO] 
[INFO] --- maven-antrun-plugin:1.8:run (output-test-properties) @ qpid-java-doc-perftests
---
[INFO] Executing tasks

main:
     [echo] Qpid Test Profile Properties
     [echo] [profile] java-mms.0-10
     [echo] [profile.broker.language] java
     [echo] [profile.broker.type] internal
     [echo] [profile.broker.command] "<https://builds.apache.org/job/Qpid-BrokerForJava-JoramJMSTest/Ubuntu%20Slaves=ubuntu,jdk=JDK%201.8.0_102,qpid.joramtests=qpid-jms-client/ws/doc/java-perftests/bin/qpid-server">
-sp "@STORE_PATH" -st @STORE_TYPE -prop test.port=@PORT -prop "qpid.work_dir=@QPID_WORK"
     [echo] [profile.specific.excludes] JavaTransientExcludes Java010Excludes
     [echo] [profile.test.excludes] Excludes JavaExcludes java-mms.0-10.excludes JavaTransientExcludes
Java010Excludes
     [echo] [profile.broker.version] v0_10
     [echo] [profile.test.amqp_port_protocols] ["AMQP_0_8","AMQP_0_9","AMQP_0_9_1","AMQP_0_10"]
     [echo] [profile.broker.persistent] false
     [echo] [profile.virtualhostnode.type] Memory
     [echo] [profile.virtualhostnode.context.blueprint] {"type":"ProvidedStore","globalAddressDomains":"${qpid.globalAddressDomains}"}
     [echo] [profile.test_receive_timeout] 1000
[INFO] Executed tasks
[INFO] 
[INFO] --- maven-enforcer-plugin:1.4.1:enforce (enforce-minimum-versions) @ qpid-java-doc-perftests
---
[INFO] 
[INFO] --- maven-enforcer-plugin:1.4.1:enforce (enforce-versions-standard-properties) @ qpid-java-doc-perftests
---
[INFO] 
[INFO] --- maven-enforcer-plugin:1.4.1:enforce (enforce-enableAmqp10) @ qpid-java-doc-perftests
---
[INFO] 
[INFO] --- jacoco-maven-plugin:0.7.5.201505241946:prepare-agent (default-prepare-agent) @
qpid-java-doc-perftests ---
[INFO] argLine set to "-javaagent:/home/jenkins/.m2/repository/org/jacoco/org.jacoco.agent/0.7.5.201505241946/org.jacoco.agent-0.7.5.201505241946-runtime.jar=destfile=<https://builds.apache.org/job/Qpid-BrokerForJava-JoramJMSTest/Ubuntu%20Slaves=ubuntu,jdk=JDK%201.8.0_102,qpid.joramtests=qpid-jms-client/ws/doc/java-perftests/target/jacoco.exec">
-Xmx512m
[INFO] 
[INFO] --- maven-resources-plugin:2.7:copy-resources (filter-docbook-sources) @ qpid-java-doc-perftests
---
[INFO] Using 'UTF-8' encoding to copy filtered resources.
[INFO] Copying 1 resource
[INFO] 
[INFO] --- maven-remote-resources-plugin:1.5:process (process-resource-bundles) @ qpid-java-doc-perftests
---
[INFO] 
[INFO] --- maven-resources-plugin:2.7:resources (default-resources) @ qpid-java-doc-perftests
---
[INFO] Using 'UTF-8' encoding to copy filtered resources.
[INFO] Copying 1 resource
[INFO] 
[INFO] --- maven-compiler-plugin:3.5.1:compile (default-compile) @ qpid-java-doc-perftests
---
[INFO] No sources to compile
[INFO] 
[INFO] --- maven-resources-plugin:2.7:testResources (default-testResources) @ qpid-java-doc-perftests
---
[INFO] Using 'UTF-8' encoding to copy filtered resources.
[INFO] Copying 1 resource
[INFO] 
[INFO] --- maven-compiler-plugin:3.5.1:testCompile (default-testCompile) @ qpid-java-doc-perftests
---
[INFO] No sources to compile
[INFO] 
[INFO] --- maven-surefire-plugin:2.19.1:test (default-test) @ qpid-java-doc-perftests ---
[INFO] Tests are skipped.
[INFO] 
[INFO] --- maven-jar-plugin:3.0.0:jar (default-jar) @ qpid-java-doc-perftests ---
[WARNING] JAR will be empty - no content was marked for inclusion!
[INFO] Building jar: <https://builds.apache.org/job/Qpid-BrokerForJava-JoramJMSTest/Ubuntu%20Slaves=ubuntu,jdk=JDK%201.8.0_102,qpid.joramtests=qpid-jms-client/ws/doc/java-perftests/target/qpid-java-doc-perftests-7.0.0-SNAPSHOT.jar>
[INFO] 
[INFO] --- maven-site-plugin:3.5.1:attach-descriptor (attach-descriptor) @ qpid-java-doc-perftests
---
[INFO] 
[INFO] --- maven-assembly-plugin:2.6:single (default) @ qpid-java-doc-perftests ---
[INFO] Assemblies have been skipped per configuration of the skipAssembly parameter.
[INFO] ------------------------------------------------------------------------
[INFO] Reactor Summary:
[INFO] 
[INFO] Apache Qpid Broker for Java ........................ SUCCESS [  3.136 s]
[INFO] Apache Qpid Broker Code Generation ................. SUCCESS [  2.741 s]
[INFO] Apache Qpid Test Utilities ......................... SUCCESS [  0.957 s]
[INFO] Apache Qpid Broker Core ............................ SUCCESS [ 17.791 s]
[INFO] Apache Qpid LogBack Logging Broker Plug-in ......... SUCCESS [  1.121 s]
[INFO] Apache Qpid Access Control Broker Plug-in .......... SUCCESS [  0.914 s]
[INFO] Apache Qpid AMQP 0-10 Protocol Plug-in ............. SUCCESS [  2.506 s]
[INFO] Apache Qpid AMQP 0-8 Protocol Broker Plug-in ....... SUCCESS [  1.402 s]
[INFO] Apache Qpid AMQP 1-0 Protocol Broker Plug-in ....... SUCCESS [  2.299 s]
[INFO] Apache Qpid AMQP 0-8 to 0-10 Message Conversion Broker Plug-in SUCCESS [  0.391 s]
[INFO] Apache Qpid AMQP 0-8 to 1-0 Message Conversion Broker Plug-in SUCCESS [  0.506 s]
[INFO] Apache Qpid AMQP 0-10 to 1-0 Message Conversion Broker Plug-in SUCCESS [  0.478 s]
[INFO] Apache Qpid JDBC Message Store Broker Plug-in ...... SUCCESS [  0.933 s]
[INFO] Apache Qpid Derby Message Store Broker Plug-in ..... SUCCESS [  0.974 s]
[INFO] Apache Qpid JDBC Message Store Connection Pooling Plug-in SUCCESS [  0.498 s]
[INFO] Apache Qpid AMQP 1.0 JDBC Link Store Plug-in ....... SUCCESS [  0.331 s]
[INFO] Apache Qpid HTTP Management Broker Plug-in ......... SUCCESS [  1.719 s]
[INFO] Apache Qpid AMQP Management Protocol Broker Plug-in  SUCCESS [  0.410 s]
[INFO] Apache Qpid Memory Message Store Broker Plug-in .... SUCCESS [  0.318 s]
[INFO] Apache Qpid WebSocket Broker Plug-in ............... SUCCESS [  0.494 s]
[INFO] Apache Qpid BDB Message Store Broker Plug-in ....... SUCCESS [  1.713 s]
[INFO] Apache Qpid AMQP 1.0 BDB Link Store Plug-in ........ SUCCESS [  0.305 s]
[INFO] Apache Qpid Broker for Java ........................ FAILURE [  3.734 s]
[INFO] Apache Qpid Tools .................................. SUCCESS [  0.701 s]
[INFO] Apache Qpid System Test Parent ..................... SUCCESS [  1.457 s]
[INFO] Apache Qpid System Tests ........................... SKIPPED
[INFO] Apache Qpid JMS 2.0 System Tests ................... SKIPPED
[INFO] Apache Qpid Protocol Tests for AMQP 1.0 ............ SUCCESS [  4.043 s]
[INFO] Apache Qpid Performance Tests ...................... SUCCESS [  1.490 s]
[INFO] Apache Qpid Performance Test System Tests .......... SKIPPED
[INFO] Apache Qpid Performance Tests Visualisation JFC .... SUCCESS [  1.358 s]
[INFO] Apache Qpid BDB Store System Tests ................. SKIPPED
[INFO] Apache Qpid Joram JMS Tests ........................ SUCCESS [  1.027 s]
[INFO] Apache Qpid JMS TCK Configuration .................. SUCCESS [  0.222 s]
[INFO] Apache Qpid for Java Docbook ....................... SUCCESS [  0.031 s]
[INFO] Apache Qpid Broker for Java Docbook ................ SUCCESS [  0.789 s]
[INFO] Apache Qpid Performance Test Docbook ............... SUCCESS [  0.105 s]
[INFO] ------------------------------------------------------------------------
[INFO] BUILD FAILURE
[INFO] ------------------------------------------------------------------------
[INFO] Total time: 58.090 s
[INFO] Finished at: 2017-08-11T14:16:28Z
[INFO] Final Memory: 144M/5513M
[INFO] ------------------------------------------------------------------------
[ERROR] Failed to execute goal org.apache.maven.plugins:maven-assembly-plugin:2.6:single (make-assembly)
on project qpid-broker: Failed to create assembly: Error creating assembly archive bin: Problem
creating zip: Execution exception: java.io.IOException: Permission denied -> [Help 1]
[ERROR] 
[ERROR] To see the full stack trace of the errors, re-run Maven with the -e switch.
[ERROR] Re-run Maven using the -X switch to enable full debug logging.
[ERROR] 
[ERROR] For more information about the errors and possible solutions, please read the following
articles:
[ERROR] [Help 1] http://cwiki.apache.org/confluence/display/MAVEN/MojoExecutionException
[ERROR] 
[ERROR] After correcting the problems, you can resume the build with the command
[ERROR]   mvn <goals> -rf :qpid-broker
Build step 'Invoke top-level Maven targets' marked build as failure
Performing Post build task...
Match found for : : True
Logical operation result is TRUE
Running script  : #!/bin/bash -x

if [[ "${BROKER_PID}" ]]
then
  echo Killing broker "${BROKER_PID}"
  kill -15 "${BROKER_PID}"
fi
FATAL: Unable to produce a script file
java.io.IOException: Permission denied
	at java.io.UnixFileSystem.createFileExclusively(Native Method)
	at java.io.File.createTempFile(File.java:2024)
	at hudson.FilePath$17.invoke(FilePath.java:1373)
	at hudson.FilePath$17.invoke(FilePath.java:1363)
	at hudson.FilePath$FileCallableWrapper.call(FilePath.java:2739)
	at hudson.remoting.UserRequest.perform(UserRequest.java:153)
	at hudson.remoting.UserRequest.perform(UserRequest.java:50)
	at hudson.remoting.Request$2.run(Request.java:336)
	at hudson.remoting.InterceptingExecutorService$1.call(InterceptingExecutorService.java:68)
	at java.util.concurrent.FutureTask.run(FutureTask.java:266)
	at java.util.concurrent.ThreadPoolExecutor.runWorker(ThreadPoolExecutor.java:1142)
	at java.util.concurrent.ThreadPoolExecutor$Worker.run(ThreadPoolExecutor.java:617)
	at java.lang.Thread.run(Thread.java:748)
Caused: java.io.IOException: Failed to create a temporary directory in /tmp
	at hudson.FilePath$17.invoke(FilePath.java:1375)
	at hudson.FilePath$17.invoke(FilePath.java:1363)
	at hudson.FilePath$FileCallableWrapper.call(FilePath.java:2739)
	at hudson.remoting.UserRequest.perform(UserRequest.java:153)
	at hudson.remoting.UserRequest.perform(UserRequest.java:50)
	at hudson.remoting.Request$2.run(Request.java:336)
	at hudson.remoting.InterceptingExecutorService$1.call(InterceptingExecutorService.java:68)
	at java.util.concurrent.FutureTask.run(FutureTask.java:266)
	at java.util.concurrent.ThreadPoolExecutor.runWorker(ThreadPoolExecutor.java:1142)
	at java.util.concurrent.ThreadPoolExecutor$Worker.run(ThreadPoolExecutor.java:617)
	at java.lang.Thread.run(Thread.java:748)
	at ......remote call to H21(Native Method)
	at hudson.remoting.Channel.attachCallSiteStackTrace(Channel.java:1545)
	at hudson.remoting.UserResponse.retrieve(UserRequest.java:253)
	at hudson.remoting.Channel.call(Channel.java:830)
	at hudson.FilePath.act(FilePath.java:986)
Caused: java.io.IOException: remote file operation failed: <https://builds.apache.org/job/Qpid-BrokerForJava-JoramJMSTest/Ubuntu%20Slaves=ubuntu,jdk=JDK%201.8.0_102,qpid.joramtests=qpid-jms-client/ws/>
at hudson.remoting.Channel@4b715ff3:H21
	at hudson.FilePath.act(FilePath.java:993)
	at hudson.FilePath.act(FilePath.java:975)
	at hudson.FilePath.createTextTempFile(FilePath.java:1363)
Caused: java.io.IOException: Failed to create a temp file on <https://builds.apache.org/job/Qpid-BrokerForJava-JoramJMSTest/Ubuntu%20Slaves=ubuntu,jdk=JDK%201.8.0_102,qpid.joramtests=qpid-jms-client/ws/>
	at hudson.FilePath.createTextTempFile(FilePath.java:1386)
	at hudson.tasks.CommandInterpreter.createScriptFile(CommandInterpreter.java:162)
	at hudson.tasks.CommandInterpreter.perform(CommandInterpreter.java:94)
	at hudson.tasks.CommandInterpreter.perform(CommandInterpreter.java:66)
	at hudson.plugins.postbuildtask.PostbuildTask.perform(PostbuildTask.java:123)
	at hudson.tasks.BuildStepMonitor$1.perform(BuildStepMonitor.java:20)
	at hudson.model.AbstractBuild$AbstractBuildExecution.perform(AbstractBuild.java:735)
	at hudson.model.AbstractBuild$AbstractBuildExecution.performAllBuildSteps(AbstractBuild.java:676)
	at hudson.model.Build$BuildExecution.post2(Build.java:186)
	at hudson.model.AbstractBuild$AbstractBuildExecution.post(AbstractBuild.java:621)
	at hudson.model.Run.execute(Run.java:1760)
	at hudson.matrix.MatrixRun.run(MatrixRun.java:146)
	at hudson.model.ResourceController.execute(ResourceController.java:97)
	at hudson.model.Executor.run(Executor.java:405)
POST BUILD TASK : FAILURE
END OF POST BUILD TASK : 0
Archiving artifacts
Recording test results
ERROR: Step ?Publish JUnit test result report? failed: No test report files were found. Configuration
error?


Mime
View raw message